hadoop-yarn-dev mailing list archives

Site index · List index
Message view « Date » · « Thread »
Top « Date » · « Thread »
From Apache Jenkins Server <jenk...@builds.apache.org>
Subject Failed: YARN-2740 PreCommit Build #7444
Date Wed, 22 Apr 2015 13:11:29 GMT
Jira: https://issues.apache.org/jira/browse/YARN-2740
Build: https://builds.apache.org/job/PreCommit-YARN-Build/7444/

###################################################################################
########################## LAST 60 LINES OF THE CONSOLE ###########################
[...truncated 352 lines...]
|  +1  |    eclipse:eclipse  |  0m 32s    | The patch built with 
|      |                     |            | eclipse:eclipse.
|  +1  |           findbugs  |  4m 0s     | The patch does not introduce any 
|      |                     |            | new Findbugs (version 2.0.3)
|      |                     |            | warnings.
|  +1  |         yarn tests  |  0m 23s    | Tests passed in hadoop-yarn-api. 
|  +1  |         yarn tests  |  2m 0s     | Tests passed in hadoop-yarn-common. 
|  -1  |         yarn tests  |  54m 14s   | Tests failed in 
|      |                     |            | hadoop-yarn-server-resourcemanager.
|      |                     |  100m 10s  | 


             Reason | Tests
 Failed unit tests  |  hadoop.yarn.server.resourcemanager.applicationsmanager.TestAMRestart



|| Subsystem || Report/Notes ||
============================================================================
| Patch URL | http://issues.apache.org/jira/secure/attachment/12727201/YARN-2740.20150422-2.patch
|
| Optional Tests | javadoc javac unit findbugs checkstyle |
| git revision | trunk / b08908a |
| whitespace | /home/jenkins/jenkins-slave/workspace/PreCommit-YARN-Build/../patchprocess/whitespace.txt
|
| checkstyle | /home/jenkins/jenkins-slave/workspace/PreCommit-YARN-Build/../patchprocess/checkstyle-result-diff.txt
|
| hadoop-yarn-api test log | /home/jenkins/jenkins-slave/workspace/PreCommit-YARN-Build/../patchprocess/testrun_hadoop-yarn-api.txt
|
| hadoop-yarn-common test log | /home/jenkins/jenkins-slave/workspace/PreCommit-YARN-Build/../patchprocess/testrun_hadoop-yarn-common.txt
|
| hadoop-yarn-server-resourcemanager test log | /home/jenkins/jenkins-slave/workspace/PreCommit-YARN-Build/../patchprocess/testrun_hadoop-yarn-server-resourcemanager.txt
|
| Test Results | https://builds.apache.org/job/PreCommit-YARN-Build/7444/testReport/ |


============================================================================
============================================================================
                          Adding comment to JIRA
============================================================================
============================================================================


Comment added.
0f5aaec71c3eaa2b00967558afab211f3672e937 logged out


============================================================================
============================================================================
                              Finished build.
============================================================================
============================================================================


Build step 'Execute shell' marked build as failure
Archiving artifacts
Sending artifact delta relative to PreCommit-YARN-Build #7431
Archived 31 artifacts
Archive block size is 32768
Received 44 blocks and 173559477 bytes
Compression is 0.8%
Took 34 sec
[description-setter] Could not determine description.
Recording test results
Email was triggered for: Failure
Sending email for trigger: Failure



###################################################################################
############################## FAILED TESTS (if any) ##############################
1 tests failed.
FAILED:  org.apache.hadoop.yarn.server.resourcemanager.applicationsmanager.TestAMRestart.testShouldNotCountFailureToMaxAttemptRetry

Error Message:
AppAttempt state is not correct (timedout) expected:<ALLOCATED> but was:<SCHEDULED>

Stack Trace:
java.lang.AssertionError: AppAttempt state is not correct (timedout) expected:<ALLOCATED>
but was:<SCHEDULED>
	at org.junit.Assert.fail(Assert.java:88)
	at org.junit.Assert.failNotEquals(Assert.java:743)
	at org.junit.Assert.assertEquals(Assert.java:118)
	at org.apache.hadoop.yarn.server.resourcemanager.MockAM.waitForState(MockAM.java:86)
	at org.apache.hadoop.yarn.server.resourcemanager.MockRM.sendAMLaunched(MockRM.java:507)
	at org.apache.hadoop.yarn.server.resourcemanager.MockRM.launchAM(MockRM.java:689)
	at org.apache.hadoop.yarn.server.resourcemanager.MockRM.launchAndRegisterAM(MockRM.java:696)
	at org.apache.hadoop.yarn.server.resourcemanager.MockRM.waitForNewAMToLaunchAndRegister(MockRM.java:194)
	at org.apache.hadoop.yarn.server.resourcemanager.applicationsmanager.TestAMRestart.testShouldNotCountFailureToMaxAttemptRetry(TestAMRestart.java:405)



Mime
  • Unnamed multipart/mixed (inline, None, 0 bytes)
View raw message