hadoop-yarn-dev mailing list archives

Site index · List index
Message view « Date » · « Thread »
Top « Date » · « Thread »
From Apache Jenkins Server <jenk...@builds.apache.org>
Subject Failed: YARN-3514 PreCommit Build #7419
Date Tue, 21 Apr 2015 08:06:53 GMT
Jira: https://issues.apache.org/jira/browse/YARN-3514
Build: https://builds.apache.org/job/PreCommit-YARN-Build/7419/

###################################################################################
########################## LAST 60 LINES OF THE CONSOLE ###########################
[...truncated 3543 lines...]
{color:red}-1 overall{color}.  Here are the results of testing the latest attachment 
  http://issues.apache.org/jira/secure/attachment/12726815/YARN-3514.001.patch
  against trunk revision d52de61.

    {color:green}+1 @author{color}.  The patch does not contain any @author tags.

    {color:green}+1 tests included{color}.  The patch appears to include 1 new or modified
test files.

    {color:green}+1 javac{color}.  The applied patch does not increase the total number of
javac compiler warnings.

    {color:green}+1 javadoc{color}.  There were no new javadoc warning messages.

    {color:green}+1 eclipse:eclipse{color}.  The patch built with eclipse:eclipse.

    {color:green}+1 findbugs{color}.  The patch does not introduce any new Findbugs (version
2.0.3) warnings.

    {color:green}+1 release audit{color}.  The applied patch does not increase the total number
of release audit warnings.

    {color:red}-1 core tests{color}.  The patch failed these unit tests in hadoop-yarn-project/hadoop-yarn/hadoop-yarn-server/hadoop-yarn-server-nodemanager:

                  org.apache.hadoop.yarn.server.nodemanager.containermanager.localizer.TestContainerLocalizer

Test results: https://builds.apache.org/job/PreCommit-YARN-Build/7419//testReport/
Console output: https://builds.apache.org/job/PreCommit-YARN-Build/7419//console

This message is automatically generated.


======================================================================
======================================================================
    Adding comment to Jira.
======================================================================
======================================================================


Comment added.
871419b96f8fd6fc1eeeb213a5c126f74bc20fd7 logged out


======================================================================
======================================================================
    Finished build.
======================================================================
======================================================================


Build step 'Execute shell' marked build as failure
Archiving artifacts
Sending artifact delta relative to PreCommit-YARN-Build #7409
Archived 15 artifacts
Archive block size is 32768
Received 52 blocks and 7392801 bytes
Compression is 18.7%
Took 1.6 sec
[description-setter] Could not determine description.
Recording test results
Publish JUnit test result report is waiting for a checkpoint on PreCommit-YARN-Build #7418
Email was triggered for: Failure
Sending email for trigger: Failure



###################################################################################
############################## FAILED TESTS (if any) ##############################
1 tests failed.
FAILED:  org.apache.hadoop.yarn.server.nodemanager.containermanager.localizer.TestContainerLocalizer.testLocalizerDiskCheckDoesNotUriEncodePath

Error Message:
expected:<0> but was:<-1>

Stack Trace:
java.lang.AssertionError: expected:<0> but was:<-1>
	at org.junit.Assert.fail(Assert.java:88)
	at org.junit.Assert.failNotEquals(Assert.java:743)
	at org.junit.Assert.assertEquals(Assert.java:118)
	at org.junit.Assert.assertEquals(Assert.java:555)
	at org.junit.Assert.assertEquals(Assert.java:542)
	at org.apache.hadoop.yarn.server.nodemanager.containermanager.localizer.TestContainerLocalizer.testLocalizerDiskCheckDoesNotUriEncodePath(TestContainerLocalizer.java:265)



Mime
  • Unnamed multipart/mixed (inline, None, 0 bytes)
View raw message