hadoop-yarn-dev mailing list archives

Site index · List index
Message view « Date » · « Thread »
Top « Date » · « Thread »
From Apache Jenkins Server <jenk...@builds.apache.org>
Subject Failed: YARN-81 PreCommit Build #7215
Date Fri, 03 Apr 2015 20:50:20 GMT
Jira: https://issues.apache.org/jira/browse/YARN-81
Build: https://builds.apache.org/job/PreCommit-YARN-Build/7215/

###################################################################################
########################## LAST 60 LINES OF THE CONSOLE ###########################
[...truncated 7750 lines...]
    {color:green}+1 release audit{color}.  The applied patch does not increase the total number of release audit warnings.

    {color:red}-1 core tests{color}.  The patch failed these unit tests in hadoop-yarn-project/hadoop-yarn/hadoop-yarn-api hadoop-yarn-project/hadoop-yarn/hadoop-yarn-applications/hadoop-yarn-applications-distributedshell hadoop-yarn-project/hadoop-yarn/hadoop-yarn-applications/hadoop-yarn-applications-unmanaged-am-launcher hadoop-yarn-project/hadoop-yarn/hadoop-yarn-client hadoop-yarn-project/hadoop-yarn/hadoop-yarn-common hadoop-yarn-project/hadoop-yarn/hadoop-yarn-registry hadoop-yarn-project/hadoop-yarn/hadoop-yarn-server/hadoop-yarn-server-applicationhistoryservice hadoop-yarn-project/hadoop-yarn/hadoop-yarn-server/hadoop-yarn-server-common hadoop-yarn-project/hadoop-yarn/hadoop-yarn-server/hadoop-yarn-server-nodemanager hadoop-yarn-project/hadoop-yarn/hadoop-yarn-server/hadoop-yarn-server-resourcemanager hadoop-yarn-project/hadoop-yarn/hadoop-yarn-server/hadoop-yarn-server-sharedcachemanager hadoop-yarn-project/hadoop-yarn/hadoop-yarn-server/hadoop-yarn-server-tests hadoop-yarn-project/hadoop-yarn/hadoop-yarn-server/hadoop-yarn-server-web-proxy:

                  org.apache.hadoop.yarn.server.applicationhistoryservice.webapp.TestAHSWebServices
                  org.apache.hadoop.yarn.server.timeline.webapp.TestTimelineWebServices
                  org.apache.hadoop.yarn.server.nodemanager.webapp.TestNMWebServicesApps
                  org.apache.hadoop.yarn.server.nodemanager.webapp.TestNMWebServices
                  org.apache.hadoop.yarn.server.nodemanager.webapp.TestNMWebServicesContainers
                  org.apache.hadoop.yarn.server.resourcemanager.scheduler.fair.TestFairScheduler
                  org.apache.hadoop.yarn.server.resourcemanager.webapp.TestRMWebServicesFairScheduler
                  org.apache.hadoop.yarn.server.resourcemanager.TestRM
                  org.apache.hadoop.yarn.server.resourcemanager.webapp.TestRMWebServicesApps
                  org.apache.hadoop.yarn.server.resourcemanager.webapp.TestRMWebServicesNodes
                  org.apache.hadoop.yarn.server.resourcemanager.webapp.TestRMWebServicesAppsModification
                  org.apache.hadoop.yarn.server.resourcemanager.webapp.TestRMWebServicesCapacitySched
                  org.apache.hadoop.yarn.server.resourcemanager.webapp.TestRMWebServices
                  org.apache.hadoop.yarn.server.resourcemanager.webapp.TestRMWebServicesNodeLabels
                  org.apache.hadoop.yarn.server.resourcemanager.webapp.TestRMWebServicesDelegationTokens

                                      The test build failed in hadoop-yarn-project/hadoop-yarn/hadoop-yarn-server/hadoop-yarn-server-tests hadoop-yarn-project/hadoop-yarn/hadoop-yarn-server/hadoop-yarn-server-sharedcachemanager hadoop-yarn-project/hadoop-yarn/hadoop-yarn-server/hadoop-yarn-server-common hadoop-yarn-project/hadoop-yarn/hadoop-yarn-registry hadoop-yarn-project/hadoop-yarn/hadoop-yarn-applications/hadoop-yarn-applications-unmanaged-am-launcher 

Test results: https://builds.apache.org/job/PreCommit-YARN-Build/7215//testReport/
Findbugs warnings: https://builds.apache.org/job/PreCommit-YARN-Build/7215//artifact/patchprocess/newPatchFindbugsWarningshadoop-yarn-common.html
Console output: https://builds.apache.org/job/PreCommit-YARN-Build/7215//console

This message is automatically generated.


======================================================================
======================================================================
    Adding comment to Jira.
======================================================================
======================================================================


Comment added.
e61b2d3abc8182ff6716e946d3bbd6b73330ba0d logged out


======================================================================
======================================================================
    Finished build.
======================================================================
======================================================================


Build step 'Execute shell' marked build as failure
Archiving artifacts
Sending artifact delta relative to PreCommit-YARN-Build #7207
Archived 75 artifacts
Archive block size is 32768
Received 52 blocks and 9189066 bytes
Compression is 15.6%
Took 2.1 sec
[description-setter] Could not determine description.
Recording test results
Email was triggered for: Failure
Sending email for trigger: Failure



###################################################################################
############################## FAILED TESTS (if any) ##############################
226 tests failed.
REGRESSION:  org.apache.hadoop.yarn.server.resourcemanager.scheduler.fair.TestFairScheduler.testContinuousScheduling

Error Message:
expected:<2> but was:<1>

Stack Trace:
java.lang.AssertionError: expected:<2> but was:<1>
	at org.junit.Assert.fail(Assert.java:88)
	at org.junit.Assert.failNotEquals(Assert.java:743)
	at org.junit.Assert.assertEquals(Assert.java:118)
	at org.junit.Assert.assertEquals(Assert.java:555)
	at org.junit.Assert.assertEquals(Assert.java:542)
	at org.apache.hadoop.yarn.server.resourcemanager.scheduler.fair.TestFairScheduler.testContinuousScheduling(TestFairScheduler.java:3940)


FAILED:  org.apache.hadoop.yarn.server.applicationhistoryservice.webapp.TestAHSWebServices.testMultipleContainers[0]

Error Message:
The default test container factory, null, could not be instantiated

Stack Trace:
com.sun.jersey.test.framework.spi.container.TestContainerException: The default test container factory, null, could not be instantiated
	at com.sun.jersey.test.framework.JerseyTest.getDefaultTestContainerFactory(JerseyTest.java:406)
	at com.sun.jersey.test.framework.JerseyTest.getTestContainerFactory(JerseyTest.java:273)
	at com.sun.jersey.test.framework.JerseyTest.<init>(JerseyTest.java:217)
	at org.apache.hadoop.yarn.webapp.JerseyTestBase.<init>(JerseyTestBase.java:27)
	at org.apache.hadoop.yarn.server.applicationhistoryservice.webapp.TestAHSWebServices.<init>(TestAHSWebServices.java:156)


FAILED:  org.apache.hadoop.yarn.server.applicationhistoryservice.webapp.TestAHSWebServices.testInvalidUri2[0]

Error Message:
The default test container factory, null, could not be instantiated

Stack Trace:
com.sun.jersey.test.framework.spi.container.TestContainerException: The default test container factory, null, could not be instantiated
	at com.sun.jersey.test.framework.JerseyTest.getDefaultTestContainerFactory(JerseyTest.java:406)
	at com.sun.jersey.test.framework.JerseyTest.getTestContainerFactory(JerseyTest.java:273)
	at com.sun.jersey.test.framework.JerseyTest.<init>(JerseyTest.java:217)
	at org.apache.hadoop.yarn.webapp.JerseyTestBase.<init>(JerseyTestBase.java:27)
	at org.apache.hadoop.yarn.server.applicationhistoryservice.webapp.TestAHSWebServices.<init>(TestAHSWebServices.java:156)


FAILED:  org.apache.hadoop.yarn.server.applicationhistoryservice.webapp.TestAHSWebServices.testAppsQuery[0]

Error Message:
The default test container factory, null, could not be instantiated

Stack Trace:
com.sun.jersey.test.framework.spi.container.TestContainerException: The default test container factory, null, could not be instantiated
	at com.sun.jersey.test.framework.JerseyTest.getDefaultTestContainerFactory(JerseyTest.java:406)
	at com.sun.jersey.test.framework.JerseyTest.getTestContainerFactory(JerseyTest.java:273)
	at com.sun.jersey.test.framework.JerseyTest.<init>(JerseyTest.java:217)
	at org.apache.hadoop.yarn.webapp.JerseyTestBase.<init>(JerseyTestBase.java:27)
	at org.apache.hadoop.yarn.server.applicationhistoryservice.webapp.TestAHSWebServices.<init>(TestAHSWebServices.java:156)


FAILED:  org.apache.hadoop.yarn.server.applicationhistoryservice.webapp.TestAHSWebServices.testSingleAttempt[0]

Error Message:
The default test container factory, null, could not be instantiated

Stack Trace:
com.sun.jersey.test.framework.spi.container.TestContainerException: The default test container factory, null, could not be instantiated
	at com.sun.jersey.test.framework.JerseyTest.getDefaultTestContainerFactory(JerseyTest.java:406)
	at com.sun.jersey.test.framework.JerseyTest.getTestContainerFactory(JerseyTest.java:273)
	at com.sun.jersey.test.framework.JerseyTest.<init>(JerseyTest.java:217)
	at org.apache.hadoop.yarn.webapp.JerseyTestBase.<init>(JerseyTestBase.java:27)
	at org.apache.hadoop.yarn.server.applicationhistoryservice.webapp.TestAHSWebServices.<init>(TestAHSWebServices.java:156)


FAILED:  org.apache.hadoop.yarn.server.applicationhistoryservice.webapp.TestAHSWebServices.testSingleApp[0]

Error Message:
The default test container factory, null, could not be instantiated

Stack Trace:
com.sun.jersey.test.framework.spi.container.TestContainerException: The default test container factory, null, could not be instantiated
	at com.sun.jersey.test.framework.JerseyTest.getDefaultTestContainerFactory(JerseyTest.java:406)
	at com.sun.jersey.test.framework.JerseyTest.getTestContainerFactory(JerseyTest.java:273)
	at com.sun.jersey.test.framework.JerseyTest.<init>(JerseyTest.java:217)
	at org.apache.hadoop.yarn.webapp.JerseyTestBase.<init>(JerseyTestBase.java:27)
	at org.apache.hadoop.yarn.server.applicationhistoryservice.webapp.TestAHSWebServices.<init>(TestAHSWebServices.java:156)


FAILED:  org.apache.hadoop.yarn.server.applicationhistoryservice.webapp.TestAHSWebServices.testInvalidAccept[0]

Error Message:
The default test container factory, null, could not be instantiated

Stack Trace:
com.sun.jersey.test.framework.spi.container.TestContainerException: The default test container factory, null, could not be instantiated
	at com.sun.jersey.test.framework.JerseyTest.getDefaultTestContainerFactory(JerseyTest.java:406)
	at com.sun.jersey.test.framework.JerseyTest.getTestContainerFactory(JerseyTest.java:273)
	at com.sun.jersey.test.framework.JerseyTest.<init>(JerseyTest.java:217)
	at org.apache.hadoop.yarn.webapp.JerseyTestBase.<init>(JerseyTestBase.java:27)
	at org.apache.hadoop.yarn.server.applicationhistoryservice.webapp.TestAHSWebServices.<init>(TestAHSWebServices.java:156)


FAILED:  org.apache.hadoop.yarn.server.applicationhistoryservice.webapp.TestAHSWebServices.testSingleContainer[0]

Error Message:
The default test container factory, null, could not be instantiated

Stack Trace:
com.sun.jersey.test.framework.spi.container.TestContainerException: The default test container factory, null, could not be instantiated
	at com.sun.jersey.test.framework.JerseyTest.getDefaultTestContainerFactory(JerseyTest.java:406)
	at com.sun.jersey.test.framework.JerseyTest.getTestContainerFactory(JerseyTest.java:273)
	at com.sun.jersey.test.framework.JerseyTest.<init>(JerseyTest.java:217)
	at org.apache.hadoop.yarn.webapp.JerseyTestBase.<init>(JerseyTestBase.java:27)
	at org.apache.hadoop.yarn.server.applicationhistoryservice.webapp.TestAHSWebServices.<init>(TestAHSWebServices.java:156)


FAILED:  org.apache.hadoop.yarn.server.applicationhistoryservice.webapp.TestAHSWebServices.testMultipleAttempts[0]

Error Message:
The default test container factory, null, could not be instantiated

Stack Trace:
com.sun.jersey.test.framework.spi.container.TestContainerException: The default test container factory, null, could not be instantiated
	at com.sun.jersey.test.framework.JerseyTest.getDefaultTestContainerFactory(JerseyTest.java:406)
	at com.sun.jersey.test.framework.JerseyTest.getTestContainerFactory(JerseyTest.java:273)
	at com.sun.jersey.test.framework.JerseyTest.<init>(JerseyTest.java:217)
	at org.apache.hadoop.yarn.webapp.JerseyTestBase.<init>(JerseyTestBase.java:27)
	at org.apache.hadoop.yarn.server.applicationhistoryservice.webapp.TestAHSWebServices.<init>(TestAHSWebServices.java:156)


FAILED:  org.apache.hadoop.yarn.server.applicationhistoryservice.webapp.TestAHSWebServices.testInvalidUri[0]

Error Message:
The default test container factory, null, could not be instantiated

Stack Trace:
com.sun.jersey.test.framework.spi.container.TestContainerException: The default test container factory, null, could not be instantiated
	at com.sun.jersey.test.framework.JerseyTest.getDefaultTestContainerFactory(JerseyTest.java:406)
	at com.sun.jersey.test.framework.JerseyTest.getTestContainerFactory(JerseyTest.java:273)
	at com.sun.jersey.test.framework.JerseyTest.<init>(JerseyTest.java:217)
	at org.apache.hadoop.yarn.webapp.JerseyTestBase.<init>(JerseyTestBase.java:27)
	at org.apache.hadoop.yarn.server.applicationhistoryservice.webapp.TestAHSWebServices.<init>(TestAHSWebServices.java:156)


FAILED:  org.apache.hadoop.yarn.server.applicationhistoryservice.webapp.TestAHSWebServices.testMultipleContainers[1]

Error Message:
The default test container factory, null, could not be instantiated

Stack Trace:
com.sun.jersey.test.framework.spi.container.TestContainerException: The default test container factory, null, could not be instantiated
	at com.sun.jersey.test.framework.JerseyTest.getDefaultTestContainerFactory(JerseyTest.java:406)
	at com.sun.jersey.test.framework.JerseyTest.getTestContainerFactory(JerseyTest.java:273)
	at com.sun.jersey.test.framework.JerseyTest.<init>(JerseyTest.java:217)
	at org.apache.hadoop.yarn.webapp.JerseyTestBase.<init>(JerseyTestBase.java:27)
	at org.apache.hadoop.yarn.server.applicationhistoryservice.webapp.TestAHSWebServices.<init>(TestAHSWebServices.java:156)


FAILED:  org.apache.hadoop.yarn.server.applicationhistoryservice.webapp.TestAHSWebServices.testInvalidUri2[1]

Error Message:
The default test container factory, null, could not be instantiated

Stack Trace:
com.sun.jersey.test.framework.spi.container.TestContainerException: The default test container factory, null, could not be instantiated
	at com.sun.jersey.test.framework.JerseyTest.getDefaultTestContainerFactory(JerseyTest.java:406)
	at com.sun.jersey.test.framework.JerseyTest.getTestContainerFactory(JerseyTest.java:273)
	at com.sun.jersey.test.framework.JerseyTest.<init>(JerseyTest.java:217)
	at org.apache.hadoop.yarn.webapp.JerseyTestBase.<init>(JerseyTestBase.java:27)
	at org.apache.hadoop.yarn.server.applicationhistoryservice.webapp.TestAHSWebServices.<init>(TestAHSWebServices.java:156)


FAILED:  org.apache.hadoop.yarn.server.applicationhistoryservice.webapp.TestAHSWebServices.testAppsQuery[1]

Error Message:
The default test container factory, null, could not be instantiated

Stack Trace:
com.sun.jersey.test.framework.spi.container.TestContainerException: The default test container factory, null, could not be instantiated
	at com.sun.jersey.test.framework.JerseyTest.getDefaultTestContainerFactory(JerseyTest.java:406)
	at com.sun.jersey.test.framework.JerseyTest.getTestContainerFactory(JerseyTest.java:273)
	at com.sun.jersey.test.framework.JerseyTest.<init>(JerseyTest.java:217)
	at org.apache.hadoop.yarn.webapp.JerseyTestBase.<init>(JerseyTestBase.java:27)
	at org.apache.hadoop.yarn.server.applicationhistoryservice.webapp.TestAHSWebServices.<init>(TestAHSWebServices.java:156)


FAILED:  org.apache.hadoop.yarn.server.applicationhistoryservice.webapp.TestAHSWebServices.testSingleAttempt[1]

Error Message:
The default test container factory, null, could not be instantiated

Stack Trace:
com.sun.jersey.test.framework.spi.container.TestContainerException: The default test container factory, null, could not be instantiated
	at com.sun.jersey.test.framework.JerseyTest.getDefaultTestContainerFactory(JerseyTest.java:406)
	at com.sun.jersey.test.framework.JerseyTest.getTestContainerFactory(JerseyTest.java:273)
	at com.sun.jersey.test.framework.JerseyTest.<init>(JerseyTest.java:217)
	at org.apache.hadoop.yarn.webapp.JerseyTestBase.<init>(JerseyTestBase.java:27)
	at org.apache.hadoop.yarn.server.applicationhistoryservice.webapp.TestAHSWebServices.<init>(TestAHSWebServices.java:156)


FAILED:  org.apache.hadoop.yarn.server.applicationhistoryservice.webapp.TestAHSWebServices.testSingleApp[1]

Error Message:
The default test container factory, null, could not be instantiated

Stack Trace:
com.sun.jersey.test.framework.spi.container.TestContainerException: The default test container factory, null, could not be instantiated
	at com.sun.jersey.test.framework.JerseyTest.getDefaultTestContainerFactory(JerseyTest.java:406)
	at com.sun.jersey.test.framework.JerseyTest.getTestContainerFactory(JerseyTest.java:273)
	at com.sun.jersey.test.framework.JerseyTest.<init>(JerseyTest.java:217)
	at org.apache.hadoop.yarn.webapp.JerseyTestBase.<init>(JerseyTestBase.java:27)
	at org.apache.hadoop.yarn.server.applicationhistoryservice.webapp.TestAHSWebServices.<init>(TestAHSWebServices.java:156)


FAILED:  org.apache.hadoop.yarn.server.applicationhistoryservice.webapp.TestAHSWebServices.testInvalidAccept[1]

Error Message:
The default test container factory, null, could not be instantiated

Stack Trace:
com.sun.jersey.test.framework.spi.container.TestContainerException: The default test container factory, null, could not be instantiated
	at com.sun.jersey.test.framework.JerseyTest.getDefaultTestContainerFactory(JerseyTest.java:406)
	at com.sun.jersey.test.framework.JerseyTest.getTestContainerFactory(JerseyTest.java:273)
	at com.sun.jersey.test.framework.JerseyTest.<init>(JerseyTest.java:217)
	at org.apache.hadoop.yarn.webapp.JerseyTestBase.<init>(JerseyTestBase.java:27)
	at org.apache.hadoop.yarn.server.applicationhistoryservice.webapp.TestAHSWebServices.<init>(TestAHSWebServices.java:156)


FAILED:  org.apache.hadoop.yarn.server.applicationhistoryservice.webapp.TestAHSWebServices.testSingleContainer[1]

Error Message:
The default test container factory, null, could not be instantiated

Stack Trace:
com.sun.jersey.test.framework.spi.container.TestContainerException: The default test container factory, null, could not be instantiated
	at com.sun.jersey.test.framework.JerseyTest.getDefaultTestContainerFactory(JerseyTest.java:406)
	at com.sun.jersey.test.framework.JerseyTest.getTestContainerFactory(JerseyTest.java:273)
	at com.sun.jersey.test.framework.JerseyTest.<init>(JerseyTest.java:217)
	at org.apache.hadoop.yarn.webapp.JerseyTestBase.<init>(JerseyTestBase.java:27)
	at org.apache.hadoop.yarn.server.applicationhistoryservice.webapp.TestAHSWebServices.<init>(TestAHSWebServices.java:156)


FAILED:  org.apache.hadoop.yarn.server.applicationhistoryservice.webapp.TestAHSWebServices.testMultipleAttempts[1]

Error Message:
The default test container factory, null, could not be instantiated

Stack Trace:
com.sun.jersey.test.framework.spi.container.TestContainerException: The default test container factory, null, could not be instantiated
	at com.sun.jersey.test.framework.JerseyTest.getDefaultTestContainerFactory(JerseyTest.java:406)
	at com.sun.jersey.test.framework.JerseyTest.getTestContainerFactory(JerseyTest.java:273)
	at com.sun.jersey.test.framework.JerseyTest.<init>(JerseyTest.java:217)
	at org.apache.hadoop.yarn.webapp.JerseyTestBase.<init>(JerseyTestBase.java:27)
	at org.apache.hadoop.yarn.server.applicationhistoryservice.webapp.TestAHSWebServices.<init>(TestAHSWebServices.java:156)


FAILED:  org.apache.hadoop.yarn.server.applicationhistoryservice.webapp.TestAHSWebServices.testInvalidUri[1]

Error Message:
The default test container factory, null, could not be instantiated

Stack Trace:
com.sun.jersey.test.framework.spi.container.TestContainerException: The default test container factory, null, could not be instantiated
	at com.sun.jersey.test.framework.JerseyTest.getDefaultTestContainerFactory(JerseyTest.java:406)
	at com.sun.jersey.test.framework.JerseyTest.getTestContainerFactory(JerseyTest.java:273)
	at com.sun.jersey.test.framework.JerseyTest.<init>(JerseyTest.java:217)
	at org.apache.hadoop.yarn.webapp.JerseyTestBase.<init>(JerseyTestBase.java:27)
	at org.apache.hadoop.yarn.server.applicationhistoryservice.webapp.TestAHSWebServices.<init>(TestAHSWebServices.java:156)


FAILED:  org.apache.hadoop.yarn.server.timeline.webapp.TestTimelineWebServices.testGetDomains

Error Message:
The default test container factory, null, could not be instantiated

Stack Trace:
com.sun.jersey.test.framework.spi.container.TestContainerException: The default test container factory, null, could not be instantiated
	at com.sun.jersey.test.framework.JerseyTest.getDefaultTestContainerFactory(JerseyTest.java:406)
	at com.sun.jersey.test.framework.JerseyTest.getTestContainerFactory(JerseyTest.java:273)
	at com.sun.jersey.test.framework.JerseyTest.<init>(JerseyTest.java:217)
	at org.apache.hadoop.yarn.webapp.JerseyTestBase.<init>(JerseyTestBase.java:27)
	at org.apache.hadoop.yarn.server.timeline.webapp.TestTimelineWebServices.<init>(TestTimelineWebServices.java:169)


FAILED:  org.apache.hadoop.yarn.server.timeline.webapp.TestTimelineWebServices.testPrimaryFilterLong

Error Message:
The default test container factory, null, could not be instantiated

Stack Trace:
com.sun.jersey.test.framework.spi.container.TestContainerException: The default test container factory, null, could not be instantiated
	at com.sun.jersey.test.framework.JerseyTest.getDefaultTestContainerFactory(JerseyTest.java:406)
	at com.sun.jersey.test.framework.JerseyTest.getTestContainerFactory(JerseyTest.java:273)
	at com.sun.jersey.test.framework.JerseyTest.<init>(JerseyTest.java:217)
	at org.apache.hadoop.yarn.webapp.JerseyTestBase.<init>(JerseyTestBase.java:27)
	at org.apache.hadoop.yarn.server.timeline.webapp.TestTimelineWebServices.<init>(TestTimelineWebServices.java:169)


FAILED:  org.apache.hadoop.yarn.server.timeline.webapp.TestTimelineWebServices.testPrimaryFilterNumericStringWithQuotes

Error Message:
The default test container factory, null, could not be instantiated

Stack Trace:
com.sun.jersey.test.framework.spi.container.TestContainerException: The default test container factory, null, could not be instantiated
	at com.sun.jersey.test.framework.JerseyTest.getDefaultTestContainerFactory(JerseyTest.java:406)
	at com.sun.jersey.test.framework.JerseyTest.getTestContainerFactory(JerseyTest.java:273)
	at com.sun.jersey.test.framework.JerseyTest.<init>(JerseyTest.java:217)
	at org.apache.hadoop.yarn.webapp.JerseyTestBase.<init>(JerseyTestBase.java:27)
	at org.apache.hadoop.yarn.server.timeline.webapp.TestTimelineWebServices.<init>(TestTimelineWebServices.java:169)


FAILED:  org.apache.hadoop.yarn.server.timeline.webapp.TestTimelineWebServices.testGetEntityWithYarnACLsEnabled

Error Message:
The default test container factory, null, could not be instantiated

Stack Trace:
com.sun.jersey.test.framework.spi.container.TestContainerException: The default test container factory, null, could not be instantiated
	at com.sun.jersey.test.framework.JerseyTest.getDefaultTestContainerFactory(JerseyTest.java:406)
	at com.sun.jersey.test.framework.JerseyTest.getTestContainerFactory(JerseyTest.java:273)
	at com.sun.jersey.test.framework.JerseyTest.<init>(JerseyTest.java:217)
	at org.apache.hadoop.yarn.webapp.JerseyTestBase.<init>(JerseyTestBase.java:27)
	at org.apache.hadoop.yarn.server.timeline.webapp.TestTimelineWebServices.<init>(TestTimelineWebServices.java:169)


FAILED:  org.apache.hadoop.yarn.server.timeline.webapp.TestTimelineWebServices.testPostEntitiesWithPrimaryFilter

Error Message:
The default test container factory, null, could not be instantiated

Stack Trace:
com.sun.jersey.test.framework.spi.container.TestContainerException: The default test container factory, null, could not be instantiated
	at com.sun.jersey.test.framework.JerseyTest.getDefaultTestContainerFactory(JerseyTest.java:406)
	at com.sun.jersey.test.framework.JerseyTest.getTestContainerFactory(JerseyTest.java:273)
	at com.sun.jersey.test.framework.JerseyTest.<init>(JerseyTest.java:217)
	at org.apache.hadoop.yarn.webapp.JerseyTestBase.<init>(JerseyTestBase.java:27)
	at org.apache.hadoop.yarn.server.timeline.webapp.TestTimelineWebServices.<init>(TestTimelineWebServices.java:169)


FAILED:  org.apache.hadoop.yarn.server.timeline.webapp.TestTimelineWebServices.testPostEntities

Error Message:
The default test container factory, null, could not be instantiated

Stack Trace:
com.sun.jersey.test.framework.spi.container.TestContainerException: The default test container factory, null, could not be instantiated
	at com.sun.jersey.test.framework.JerseyTest.getDefaultTestContainerFactory(JerseyTest.java:406)
	at com.sun.jersey.test.framework.JerseyTest.getTestContainerFactory(JerseyTest.java:273)
	at com.sun.jersey.test.framework.JerseyTest.<init>(JerseyTest.java:217)
	at org.apache.hadoop.yarn.webapp.JerseyTestBase.<init>(JerseyTestBase.java:27)
	at org.apache.hadoop.yarn.server.timeline.webapp.TestTimelineWebServices.<init>(TestTimelineWebServices.java:169)


FAILED:  org.apache.hadoop.yarn.server.timeline.webapp.TestTimelineWebServices.testSecondaryFilters

Error Message:
The default test container factory, null, could not be instantiated

Stack Trace:
com.sun.jersey.test.framework.spi.container.TestContainerException: The default test container factory, null, could not be instantiated
	at com.sun.jersey.test.framework.JerseyTest.getDefaultTestContainerFactory(JerseyTest.java:406)
	at com.sun.jersey.test.framework.JerseyTest.getTestContainerFactory(JerseyTest.java:273)
	at com.sun.jersey.test.framework.JerseyTest.<init>(JerseyTest.java:217)
	at org.apache.hadoop.yarn.webapp.JerseyTestBase.<init>(JerseyTestBase.java:27)
	at org.apache.hadoop.yarn.server.timeline.webapp.TestTimelineWebServices.<init>(TestTimelineWebServices.java:169)


FAILED:  org.apache.hadoop.yarn.server.timeline.webapp.TestTimelineWebServices.testPutDomainYarnACLsEnabled

Error Message:
The default test container factory, null, could not be instantiated

Stack Trace:
com.sun.jersey.test.framework.spi.container.TestContainerException: The default test container factory, null, could not be instantiated
	at com.sun.jersey.test.framework.JerseyTest.getDefaultTestContainerFactory(JerseyTest.java:406)
	at com.sun.jersey.test.framework.JerseyTest.getTestContainerFactory(JerseyTest.java:273)
	at com.sun.jersey.test.framework.JerseyTest.<init>(JerseyTest.java:217)
	at org.apache.hadoop.yarn.webapp.JerseyTestBase.<init>(JerseyTestBase.java:27)
	at org.apache.hadoop.yarn.server.timeline.webapp.TestTimelineWebServices.<init>(TestTimelineWebServices.java:169)


FAILED:  org.apache.hadoop.yarn.server.timeline.webapp.TestTimelineWebServices.testAbout

Error Message:
The default test container factory, null, could not be instantiated

Stack Trace:
com.sun.jersey.test.framework.spi.container.TestContainerException: The default test container factory, null, could not be instantiated
	at com.sun.jersey.test.framework.JerseyTest.getDefaultTestContainerFactory(JerseyTest.java:406)
	at com.sun.jersey.test.framework.JerseyTest.getTestContainerFactory(JerseyTest.java:273)
	at com.sun.jersey.test.framework.JerseyTest.<init>(JerseyTest.java:217)
	at org.apache.hadoop.yarn.webapp.JerseyTestBase.<init>(JerseyTestBase.java:27)
	at org.apache.hadoop.yarn.server.timeline.webapp.TestTimelineWebServices.<init>(TestTimelineWebServices.java:169)


FAILED:  org.apache.hadoop.yarn.server.timeline.webapp.TestTimelineWebServices.testGetEntities

Error Message:
The default test container factory, null, could not be instantiated

Stack Trace:
com.sun.jersey.test.framework.spi.container.TestContainerException: The default test container factory, null, could not be instantiated
	at com.sun.jersey.test.framework.JerseyTest.getDefaultTestContainerFactory(JerseyTest.java:406)
	at com.sun.jersey.test.framework.JerseyTest.getTestContainerFactory(JerseyTest.java:273)
	at com.sun.jersey.test.framework.JerseyTest.<init>(JerseyTest.java:217)
	at org.apache.hadoop.yarn.webapp.JerseyTestBase.<init>(JerseyTestBase.java:27)
	at org.apache.hadoop.yarn.server.timeline.webapp.TestTimelineWebServices.<init>(TestTimelineWebServices.java:169)


FAILED:  org.apache.hadoop.yarn.server.timeline.webapp.TestTimelineWebServices.testPostEntitiesToDefaultDomain

Error Message:
The default test container factory, null, could not be instantiated

Stack Trace:
com.sun.jersey.test.framework.spi.container.TestContainerException: The default test container factory, null, could not be instantiated
	at com.sun.jersey.test.framework.JerseyTest.getDefaultTestContainerFactory(JerseyTest.java:406)
	at com.sun.jersey.test.framework.JerseyTest.getTestContainerFactory(JerseyTest.java:273)
	at com.sun.jersey.test.framework.JerseyTest.<init>(JerseyTest.java:217)
	at org.apache.hadoop.yarn.webapp.JerseyTestBase.<init>(JerseyTestBase.java:27)
	at org.apache.hadoop.yarn.server.timeline.webapp.TestTimelineWebServices.<init>(TestTimelineWebServices.java:169)


FAILED:  org.apache.hadoop.yarn.server.timeline.webapp.TestTimelineWebServices.testPutDomain

Error Message:
The default test container factory, null, could not be instantiated

Stack Trace:
com.sun.jersey.test.framework.spi.container.TestContainerException: The default test container factory, null, could not be instantiated
	at com.sun.jersey.test.framework.JerseyTest.getDefaultTestContainerFactory(JerseyTest.java:406)
	at com.sun.jersey.test.framework.JerseyTest.getTestContainerFactory(JerseyTest.java:273)
	at com.sun.jersey.test.framework.JerseyTest.<init>(JerseyTest.java:217)
	at org.apache.hadoop.yarn.webapp.JerseyTestBase.<init>(JerseyTestBase.java:27)
	at org.apache.hadoop.yarn.server.timeline.webapp.TestTimelineWebServices.<init>(TestTimelineWebServices.java:169)


FAILED:  org.apache.hadoop.yarn.server.timeline.webapp.TestTimelineWebServices.testPrimaryFilterNumericString

Error Message:
The default test container factory, null, could not be instantiated

Stack Trace:
com.sun.jersey.test.framework.spi.container.TestContainerException: The default test container factory, null, could not be instantiated
	at com.sun.jersey.test.framework.JerseyTest.getDefaultTestContainerFactory(JerseyTest.java:406)
	at com.sun.jersey.test.framework.JerseyTest.getTestContainerFactory(JerseyTest.java:273)
	at com.sun.jersey.test.framework.JerseyTest.<init>(JerseyTest.java:217)
	at org.apache.hadoop.yarn.webapp.JerseyTestBase.<init>(JerseyTestBase.java:27)
	at org.apache.hadoop.yarn.server.timeline.webapp.TestTimelineWebServices.<init>(TestTimelineWebServices.java:169)


FAILED:  org.apache.hadoop.yarn.server.timeline.webapp.TestTimelineWebServices.testGetEntityFields1

Error Message:
The default test container factory, null, could not be instantiated

Stack Trace:
com.sun.jersey.test.framework.spi.container.TestContainerException: The default test container factory, null, could not be instantiated
	at com.sun.jersey.test.framework.JerseyTest.getDefaultTestContainerFactory(JerseyTest.java:406)
	at com.sun.jersey.test.framework.JerseyTest.getTestContainerFactory(JerseyTest.java:273)
	at com.sun.jersey.test.framework.JerseyTest.<init>(JerseyTest.java:217)
	at org.apache.hadoop.yarn.webapp.JerseyTestBase.<init>(JerseyTestBase.java:27)
	at org.apache.hadoop.yarn.server.timeline.webapp.TestTimelineWebServices.<init>(TestTimelineWebServices.java:169)


FAILED:  org.apache.hadoop.yarn.server.timeline.webapp.TestTimelineWebServices.testGetEntityFields2

Error Message:
The default test container factory, null, could not be instantiated

Stack Trace:
com.sun.jersey.test.framework.spi.container.TestContainerException: The default test container factory, null, could not be instantiated
	at com.sun.jersey.test.framework.JerseyTest.getDefaultTestContainerFactory(JerseyTest.java:406)
	at com.sun.jersey.test.framework.JerseyTest.getTestContainerFactory(JerseyTest.java:273)
	at com.sun.jersey.test.framework.JerseyTest.<init>(JerseyTest.java:217)
	at org.apache.hadoop.yarn.webapp.JerseyTestBase.<init>(JerseyTestBase.java:27)
	at org.apache.hadoop.yarn.server.timeline.webapp.TestTimelineWebServices.<init>(TestTimelineWebServices.java:169)


FAILED:  org.apache.hadoop.yarn.server.timeline.webapp.TestTimelineWebServices.testPrimaryFilterString

Error Message:
The default test container factory, null, could not be instantiated

Stack Trace:
com.sun.jersey.test.framework.spi.container.TestContainerException: The default test container factory, null, could not be instantiated
	at com.sun.jersey.test.framework.JerseyTest.getDefaultTestContainerFactory(JerseyTest.java:406)
	at com.sun.jersey.test.framework.JerseyTest.getTestContainerFactory(JerseyTest.java:273)
	at com.sun.jersey.test.framework.JerseyTest.<init>(JerseyTest.java:217)
	at org.apache.hadoop.yarn.webapp.JerseyTestBase.<init>(JerseyTestBase.java:27)
	at org.apache.hadoop.yarn.server.timeline.webapp.TestTimelineWebServices.<init>(TestTimelineWebServices.java:169)


FAILED:  org.apache.hadoop.yarn.server.timeline.webapp.TestTimelineWebServices.testGetDomainsYarnACLsEnabled

Error Message:
The default test container factory, null, could not be instantiated

Stack Trace:
com.sun.jersey.test.framework.spi.container.TestContainerException: The default test container factory, null, could not be instantiated
	at com.sun.jersey.test.framework.JerseyTest.getDefaultTestContainerFactory(JerseyTest.java:406)
	at com.sun.jersey.test.framework.JerseyTest.getTestContainerFactory(JerseyTest.java:273)
	at com.sun.jersey.test.framework.JerseyTest.<init>(JerseyTest.java:217)
	at org.apache.hadoop.yarn.webapp.JerseyTestBase.<init>(JerseyTestBase.java:27)
	at org.apache.hadoop.yarn.server.timeline.webapp.TestTimelineWebServices.<init>(TestTimelineWebServices.java:169)


FAILED:  org.apache.hadoop.yarn.server.timeline.webapp.TestTimelineWebServices.testGetDomainYarnACLsEnabled

Error Message:
The default test container factory, null, could not be instantiated

Stack Trace:
com.sun.jersey.test.framework.spi.container.TestContainerException: The default test container factory, null, could not be instantiated
	at com.sun.jersey.test.framework.JerseyTest.getDefaultTestContainerFactory(JerseyTest.java:406)
	at com.sun.jersey.test.framework.JerseyTest.getTestContainerFactory(JerseyTest.java:273)
	at com.sun.jersey.test.framework.JerseyTest.<init>(JerseyTest.java:217)
	at org.apache.hadoop.yarn.webapp.JerseyTestBase.<init>(JerseyTestBase.java:27)
	at org.apache.hadoop.yarn.server.timeline.webapp.TestTimelineWebServices.<init>(TestTimelineWebServices.java:169)


FAILED:  org.apache.hadoop.yarn.server.timeline.webapp.TestTimelineWebServices.testGetDomain

Error Message:
The default test container factory, null, could not be instantiated

Stack Trace:
com.sun.jersey.test.framework.spi.container.TestContainerException: The default test container factory, null, could not be instantiated
	at com.sun.jersey.test.framework.JerseyTest.getDefaultTestContainerFactory(JerseyTest.java:406)
	at com.sun.jersey.test.framework.JerseyTest.getTestContainerFactory(JerseyTest.java:273)
	at com.sun.jersey.test.framework.JerseyTest.<init>(JerseyTest.java:217)
	at org.apache.hadoop.yarn.webapp.JerseyTestBase.<init>(JerseyTestBase.java:27)
	at org.apache.hadoop.yarn.server.timeline.webapp.TestTimelineWebServices.<init>(TestTimelineWebServices.java:169)


FAILED:  org.apache.hadoop.yarn.server.timeline.webapp.TestTimelineWebServices.testGetEntity

Error Message:
The default test container factory, null, could not be instantiated

Stack Trace:
com.sun.jersey.test.framework.spi.container.TestContainerException: The default test container factory, null, could not be instantiated
	at com.sun.jersey.test.framework.JerseyTest.getDefaultTestContainerFactory(JerseyTest.java:406)
	at com.sun.jersey.test.framework.JerseyTest.getTestContainerFactory(JerseyTest.java:273)
	at com.sun.jersey.test.framework.JerseyTest.<init>(JerseyTest.java:217)
	at org.apache.hadoop.yarn.webapp.JerseyTestBase.<init>(JerseyTestBase.java:27)
	at org.apache.hadoop.yarn.server.timeline.webapp.TestTimelineWebServices.<init>(TestTimelineWebServices.java:169)


FAILED:  org.apache.hadoop.yarn.server.timeline.webapp.TestTimelineWebServices.testGetEvents

Error Message:
The default test container factory, null, could not be instantiated

Stack Trace:
com.sun.jersey.test.framework.spi.container.TestContainerException: The default test container factory, null, could not be instantiated
	at com.sun.jersey.test.framework.JerseyTest.getDefaultTestContainerFactory(JerseyTest.java:406)
	at com.sun.jersey.test.framework.JerseyTest.getTestContainerFactory(JerseyTest.java:273)
	at com.sun.jersey.test.framework.JerseyTest.<init>(JerseyTest.java:217)
	at org.apache.hadoop.yarn.webapp.JerseyTestBase.<init>(JerseyTestBase.java:27)
	at org.apache.hadoop.yarn.server.timeline.webapp.TestTimelineWebServices.<init>(TestTimelineWebServices.java:169)


FAILED:  org.apache.hadoop.yarn.server.timeline.webapp.TestTimelineWebServices.testPrimaryFilterInteger

Error Message:
The default test container factory, null, could not be instantiated

Stack Trace:
com.sun.jersey.test.framework.spi.container.TestContainerException: The default test container factory, null, could not be instantiated
	at com.sun.jersey.test.framework.JerseyTest.getDefaultTestContainerFactory(JerseyTest.java:406)
	at com.sun.jersey.test.framework.JerseyTest.getTestContainerFactory(JerseyTest.java:273)
	at com.sun.jersey.test.framework.JerseyTest.<init>(JerseyTest.java:217)
	at org.apache.hadoop.yarn.webapp.JerseyTestBase.<init>(JerseyTestBase.java:27)
	at org.apache.hadoop.yarn.server.timeline.webapp.TestTimelineWebServices.<init>(TestTimelineWebServices.java:169)


FAILED:  org.apache.hadoop.yarn.server.timeline.webapp.TestTimelineWebServices.testPostEntitiesWithYarnACLsEnabled

Error Message:
The default test container factory, null, could not be instantiated

Stack Trace:
com.sun.jersey.test.framework.spi.container.TestContainerException: The default test container factory, null, could not be instantiated
	at com.sun.jersey.test.framework.JerseyTest.getDefaultTestContainerFactory(JerseyTest.java:406)
	at com.sun.jersey.test.framework.JerseyTest.getTestContainerFactory(JerseyTest.java:273)
	at com.sun.jersey.test.framework.JerseyTest.<init>(JerseyTest.java:217)
	at org.apache.hadoop.yarn.webapp.JerseyTestBase.<init>(JerseyTestBase.java:27)
	at org.apache.hadoop.yarn.server.timeline.webapp.TestTimelineWebServices.<init>(TestTimelineWebServices.java:169)


FAILED:  org.apache.hadoop.yarn.server.timeline.webapp.TestTimelineWebServices.testFromId

Error Message:
The default test container factory, null, could not be instantiated

Stack Trace:
com.sun.jersey.test.framework.spi.container.TestContainerException: The default test container factory, null, could not be instantiated
	at com.sun.jersey.test.framework.JerseyTest.getDefaultTestContainerFactory(JerseyTest.java:406)
	at com.sun.jersey.test.framework.JerseyTest.getTestContainerFactory(JerseyTest.java:273)
	at com.sun.jersey.test.framework.JerseyTest.<init>(JerseyTest.java:217)
	at org.apache.hadoop.yarn.webapp.JerseyTestBase.<init>(JerseyTestBase.java:27)
	at org.apache.hadoop.yarn.server.timeline.webapp.TestTimelineWebServices.<init>(TestTimelineWebServices.java:169)


FAILED:  org.apache.hadoop.yarn.server.timeline.webapp.TestTimelineWebServices.testFromTs

Error Message:
The default test container factory, null, could not be instantiated

Stack Trace:
com.sun.jersey.test.framework.spi.container.TestContainerException: The default test container factory, null, could not be instantiated
	at com.sun.jersey.test.framework.JerseyTest.getDefaultTestContainerFactory(JerseyTest.java:406)
	at com.sun.jersey.test.framework.JerseyTest.getTestContainerFactory(JerseyTest.java:273)
	at com.sun.jersey.test.framework.JerseyTest.<init>(JerseyTest.java:217)
	at org.apache.hadoop.yarn.webapp.JerseyTestBase.<init>(JerseyTestBase.java:27)
	at org.apache.hadoop.yarn.server.timeline.webapp.TestTimelineWebServices.<init>(TestTimelineWebServices.java:169)


FAILED:  org.apache.hadoop.yarn.server.timeline.webapp.TestTimelineWebServices.testGetEventsWithYarnACLsEnabled

Error Message:
The default test container factory, null, could not be instantiated

Stack Trace:
com.sun.jersey.test.framework.spi.container.TestContainerException: The default test container factory, null, could not be instantiated
	at com.sun.jersey.test.framework.JerseyTest.getDefaultTestContainerFactory(JerseyTest.java:406)
	at com.sun.jersey.test.framework.JerseyTest.getTestContainerFactory(JerseyTest.java:273)
	at com.sun.jersey.test.framework.JerseyTest.<init>(JerseyTest.java:217)
	at org.apache.hadoop.yarn.webapp.JerseyTestBase.<init>(JerseyTestBase.java:27)
	at org.apache.hadoop.yarn.server.timeline.webapp.TestTimelineWebServices.<init>(TestTimelineWebServices.java:169)


FAILED:  org.apache.hadoop.yarn.server.timeline.webapp.TestTimelineWebServices.testGetEntitiesWithYarnACLsEnabled

Error Message:
The default test container factory, null, could not be instantiated

Stack Trace:
com.sun.jersey.test.framework.spi.container.TestContainerException: The default test container factory, null, could not be instantiated
	at com.sun.jersey.test.framework.JerseyTest.getDefaultTestContainerFactory(JerseyTest.java:406)
	at com.sun.jersey.test.framework.JerseyTest.getTestContainerFactory(JerseyTest.java:273)
	at com.sun.jersey.test.framework.JerseyTest.<init>(JerseyTest.java:217)
	at org.apache.hadoop.yarn.webapp.JerseyTestBase.<init>(JerseyTestBase.java:27)
	at org.apache.hadoop.yarn.server.timeline.webapp.TestTimelineWebServices.<init>(TestTimelineWebServices.java:169)


FAILED:  org.apache.hadoop.yarn.server.nodemanager.webapp.TestNMWebServices.testNodeInfoSlash

Error Message:
The default test container factory, null, could not be instantiated

Stack Trace:
com.sun.jersey.test.framework.spi.container.TestContainerException: The default test container factory, null, could not be instantiated
	at com.sun.jersey.test.framework.JerseyTest.getDefaultTestContainerFactory(JerseyTest.java:406)
	at com.sun.jersey.test.framework.JerseyTest.getTestContainerFactory(JerseyTest.java:273)
	at com.sun.jersey.test.framework.JerseyTest.<init>(JerseyTest.java:217)
	at org.apache.hadoop.yarn.webapp.JerseyTestBase.<init>(JerseyTestBase.java:27)
	at org.apache.hadoop.yarn.server.nodemanager.webapp.TestNMWebServices.<init>(TestNMWebServices.java:179)


FAILED:  org.apache.hadoop.yarn.server.nodemanager.webapp.TestNMWebServices.testInvalidUri2

Error Message:
The default test container factory, null, could not be instantiated

Stack Trace:
com.sun.jersey.test.framework.spi.container.TestContainerException: The default test container factory, null, could not be instantiated
	at com.sun.jersey.test.framework.JerseyTest.getDefaultTestContainerFactory(JerseyTest.java:406)
	at com.sun.jersey.test.framework.JerseyTest.getTestContainerFactory(JerseyTest.java:273)
	at com.sun.jersey.test.framework.JerseyTest.<init>(JerseyTest.java:217)
	at org.apache.hadoop.yarn.webapp.JerseyTestBase.<init>(JerseyTestBase.java:27)
	at org.apache.hadoop.yarn.server.nodemanager.webapp.TestNMWebServices.<init>(TestNMWebServices.java:179)


FAILED:  org.apache.hadoop.yarn.server.nodemanager.webapp.TestNMWebServices.testNode

Error Message:
The default test container factory, null, could not be instantiated

Stack Trace:
com.sun.jersey.test.framework.spi.container.TestContainerException: The default test container factory, null, could not be instantiated
	at com.sun.jersey.test.framework.JerseyTest.getDefaultTestContainerFactory(JerseyTest.java:406)
	at com.sun.jersey.test.framework.JerseyTest.getTestContainerFactory(JerseyTest.java:273)
	at com.sun.jersey.test.framework.JerseyTest.<init>(JerseyTest.java:217)
	at org.apache.hadoop.yarn.webapp.JerseyTestBase.<init>(JerseyTestBase.java:27)
	at org.apache.hadoop.yarn.server.nodemanager.webapp.TestNMWebServices.<init>(TestNMWebServices.java:179)


FAILED:  org.apache.hadoop.yarn.server.nodemanager.webapp.TestNMWebServices.testContainerLogs

Error Message:
The default test container factory, null, could not be instantiated

Stack Trace:
com.sun.jersey.test.framework.spi.container.TestContainerException: The default test container factory, null, could not be instantiated
	at com.sun.jersey.test.framework.JerseyTest.getDefaultTestContainerFactory(JerseyTest.java:406)
	at com.sun.jersey.test.framework.JerseyTest.getTestContainerFactory(JerseyTest.java:273)
	at com.sun.jersey.test.framework.JerseyTest.<init>(JerseyTest.java:217)
	at org.apache.hadoop.yarn.webapp.JerseyTestBase.<init>(JerseyTestBase.java:27)
	at org.apache.hadoop.yarn.server.nodemanager.webapp.TestNMWebServices.<init>(TestNMWebServices.java:179)


FAILED:  org.apache.hadoop.yarn.server.nodemanager.webapp.TestNMWebServices.testNodeInfoDefault

Error Message:
The default test container factory, null, could not be instantiated

Stack Trace:
com.sun.jersey.test.framework.spi.container.TestContainerException: The default test container factory, null, could not be instantiated
	at com.sun.jersey.test.framework.JerseyTest.getDefaultTestContainerFactory(JerseyTest.java:406)
	at com.sun.jersey.test.framework.JerseyTest.getTestContainerFactory(JerseyTest.java:273)
	at com.sun.jersey.test.framework.JerseyTest.<init>(JerseyTest.java:217)
	at org.apache.hadoop.yarn.webapp.JerseyTestBase.<init>(JerseyTestBase.java:27)
	at org.apache.hadoop.yarn.server.nodemanager.webapp.TestNMWebServices.<init>(TestNMWebServices.java:179)


FAILED:  org.apache.hadoop.yarn.server.nodemanager.webapp.TestNMWebServices.testSingleNodesXML

Error Message:
The default test container factory, null, could not be instantiated

Stack Trace:
com.sun.jersey.test.framework.spi.container.TestContainerException: The default test container factory, null, could not be instantiated
	at com.sun.jersey.test.framework.JerseyTest.getDefaultTestContainerFactory(JerseyTest.java:406)
	at com.sun.jersey.test.framework.JerseyTest.getTestContainerFactory(JerseyTest.java:273)
	at com.sun.jersey.test.framework.JerseyTest.<init>(JerseyTest.java:217)
	at org.apache.hadoop.yarn.webapp.JerseyTestBase.<init>(JerseyTestBase.java:27)
	at org.apache.hadoop.yarn.server.nodemanager.webapp.TestNMWebServices.<init>(TestNMWebServices.java:179)


FAILED:  org.apache.hadoop.yarn.server.nodemanager.webapp.TestNMWebServices.testInvalidAccept

Error Message:
The default test container factory, null, could not be instantiated

Stack Trace:
com.sun.jersey.test.framework.spi.container.TestContainerException: The default test container factory, null, could not be instantiated
	at com.sun.jersey.test.framework.JerseyTest.getDefaultTestContainerFactory(JerseyTest.java:406)
	at com.sun.jersey.test.framework.JerseyTest.getTestContainerFactory(JerseyTest.java:273)
	at com.sun.jersey.test.framework.JerseyTest.<init>(JerseyTest.java:217)
	at org.apache.hadoop.yarn.webapp.JerseyTestBase.<init>(JerseyTestBase.java:27)
	at org.apache.hadoop.yarn.server.nodemanager.webapp.TestNMWebServices.<init>(TestNMWebServices.java:179)


FAILED:  org.apache.hadoop.yarn.server.nodemanager.webapp.TestNMWebServices.testNodeSlash

Error Message:
The default test container factory, null, could not be instantiated

Stack Trace:
com.sun.jersey.test.framework.spi.container.TestContainerException: The default test container factory, null, could not be instantiated
	at com.sun.jersey.test.framework.JerseyTest.getDefaultTestContainerFactory(JerseyTest.java:406)
	at com.sun.jersey.test.framework.JerseyTest.getTestContainerFactory(JerseyTest.java:273)
	at com.sun.jersey.test.framework.JerseyTest.<init>(JerseyTest.java:217)
	at org.apache.hadoop.yarn.webapp.JerseyTestBase.<init>(JerseyTestBase.java:27)
	at org.apache.hadoop.yarn.server.nodemanager.webapp.TestNMWebServices.<init>(TestNMWebServices.java:179)


FAILED:  org.apache.hadoop.yarn.server.nodemanager.webapp.TestNMWebServices.testNodeDefault

Error Message:
The default test container factory, null, could not be instantiated

Stack Trace:
com.sun.jersey.test.framework.spi.container.TestContainerException: The default test container factory, null, could not be instantiated
	at com.sun.jersey.test.framework.JerseyTest.getDefaultTestContainerFactory(JerseyTest.java:406)
	at com.sun.jersey.test.framework.JerseyTest.getTestContainerFactory(JerseyTest.java:273)
	at com.sun.jersey.test.framework.JerseyTest.<init>(JerseyTest.java:217)
	at org.apache.hadoop.yarn.webapp.JerseyTestBase.<init>(JerseyTestBase.java:27)
	at org.apache.hadoop.yarn.server.nodemanager.webapp.TestNMWebServices.<init>(TestNMWebServices.java:179)


FAILED:  org.apache.hadoop.yarn.server.nodemanager.webapp.TestNMWebServices.testInvalidUri

Error Message:
The default test container factory, null, could not be instantiated

Stack Trace:
com.sun.jersey.test.framework.spi.container.TestContainerException: The default test container factory, null, could not be instantiated
	at com.sun.jersey.test.framework.JerseyTest.getDefaultTestContainerFactory(JerseyTest.java:406)
	at com.sun.jersey.test.framework.JerseyTest.getTestContainerFactory(JerseyTest.java:273)
	at com.sun.jersey.test.framework.JerseyTest.<init>(JerseyTest.java:217)
	at org.apache.hadoop.yarn.webapp.JerseyTestBase.<init>(JerseyTestBase.java:27)
	at org.apache.hadoop.yarn.server.nodemanager.webapp.TestNMWebServices.<init>(TestNMWebServices.java:179)


FAILED:  org.apache.hadoop.yarn.server.nodemanager.webapp.TestNMWebServices.testNodeInfo

Error Message:
The default test container factory, null, could not be instantiated

Stack Trace:
com.sun.jersey.test.framework.spi.container.TestContainerException: The default test container factory, null, could not be instantiated
	at com.sun.jersey.test.framework.JerseyTest.getDefaultTestContainerFactory(JerseyTest.java:406)
	at com.sun.jersey.test.framework.JerseyTest.getTestContainerFactory(JerseyTest.java:273)
	at com.sun.jersey.test.framework.JerseyTest.<init>(JerseyTest.java:217)
	at org.apache.hadoop.yarn.webapp.JerseyTestBase.<init>(JerseyTestBase.java:27)
	at org.apache.hadoop.yarn.server.nodemanager.webapp.TestNMWebServices.<init>(TestNMWebServices.java:179)


FAILED:  org.apache.hadoop.yarn.server.nodemanager.webapp.TestNMWebServicesApps.testNodeSingleAppsDefault

Error Message:
The default test container factory, null, could not be instantiated

Stack Trace:
com.sun.jersey.test.framework.spi.container.TestContainerException: The default test container factory, null, could not be instantiated
	at com.sun.jersey.test.framework.JerseyTest.getDefaultTestContainerFactory(JerseyTest.java:406)
	at com.sun.jersey.test.framework.JerseyTest.getTestContainerFactory(JerseyTest.java:273)
	at com.sun.jersey.test.framework.JerseyTest.<init>(JerseyTest.java:217)
	at org.apache.hadoop.yarn.webapp.JerseyTestBase.<init>(JerseyTestBase.java:27)
	at org.apache.hadoop.yarn.server.nodemanager.webapp.TestNMWebServicesApps.<init>(TestNMWebServicesApps.java:176)


FAILED:  org.apache.hadoop.yarn.server.nodemanager.webapp.TestNMWebServicesApps.testNodeSingleApps

Error Message:
The default test container factory, null, could not be instantiated

Stack Trace:
com.sun.jersey.test.framework.spi.container.TestContainerException: The default test container factory, null, could not be instantiated
	at com.sun.jersey.test.framework.JerseyTest.getDefaultTestContainerFactory(JerseyTest.java:406)
	at com.sun.jersey.test.framework.JerseyTest.getTestContainerFactory(JerseyTest.java:273)
	at com.sun.jersey.test.framework.JerseyTest.<init>(JerseyTest.java:217)
	at org.apache.hadoop.yarn.webapp.JerseyTestBase.<init>(JerseyTestBase.java:27)
	at org.apache.hadoop.yarn.server.nodemanager.webapp.TestNMWebServicesApps.<init>(TestNMWebServicesApps.java:176)


FAILED:  org.apache.hadoop.yarn.server.nodemanager.webapp.TestNMWebServicesApps.testNodeSingleAppsXML

Error Message:
The default test container factory, null, could not be instantiated

Stack Trace:
com.sun.jersey.test.framework.spi.container.TestContainerException: The default test container factory, null, could not be instantiated
	at com.sun.jersey.test.framework.JerseyTest.getDefaultTestContainerFactory(JerseyTest.java:406)
	at com.sun.jersey.test.framework.JerseyTest.getTestContainerFactory(JerseyTest.java:273)
	at com.sun.jersey.test.framework.JerseyTest.<init>(JerseyTest.java:217)
	at org.apache.hadoop.yarn.webapp.JerseyTestBase.<init>(JerseyTestBase.java:27)
	at org.apache.hadoop.yarn.server.nodemanager.webapp.TestNMWebServicesApps.<init>(TestNMWebServicesApps.java:176)


FAILED:  org.apache.hadoop.yarn.server.nodemanager.webapp.TestNMWebServicesApps.testNodeSingleAppsInvalid

Error Message:
The default test container factory, null, could not be instantiated

Stack Trace:
com.sun.jersey.test.framework.spi.container.TestContainerException: The default test container factory, null, could not be instantiated
	at com.sun.jersey.test.framework.JerseyTest.getDefaultTestContainerFactory(JerseyTest.java:406)
	at com.sun.jersey.test.framework.JerseyTest.getTestContainerFactory(JerseyTest.java:273)
	at com.sun.jersey.test.framework.JerseyTest.<init>(JerseyTest.java:217)
	at org.apache.hadoop.yarn.webapp.JerseyTestBase.<init>(JerseyTestBase.java:27)
	at org.apache.hadoop.yarn.server.nodemanager.webapp.TestNMWebServicesApps.<init>(TestNMWebServicesApps.java:176)


FAILED:  org.apache.hadoop.yarn.server.nodemanager.webapp.TestNMWebServicesApps.testNodeAppsDefault

Error Message:
The default test container factory, null, could not be instantiated

Stack Trace:
com.sun.jersey.test.framework.spi.container.TestContainerException: The default test container factory, null, could not be instantiated
	at com.sun.jersey.test.framework.JerseyTest.getDefaultTestContainerFactory(JerseyTest.java:406)
	at com.sun.jersey.test.framework.JerseyTest.getTestContainerFactory(JerseyTest.java:273)
	at com.sun.jersey.test.framework.JerseyTest.<init>(JerseyTest.java:217)
	at org.apache.hadoop.yarn.webapp.JerseyTestBase.<init>(JerseyTestBase.java:27)
	at org.apache.hadoop.yarn.server.nodemanager.webapp.TestNMWebServicesApps.<init>(TestNMWebServicesApps.java:176)


FAILED:  org.apache.hadoop.yarn.server.nodemanager.webapp.TestNMWebServicesApps.testNodeAppsSlash

Error Message:
The default test container factory, null, could not be instantiated

Stack Trace:
com.sun.jersey.test.framework.spi.container.TestContainerException: The default test container factory, null, could not be instantiated
	at com.sun.jersey.test.framework.JerseyTest.getDefaultTestContainerFactory(JerseyTest.java:406)
	at com.sun.jersey.test.framework.JerseyTest.getTestContainerFactory(JerseyTest.java:273)
	at com.sun.jersey.test.framework.JerseyTest.<init>(JerseyTest.java:217)
	at org.apache.hadoop.yarn.webapp.JerseyTestBase.<init>(JerseyTestBase.java:27)
	at org.apache.hadoop.yarn.server.nodemanager.webapp.TestNMWebServicesApps.<init>(TestNMWebServicesApps.java:176)


FAILED:  org.apache.hadoop.yarn.server.nodemanager.webapp.TestNMWebServicesApps.testNodeAppsState

Error Message:
The default test container factory, null, could not be instantiated

Stack Trace:
com.sun.jersey.test.framework.spi.container.TestContainerException: The default test container factory, null, could not be instantiated
	at com.sun.jersey.test.framework.JerseyTest.getDefaultTestContainerFactory(JerseyTest.java:406)
	at com.sun.jersey.test.framework.JerseyTest.getTestContainerFactory(JerseyTest.java:273)
	at com.sun.jersey.test.framework.JerseyTest.<init>(JerseyTest.java:217)
	at org.apache.hadoop.yarn.webapp.JerseyTestBase.<init>(JerseyTestBase.java:27)
	at org.apache.hadoop.yarn.server.nodemanager.webapp.TestNMWebServicesApps.<init>(TestNMWebServicesApps.java:176)


FAILED:  org.apache.hadoop.yarn.server.nodemanager.webapp.TestNMWebServicesApps.testNodeAppsXML

Error Message:
The default test container factory, null, could not be instantiated

Stack Trace:
com.sun.jersey.test.framework.spi.container.TestContainerException: The default test container factory, null, could not be instantiated
	at com.sun.jersey.test.framework.JerseyTest.getDefaultTestContainerFactory(JerseyTest.java:406)
	at com.sun.jersey.test.framework.JerseyTest.getTestContainerFactory(JerseyTest.java:273)
	at com.sun.jersey.test.framework.JerseyTest.<init>(JerseyTest.java:217)
	at org.apache.hadoop.yarn.webapp.JerseyTestBase.<init>(JerseyTestBase.java:27)
	at org.apache.hadoop.yarn.server.nodemanager.webapp.TestNMWebServicesApps.<init>(TestNMWebServicesApps.java:176)


FAILED:  org.apache.hadoop.yarn.server.nodemanager.webapp.TestNMWebServicesApps.testNodeAppsStateNone

Error Message:
The default test container factory, null, could not be instantiated

Stack Trace:
com.sun.jersey.test.framework.spi.container.TestContainerException: The default test container factory, null, could not be instantiated
	at com.sun.jersey.test.framework.JerseyTest.getDefaultTestContainerFactory(JerseyTest.java:406)
	at com.sun.jersey.test.framework.JerseyTest.getTestContainerFactory(JerseyTest.java:273)
	at com.sun.jersey.test.framework.JerseyTest.<init>(JerseyTest.java:217)
	at org.apache.hadoop.yarn.webapp.JerseyTestBase.<init>(JerseyTestBase.java:27)
	at org.apache.hadoop.yarn.server.nodemanager.webapp.TestNMWebServicesApps.<init>(TestNMWebServicesApps.java:176)


FAILED:  org.apache.hadoop.yarn.server.nodemanager.webapp.TestNMWebServicesApps.testNodeAppsStateInvalidDefault

Error Message:
The default test container factory, null, could not be instantiated

Stack Trace:
com.sun.jersey.test.framework.spi.container.TestContainerException: The default test container factory, null, could not be instantiated
	at com.sun.jersey.test.framework.JerseyTest.getDefaultTestContainerFactory(JerseyTest.java:406)
	at com.sun.jersey.test.framework.JerseyTest.getTestContainerFactory(JerseyTest.java:273)
	at com.sun.jersey.test.framework.JerseyTest.<init>(JerseyTest.java:217)
	at org.apache.hadoop.yarn.webapp.JerseyTestBase.<init>(JerseyTestBase.java:27)
	at org.apache.hadoop.yarn.server.nodemanager.webapp.TestNMWebServicesApps.<init>(TestNMWebServicesApps.java:176)


FAILED:  org.apache.hadoop.yarn.server.nodemanager.webapp.TestNMWebServicesApps.testNodeAppsStateInvalid

Error Message:
The default test container factory, null, could not be instantiated

Stack Trace:
com.sun.jersey.test.framework.spi.container.TestContainerException: The default test container factory, null, could not be instantiated
	at com.sun.jersey.test.framework.JerseyTest.getDefaultTestContainerFactory(JerseyTest.java:406)
	at com.sun.jersey.test.framework.JerseyTest.getTestContainerFactory(JerseyTest.java:273)
	at com.sun.jersey.test.framework.JerseyTest.<init>(JerseyTest.java:217)
	at org.apache.hadoop.yarn.webapp.JerseyTestBase.<init>(JerseyTestBase.java:27)
	at org.apache.hadoop.yarn.server.nodemanager.webapp.TestNMWebServicesApps.<init>(TestNMWebServicesApps.java:176)


FAILED:  org.apache.hadoop.yarn.server.nodemanager.webapp.TestNMWebServicesApps.testNodeSingleAppsSlash

Error Message:
The default test container factory, null, could not be instantiated

Stack Trace:
com.sun.jersey.test.framework.spi.container.TestContainerException: The default test container factory, null, could not be instantiated
	at com.sun.jersey.test.framework.JerseyTest.getDefaultTestContainerFactory(JerseyTest.java:406)
	at com.sun.jersey.test.framework.JerseyTest.getTestContainerFactory(JerseyTest.java:273)
	at com.sun.jersey.test.framework.JerseyTest.<init>(JerseyTest.java:217)
	at org.apache.hadoop.yarn.webapp.JerseyTestBase.<init>(JerseyTestBase.java:27)
	at org.apache.hadoop.yarn.server.nodemanager.webapp.TestNMWebServicesApps.<init>(TestNMWebServicesApps.java:176)


FAILED:  org.apache.hadoop.yarn.server.nodemanager.webapp.TestNMWebServicesApps.testNodeAppsNone

Error Message:
The default test container factory, null, could not be instantiated

Stack Trace:
com.sun.jersey.test.framework.spi.container.TestContainerException: The default test container factory, null, could not be instantiated
	at com.sun.jersey.test.framework.JerseyTest.getDefaultTestContainerFactory(JerseyTest.java:406)
	at com.sun.jersey.test.framework.JerseyTest.getTestContainerFactory(JerseyTest.java:273)
	at com.sun.jersey.test.framework.JerseyTest.<init>(JerseyTest.java:217)
	at org.apache.hadoop.yarn.webapp.JerseyTestBase.<init>(JerseyTestBase.java:27)
	at org.apache.hadoop.yarn.server.nodemanager.webapp.TestNMWebServicesApps.<init>(TestNMWebServicesApps.java:176)


FAILED:  org.apache.hadoop.yarn.server.nodemanager.webapp.TestNMWebServicesApps.testNodeAppsUser

Error Message:
The default test container factory, null, could not be instantiated

Stack Trace:
com.sun.jersey.test.framework.spi.container.TestContainerException: The default test container factory, null, could not be instantiated
	at com.sun.jersey.test.framework.JerseyTest.getDefaultTestContainerFactory(JerseyTest.java:406)
	at com.sun.jersey.test.framework.JerseyTest.getTestContainerFactory(JerseyTest.java:273)
	at com.sun.jersey.test.framework.JerseyTest.<init>(JerseyTest.java:217)
	at org.apache.hadoop.yarn.webapp.JerseyTestBase.<init>(JerseyTestBase.java:27)
	at org.apache.hadoop.yarn.server.nodemanager.webapp.TestNMWebServicesApps.<init>(TestNMWebServicesApps.java:176)


FAILED:  org.apache.hadoop.yarn.server.nodemanager.webapp.TestNMWebServicesApps.testNodeApps

Error Message:
The default test container factory, null, could not be instantiated

Stack Trace:
com.sun.jersey.test.framework.spi.container.TestContainerException: The default test container factory, null, could not be instantiated
	at com.sun.jersey.test.framework.JerseyTest.getDefaultTestContainerFactory(JerseyTest.java:406)
	at com.sun.jersey.test.framework.JerseyTest.getTestContainerFactory(JerseyTest.java:273)
	at com.sun.jersey.test.framework.JerseyTest.<init>(JerseyTest.java:217)
	at org.apache.hadoop.yarn.webapp.JerseyTestBase.<init>(JerseyTestBase.java:27)
	at org.apache.hadoop.yarn.server.nodemanager.webapp.TestNMWebServicesApps.<init>(TestNMWebServicesApps.java:176)


FAILED:  org.apache.hadoop.yarn.server.nodemanager.webapp.TestNMWebServicesApps.testNodeSingleAppsMissing

Error Message:
The default test container factory, null, could not be instantiated

Stack Trace:
com.sun.jersey.test.framework.spi.container.TestContainerException: The default test container factory, null, could not be instantiated
	at com.sun.jersey.test.framework.JerseyTest.getDefaultTestContainerFactory(JerseyTest.java:406)
	at com.sun.jersey.test.framework.JerseyTest.getTestContainerFactory(JerseyTest.java:273)
	at com.sun.jersey.test.framework.JerseyTest.<init>(JerseyTest.java:217)
	at org.apache.hadoop.yarn.webapp.JerseyTestBase.<init>(JerseyTestBase.java:27)
	at org.apache.hadoop.yarn.server.nodemanager.webapp.TestNMWebServicesApps.<init>(TestNMWebServicesApps.java:176)


FAILED:  org.apache.hadoop.yarn.server.nodemanager.webapp.TestNMWebServicesApps.testNodeAppsStateInvalidXML

Error Message:
The default test container factory, null, could not be instantiated

Stack Trace:
com.sun.jersey.test.framework.spi.container.TestContainerException: The default test container factory, null, could not be instantiated
	at com.sun.jersey.test.framework.JerseyTest.getDefaultTestContainerFactory(JerseyTest.java:406)
	at com.sun.jersey.test.framework.JerseyTest.getTestContainerFactory(JerseyTest.java:273)
	at com.sun.jersey.test.framework.JerseyTest.<init>(JerseyTest.java:217)
	at org.apache.hadoop.yarn.webapp.JerseyTestBase.<init>(JerseyTestBase.java:27)
	at org.apache.hadoop.yarn.server.nodemanager.webapp.TestNMWebServicesApps.<init>(TestNMWebServicesApps.java:176)


FAILED:  org.apache.hadoop.yarn.server.nodemanager.webapp.TestNMWebServicesApps.testNodeAppsUserEmpty

Error Message:
The default test container factory, null, could not be instantiated

Stack Trace:
com.sun.jersey.test.framework.spi.container.TestContainerException: The default test container factory, null, could not be instantiated
	at com.sun.jersey.test.framework.JerseyTest.getDefaultTestContainerFactory(JerseyTest.java:406)
	at com.sun.jersey.test.framework.JerseyTest.getTestContainerFactory(JerseyTest.java:273)
	at com.sun.jersey.test.framework.JerseyTest.<init>(JerseyTest.java:217)
	at org.apache.hadoop.yarn.webapp.JerseyTestBase.<init>(JerseyTestBase.java:27)
	at org.apache.hadoop.yarn.server.nodemanager.webapp.TestNMWebServicesApps.<init>(TestNMWebServicesApps.java:176)


FAILED:  org.apache.hadoop.yarn.server.nodemanager.webapp.TestNMWebServicesApps.testNodeAppsUserNone

Error Message:
The default test container factory, null, could not be instantiated

Stack Trace:
com.sun.jersey.test.framework.spi.container.TestContainerException: The default test container factory, null, could not be instantiated
	at com.sun.jersey.test.framework.JerseyTest.getDefaultTestContainerFactory(JerseyTest.java:406)
	at com.sun.jersey.test.framework.JerseyTest.getTestContainerFactory(JerseyTest.java:273)
	at com.sun.jersey.test.framework.JerseyTest.<init>(JerseyTest.java:217)
	at org.apache.hadoop.yarn.webapp.JerseyTestBase.<init>(JerseyTestBase.java:27)
	at org.apache.hadoop.yarn.server.nodemanager.webapp.TestNMWebServicesApps.<init>(TestNMWebServicesApps.java:176)


FAILED:  org.apache.hadoop.yarn.server.nodemanager.webapp.TestNMWebServicesContainers.testNodeContainerXML

Error Message:
The default test container factory, null, could not be instantiated

Stack Trace:
com.sun.jersey.test.framework.spi.container.TestContainerException: The default test container factory, null, could not be instantiated
	at com.sun.jersey.test.framework.JerseyTest.getDefaultTestContainerFactory(JerseyTest.java:406)
	at com.sun.jersey.test.framework.JerseyTest.getTestContainerFactory(JerseyTest.java:273)
	at com.sun.jersey.test.framework.JerseyTest.<init>(JerseyTest.java:217)
	at org.apache.hadoop.yarn.webapp.JerseyTestBase.<init>(JerseyTestBase.java:27)
	at org.apache.hadoop.yarn.server.nodemanager.webapp.TestNMWebServicesContainers.<init>(TestNMWebServicesContainers.java:180)


FAILED:  org.apache.hadoop.yarn.server.nodemanager.webapp.TestNMWebServicesContainers.testSingleContainerWrong

Error Message:
The default test container factory, null, could not be instantiated

Stack Trace:
com.sun.jersey.test.framework.spi.container.TestContainerException: The default test container factory, null, could not be instantiated
	at com.sun.jersey.test.framework.JerseyTest.getDefaultTestContainerFactory(JerseyTest.java:406)
	at com.sun.jersey.test.framework.JerseyTest.getTestContainerFactory(JerseyTest.java:273)
	at com.sun.jersey.test.framework.JerseyTest.<init>(JerseyTest.java:217)
	at org.apache.hadoop.yarn.webapp.JerseyTestBase.<init>(JerseyTestBase.java:27)
	at org.apache.hadoop.yarn.server.nodemanager.webapp.TestNMWebServicesContainers.<init>(TestNMWebServicesContainers.java:180)


FAILED:  org.apache.hadoop.yarn.server.nodemanager.webapp.TestNMWebServicesContainers.testNodeSingleContainersSlash

Error Message:
The default test container factory, null, could not be instantiated

Stack Trace:
com.sun.jersey.test.framework.spi.container.TestContainerException: The default test container factory, null, could not be instantiated
	at com.sun.jersey.test.framework.JerseyTest.getDefaultTestContainerFactory(JerseyTest.java:406)
	at com.sun.jersey.test.framework.JerseyTest.getTestContainerFactory(JerseyTest.java:273)
	at com.sun.jersey.test.framework.JerseyTest.<init>(JerseyTest.java:217)
	at org.apache.hadoop.yarn.webapp.JerseyTestBase.<init>(JerseyTestBase.java:27)
	at org.apache.hadoop.yarn.server.nodemanager.webapp.TestNMWebServicesContainers.<init>(TestNMWebServicesContainers.java:180)


FAILED:  org.apache.hadoop.yarn.server.nodemanager.webapp.TestNMWebServicesContainers.testNodeContainersNone

Error Message:
The default test container factory, null, could not be instantiated

Stack Trace:
com.sun.jersey.test.framework.spi.container.TestContainerException: The default test container factory, null, could not be instantiated
	at com.sun.jersey.test.framework.JerseyTest.getDefaultTestContainerFactory(JerseyTest.java:406)
	at com.sun.jersey.test.framework.JerseyTest.getTestContainerFactory(JerseyTest.java:273)
	at com.sun.jersey.test.framework.JerseyTest.<init>(JerseyTest.java:217)
	at org.apache.hadoop.yarn.webapp.JerseyTestBase.<init>(JerseyTestBase.java:27)
	at org.apache.hadoop.yarn.server.nodemanager.webapp.TestNMWebServicesContainers.<init>(TestNMWebServicesContainers.java:180)


FAILED:  org.apache.hadoop.yarn.server.nodemanager.webapp.TestNMWebServicesContainers.testNodeSingleContainerXML

Error Message:
The default test container factory, null, could not be instantiated

Stack Trace:
com.sun.jersey.test.framework.spi.container.TestContainerException: The default test container factory, null, could not be instantiated
	at com.sun.jersey.test.framework.JerseyTest.getDefaultTestContainerFactory(JerseyTest.java:406)
	at com.sun.jersey.test.framework.JerseyTest.getTestContainerFactory(JerseyTest.java:273)
	at com.sun.jersey.test.framework.JerseyTest.<init>(JerseyTest.java:217)
	at org.apache.hadoop.yarn.webapp.JerseyTestBase.<init>(JerseyTestBase.java:27)
	at org.apache.hadoop.yarn.server.nodemanager.webapp.TestNMWebServicesContainers.<init>(TestNMWebServicesContainers.java:180)


FAILED:  org.apache.hadoop.yarn.server.nodemanager.webapp.TestNMWebServicesContainers.testNodeContainersSlash

Error Message:
The default test container factory, null, could not be instantiated

Stack Trace:
com.sun.jersey.test.framework.spi.container.TestContainerException: The default test container factory, null, could not be instantiated
	at com.sun.jersey.test.framework.JerseyTest.getDefaultTestContainerFactory(JerseyTest.java:406)
	at com.sun.jersey.test.framework.JerseyTest.getTestContainerFactory(JerseyTest.java:273)
	at com.sun.jersey.test.framework.JerseyTest.<init>(JerseyTest.java:217)
	at org.apache.hadoop.yarn.webapp.JerseyTestBase.<init>(JerseyTestBase.java:27)
	at org.apache.hadoop.yarn.server.nodemanager.webapp.TestNMWebServicesContainers.<init>(TestNMWebServicesContainers.java:180)


FAILED:  org.apache.hadoop.yarn.server.nodemanager.webapp.TestNMWebServicesContainers.testNodeContainersDefault

Error Message:
The default test container factory, null, could not be instantiated

Stack Trace:
com.sun.jersey.test.framework.spi.container.TestContainerException: The default test container factory, null, could not be instantiated
	at com.sun.jersey.test.framework.JerseyTest.getDefaultTestContainerFactory(JerseyTest.java:406)
	at com.sun.jersey.test.framework.JerseyTest.getTestContainerFactory(JerseyTest.java:273)
	at com.sun.jersey.test.framework.JerseyTest.<init>(JerseyTest.java:217)
	at org.apache.hadoop.yarn.webapp.JerseyTestBase.<init>(JerseyTestBase.java:27)
	at org.apache.hadoop.yarn.server.nodemanager.webapp.TestNMWebServicesContainers.<init>(TestNMWebServicesContainers.java:180)


FAILED:  org.apache.hadoop.yarn.server.nodemanager.webapp.TestNMWebServicesContainers.testNodeSingleContainersDefault

Error Message:
The default test container factory, null, could not be instantiated

Stack Trace:
com.sun.jersey.test.framework.spi.container.TestContainerException: The default test container factory, null, could not be instantiated
	at com.sun.jersey.test.framework.JerseyTest.getDefaultTestContainerFactory(JerseyTest.java:406)
	at com.sun.jersey.test.framework.JerseyTest.getTestContainerFactory(JerseyTest.java:273)
	at com.sun.jersey.test.framework.JerseyTest.<init>(JerseyTest.java:217)
	at org.apache.hadoop.yarn.webapp.JerseyTestBase.<init>(JerseyTestBase.java:27)
	at org.apache.hadoop.yarn.server.nodemanager.webapp.TestNMWebServicesContainers.<init>(TestNMWebServicesContainers.java:180)


FAILED:  org.apache.hadoop.yarn.server.nodemanager.webapp.TestNMWebServicesContainers.testSingleContainerInvalid

Error Message:
The default test container factory, null, could not be instantiated

Stack Trace:
com.sun.jersey.test.framework.spi.container.TestContainerException: The default test container factory, null, could not be instantiated
	at com.sun.jersey.test.framework.JerseyTest.getDefaultTestContainerFactory(JerseyTest.java:406)
	at com.sun.jersey.test.framework.JerseyTest.getTestContainerFactory(JerseyTest.java:273)
	at com.sun.jersey.test.framework.JerseyTest.<init>(JerseyTest.java:217)
	at org.apache.hadoop.yarn.webapp.JerseyTestBase.<init>(JerseyTestBase.java:27)
	at org.apache.hadoop.yarn.server.nodemanager.webapp.TestNMWebServicesContainers.<init>(TestNMWebServicesContainers.java:180)


FAILED:  org.apache.hadoop.yarn.server.nodemanager.webapp.TestNMWebServicesContainers.testSingleContainerInvalid2

Error Message:
The default test container factory, null, could not be instantiated

Stack Trace:
com.sun.jersey.test.framework.spi.container.TestContainerException: The default test container factory, null, could not be instantiated
	at com.sun.jersey.test.framework.JerseyTest.getDefaultTestContainerFactory(JerseyTest.java:406)
	at com.sun.jersey.test.framework.JerseyTest.getTestContainerFactory(JerseyTest.java:273)
	at com.sun.jersey.test.framework.JerseyTest.<init>(JerseyTest.java:217)
	at org.apache.hadoop.yarn.webapp.JerseyTestBase.<init>(JerseyTestBase.java:27)
	at org.apache.hadoop.yarn.server.nodemanager.webapp.TestNMWebServicesContainers.<init>(TestNMWebServicesContainers.java:180)


FAILED:  org.apache.hadoop.yarn.server.nodemanager.webapp.TestNMWebServicesContainers.testNodeContainers

Error Message:
The default test container factory, null, could not be instantiated

Stack Trace:
com.sun.jersey.test.framework.spi.container.TestContainerException: The default test container factory, null, could not be instantiated
	at com.sun.jersey.test.framework.JerseyTest.getDefaultTestContainerFactory(JerseyTest.java:406)
	at com.sun.jersey.test.framework.JerseyTest.getTestContainerFactory(JerseyTest.java:273)
	at com.sun.jersey.test.framework.JerseyTest.<init>(JerseyTest.java:217)
	at org.apache.hadoop.yarn.webapp.JerseyTestBase.<init>(JerseyTestBase.java:27)
	at org.apache.hadoop.yarn.server.nodemanager.webapp.TestNMWebServicesContainers.<init>(TestNMWebServicesContainers.java:180)


FAILED:  org.apache.hadoop.yarn.server.nodemanager.webapp.TestNMWebServicesContainers.testNodeSingleContainers

Error Message:
The default test container factory, null, could not be instantiated

Stack Trace:
com.sun.jersey.test.framework.spi.container.TestContainerException: The default test container factory, null, could not be instantiated
	at com.sun.jersey.test.framework.JerseyTest.getDefaultTestContainerFactory(JerseyTest.java:406)
	at com.sun.jersey.test.framework.JerseyTest.getTestContainerFactory(JerseyTest.java:273)
	at com.sun.jersey.test.framework.JerseyTest.<init>(JerseyTest.java:217)
	at org.apache.hadoop.yarn.webapp.JerseyTestBase.<init>(JerseyTestBase.java:27)
	at org.apache.hadoop.yarn.server.nodemanager.webapp.TestNMWebServicesContainers.<init>(TestNMWebServicesContainers.java:180)


FAILED:  org.apache.hadoop.yarn.server.resourcemanager.TestRM.testAppOnMultiNode[1]

Error Message:
test timed out after 30000 milliseconds

Stack Trace:
java.lang.Exception: test timed out after 30000 milliseconds
	at java.net.Inet4AddressImpl.lookupAllHostAddr(Native Method)
	at java.net.InetAddress$1.lookupAllHostAddr(InetAddress.java:901)
	at java.net.InetAddress.getAddressesFromNameService(InetAddress.java:1293)
	at java.net.InetAddress.getAllByName0(InetAddress.java:1246)
	at java.net.InetAddress.getAllByName(InetAddress.java:1162)
	at java.net.InetAddress.getAllByName(InetAddress.java:1098)
	at java.net.InetAddress.getByName(InetAddress.java:1048)
	at org.apache.hadoop.net.NetUtils.normalizeHostName(NetUtils.java:563)
	at org.apache.hadoop.yarn.server.resourcemanager.NodesListManager.isValidNode(NodesListManager.java:147)
	at org.apache.hadoop.yarn.server.resourcemanager.ResourceTrackerService.nodeHeartbeat(ResourceTrackerService.java:402)
	at org.apache.hadoop.yarn.server.resourcemanager.MockNM.nodeHeartbeat(MockNM.java:178)
	at org.apache.hadoop.yarn.server.resourcemanager.MockNM.nodeHeartbeat(MockNM.java:136)
	at org.apache.hadoop.yarn.server.resourcemanager.TestRM.testAppOnMultiNode(TestRM.java:187)


FAILED:  org.apache.hadoop.yarn.server.resourcemanager.webapp.TestRMWebServices.testInvalidUri2

Error Message:
The default test container factory, null, could not be instantiated

Stack Trace:
com.sun.jersey.test.framework.spi.container.TestContainerException: The default test container factory, null, could not be instantiated
	at com.sun.jersey.test.framework.JerseyTest.getDefaultTestContainerFactory(JerseyTest.java:406)
	at com.sun.jersey.test.framework.JerseyTest.getTestContainerFactory(JerseyTest.java:273)
	at com.sun.jersey.test.framework.JerseyTest.<init>(JerseyTest.java:217)
	at org.apache.hadoop.yarn.webapp.JerseyTestBase.<init>(JerseyTestBase.java:27)
	at org.apache.hadoop.yarn.server.resourcemanager.webapp.TestRMWebServices.<init>(TestRMWebServices.java:117)


FAILED:  org.apache.hadoop.yarn.server.resourcemanager.webapp.TestRMWebServices.testClusterSchedulerFifoXML

Error Message:
The default test container factory, null, could not be instantiated

Stack Trace:
com.sun.jersey.test.framework.spi.container.TestContainerException: The default test container factory, null, could not be instantiated
	at com.sun.jersey.test.framework.JerseyTest.getDefaultTestContainerFactory(JerseyTest.java:406)
	at com.sun.jersey.test.framework.JerseyTest.getTestContainerFactory(JerseyTest.java:273)
	at com.sun.jersey.test.framework.JerseyTest.<init>(JerseyTest.java:217)
	at org.apache.hadoop.yarn.webapp.JerseyTestBase.<init>(JerseyTestBase.java:27)
	at org.apache.hadoop.yarn.server.resourcemanager.webapp.TestRMWebServices.<init>(TestRMWebServices.java:117)


FAILED:  org.apache.hadoop.yarn.server.resourcemanager.webapp.TestRMWebServices.testInfo

Error Message:
The default test container factory, null, could not be instantiated

Stack Trace:
com.sun.jersey.test.framework.spi.container.TestContainerException: The default test container factory, null, could not be instantiated
	at com.sun.jersey.test.framework.JerseyTest.getDefaultTestContainerFactory(JerseyTest.java:406)
	at com.sun.jersey.test.framework.JerseyTest.getTestContainerFactory(JerseyTest.java:273)
	at com.sun.jersey.test.framework.JerseyTest.<init>(JerseyTest.java:217)
	at org.apache.hadoop.yarn.webapp.JerseyTestBase.<init>(JerseyTestBase.java:27)
	at org.apache.hadoop.yarn.server.resourcemanager.webapp.TestRMWebServices.<init>(TestRMWebServices.java:117)


FAILED:  org.apache.hadoop.yarn.server.resourcemanager.webapp.TestRMWebServices.testInfoDefault

Error Message:
The default test container factory, null, could not be instantiated

Stack Trace:
com.sun.jersey.test.framework.spi.container.TestContainerException: The default test container factory, null, could not be instantiated
	at com.sun.jersey.test.framework.JerseyTest.getDefaultTestContainerFactory(JerseyTest.java:406)
	at com.sun.jersey.test.framework.JerseyTest.getTestContainerFactory(JerseyTest.java:273)
	at com.sun.jersey.test.framework.JerseyTest.<init>(JerseyTest.java:217)
	at org.apache.hadoop.yarn.webapp.JerseyTestBase.<init>(JerseyTestBase.java:27)
	at org.apache.hadoop.yarn.server.resourcemanager.webapp.TestRMWebServices.<init>(TestRMWebServices.java:117)


FAILED:  org.apache.hadoop.yarn.server.resourcemanager.webapp.TestRMWebServices.testClusterSchedulerFifo

Error Message:
The default test container factory, null, could not be instantiated

Stack Trace:
com.sun.jersey.test.framework.spi.container.TestContainerException: The default test container factory, null, could not be instantiated
	at com.sun.jersey.test.framework.JerseyTest.getDefaultTestContainerFactory(JerseyTest.java:406)
	at com.sun.jersey.test.framework.JerseyTest.getTestContainerFactory(JerseyTest.java:273)
	at com.sun.jersey.test.framework.JerseyTest.<init>(JerseyTest.java:217)
	at org.apache.hadoop.yarn.webapp.JerseyTestBase.<init>(JerseyTestBase.java:27)
	at org.apache.hadoop.yarn.server.resourcemanager.webapp.TestRMWebServices.<init>(TestRMWebServices.java:117)


FAILED:  org.apache.hadoop.yarn.server.resourcemanager.webapp.TestRMWebServices.testClusterMetricsSlash

Error Message:
The default test container factory, null, could not be instantiated

Stack Trace:
com.sun.jersey.test.framework.spi.container.TestContainerException: The default test container factory, null, could not be instantiated
	at com.sun.jersey.test.framework.JerseyTest.getDefaultTestContainerFactory(JerseyTest.java:406)
	at com.sun.jersey.test.framework.JerseyTest.getTestContainerFactory(JerseyTest.java:273)
	at com.sun.jersey.test.framework.JerseyTest.<init>(JerseyTest.java:217)
	at org.apache.hadoop.yarn.webapp.JerseyTestBase.<init>(JerseyTestBase.java:27)
	at org.apache.hadoop.yarn.server.resourcemanager.webapp.TestRMWebServices.<init>(TestRMWebServices.java:117)


FAILED:  org.apache.hadoop.yarn.server.resourcemanager.webapp.TestRMWebServices.testClusterSlash

Error Message:
The default test container factory, null, could not be instantiated

Stack Trace:
com.sun.jersey.test.framework.spi.container.TestContainerException: The default test container factory, null, could not be instantiated
	at com.sun.jersey.test.framework.JerseyTest.getDefaultTestContainerFactory(JerseyTest.java:406)
	at com.sun.jersey.test.framework.JerseyTest.getTestContainerFactory(JerseyTest.java:273)
	at com.sun.jersey.test.framework.JerseyTest.<init>(JerseyTest.java:217)
	at org.apache.hadoop.yarn.webapp.JerseyTestBase.<init>(JerseyTestBase.java:27)
	at org.apache.hadoop.yarn.server.resourcemanager.webapp.TestRMWebServices.<init>(TestRMWebServices.java:117)


FAILED:  org.apache.hadoop.yarn.server.resourcemanager.webapp.TestRMWebServices.testInvalidAccept

Error Message:
The default test container factory, null, could not be instantiated

Stack Trace:
com.sun.jersey.test.framework.spi.container.TestContainerException: The default test container factory, null, could not be instantiated
	at com.sun.jersey.test.framework.JerseyTest.getDefaultTestContainerFactory(JerseyTest.java:406)
	at com.sun.jersey.test.framework.JerseyTest.getTestContainerFactory(JerseyTest.java:273)
	at com.sun.jersey.test.framework.JerseyTest.<init>(JerseyTest.java:217)
	at org.apache.hadoop.yarn.webapp.JerseyTestBase.<init>(JerseyTestBase.java:27)
	at org.apache.hadoop.yarn.server.resourcemanager.webapp.TestRMWebServices.<init>(TestRMWebServices.java:117)


FAILED:  org.apache.hadoop.yarn.server.resourcemanager.webapp.TestRMWebServices.testClusterMetricsXML

Error Message:
The default test container factory, null, could not be instantiated

Stack Trace:
com.sun.jersey.test.framework.spi.container.TestContainerException: The default test container factory, null, could not be instantiated
	at com.sun.jersey.test.framework.JerseyTest.getDefaultTestContainerFactory(JerseyTest.java:406)
	at com.sun.jersey.test.framework.JerseyTest.getTestContainerFactory(JerseyTest.java:273)
	at com.sun.jersey.test.framework.JerseyTest.<init>(JerseyTest.java:217)
	at org.apache.hadoop.yarn.webapp.JerseyTestBase.<init>(JerseyTestBase.java:27)
	at org.apache.hadoop.yarn.server.resourcemanager.webapp.TestRMWebServices.<init>(TestRMWebServices.java:117)


FAILED:  org.apache.hadoop.yarn.server.resourcemanager.webapp.TestRMWebServices.testCluster

Error Message:
The default test container factory, null, could not be instantiated

Stack Trace:
com.sun.jersey.test.framework.spi.container.TestContainerException: The default test container factory, null, could not be instantiated
	at com.sun.jersey.test.framework.JerseyTest.getDefaultTestContainerFactory(JerseyTest.java:406)
	at com.sun.jersey.test.framework.JerseyTest.getTestContainerFactory(JerseyTest.java:273)
	at com.sun.jersey.test.framework.JerseyTest.<init>(JerseyTest.java:217)
	at org.apache.hadoop.yarn.webapp.JerseyTestBase.<init>(JerseyTestBase.java:27)
	at org.apache.hadoop.yarn.server.resourcemanager.webapp.TestRMWebServices.<init>(TestRMWebServices.java:117)


FAILED:  org.apache.hadoop.yarn.server.resourcemanager.webapp.TestRMWebServices.testClusterMetrics

Error Message:
The default test container factory, null, could not be instantiated

Stack Trace:
com.sun.jersey.test.framework.spi.container.TestContainerException: The default test container factory, null, could not be instantiated
	at com.sun.jersey.test.framework.JerseyTest.getDefaultTestContainerFactory(JerseyTest.java:406)
	at com.sun.jersey.test.framework.JerseyTest.getTestContainerFactory(JerseyTest.java:273)
	at com.sun.jersey.test.framework.JerseyTest.<init>(JerseyTest.java:217)
	at org.apache.hadoop.yarn.webapp.JerseyTestBase.<init>(JerseyTestBase.java:27)
	at org.apache.hadoop.yarn.server.resourcemanager.webapp.TestRMWebServices.<init>(TestRMWebServices.java:117)


FAILED:  org.apache.hadoop.yarn.server.resourcemanager.webapp.TestRMWebServices.testClusterSchedulerFifoDefault

Error Message:
The default test container factory, null, could not be instantiated

Stack Trace:
com.sun.jersey.test.framework.spi.container.TestContainerException: The default test container factory, null, could not be instantiated
	at com.sun.jersey.test.framework.JerseyTest.getDefaultTestContainerFactory(JerseyTest.java:406)
	at com.sun.jersey.test.framework.JerseyTest.getTestContainerFactory(JerseyTest.java:273)
	at com.sun.jersey.test.framework.JerseyTest.<init>(JerseyTest.java:217)
	at org.apache.hadoop.yarn.webapp.JerseyTestBase.<init>(JerseyTestBase.java:27)
	at org.apache.hadoop.yarn.server.resourcemanager.webapp.TestRMWebServices.<init>(TestRMWebServices.java:117)


FAILED:  org.apache.hadoop.yarn.server.resourcemanager.webapp.TestRMWebServices.testClusterSchedulerFifoSlash

Error Message:
The default test container factory, null, could not be instantiated

Stack Trace:
com.sun.jersey.test.framework.spi.container.TestContainerException: The default test container factory, null, could not be instantiated
	at com.sun.jersey.test.framework.JerseyTest.getDefaultTestContainerFactory(JerseyTest.java:406)
	at com.sun.jersey.test.framework.JerseyTest.getTestContainerFactory(JerseyTest.java:273)
	at com.sun.jersey.test.framework.JerseyTest.<init>(JerseyTest.java:217)
	at org.apache.hadoop.yarn.webapp.JerseyTestBase.<init>(JerseyTestBase.java:27)
	at org.apache.hadoop.yarn.server.resourcemanager.webapp.TestRMWebServices.<init>(TestRMWebServices.java:117)


FAILED:  org.apache.hadoop.yarn.server.resourcemanager.webapp.TestRMWebServices.testClusterMetricsDefault

Error Message:
The default test container factory, null, could not be instantiated

Stack Trace:
com.sun.jersey.test.framework.spi.container.TestContainerException: The default test container factory, null, could not be instantiated
	at com.sun.jersey.test.framework.JerseyTest.getDefaultTestContainerFactory(JerseyTest.java:406)
	at com.sun.jersey.test.framework.JerseyTest.getTestContainerFactory(JerseyTest.java:273)
	at com.sun.jersey.test.framework.JerseyTest.<init>(JerseyTest.java:217)
	at org.apache.hadoop.yarn.webapp.JerseyTestBase.<init>(JerseyTestBase.java:27)
	at org.apache.hadoop.yarn.server.resourcemanager.webapp.TestRMWebServices.<init>(TestRMWebServices.java:117)


FAILED:  org.apache.hadoop.yarn.server.resourcemanager.webapp.TestRMWebServices.testClusterDefault

Error Message:
The default test container factory, null, could not be instantiated

Stack Trace:
com.sun.jersey.test.framework.spi.container.TestContainerException: The default test container factory, null, could not be instantiated
	at com.sun.jersey.test.framework.JerseyTest.getDefaultTestContainerFactory(JerseyTest.java:406)
	at com.sun.jersey.test.framework.JerseyTest.getTestContainerFactory(JerseyTest.java:273)
	at com.sun.jersey.test.framework.JerseyTest.<init>(JerseyTest.java:217)
	at org.apache.hadoop.yarn.webapp.JerseyTestBase.<init>(JerseyTestBase.java:27)
	at org.apache.hadoop.yarn.server.resourcemanager.webapp.TestRMWebServices.<init>(TestRMWebServices.java:117)


FAILED:  org.apache.hadoop.yarn.server.resourcemanager.webapp.TestRMWebServices.testInfoXML

Error Message:
The default test container factory, null, could not be instantiated

Stack Trace:
com.sun.jersey.test.framework.spi.container.TestContainerException: The default test container factory, null, could not be instantiated
	at com.sun.jersey.test.framework.JerseyTest.getDefaultTestContainerFactory(JerseyTest.java:406)
	at com.sun.jersey.test.framework.JerseyTest.getTestContainerFactory(JerseyTest.java:273)
	at com.sun.jersey.test.framework.JerseyTest.<init>(JerseyTest.java:217)
	at org.apache.hadoop.yarn.webapp.JerseyTestBase.<init>(JerseyTestBase.java:27)
	at org.apache.hadoop.yarn.server.resourcemanager.webapp.TestRMWebServices.<init>(TestRMWebServices.java:117)


FAILED:  org.apache.hadoop.yarn.server.resourcemanager.webapp.TestRMWebServices.testInvalidUri

Error Message:
The default test container factory, null, could not be instantiated

Stack Trace:
com.sun.jersey.test.framework.spi.container.TestContainerException: The default test container factory, null, could not be instantiated
	at com.sun.jersey.test.framework.JerseyTest.getDefaultTestContainerFactory(JerseyTest.java:406)
	at com.sun.jersey.test.framework.JerseyTest.getTestContainerFactory(JerseyTest.java:273)
	at com.sun.jersey.test.framework.JerseyTest.<init>(JerseyTest.java:217)
	at org.apache.hadoop.yarn.webapp.JerseyTestBase.<init>(JerseyTestBase.java:27)
	at org.apache.hadoop.yarn.server.resourcemanager.webapp.TestRMWebServices.<init>(TestRMWebServices.java:117)


FAILED:  org.apache.hadoop.yarn.server.resourcemanager.webapp.TestRMWebServices.testInfoSlash

Error Message:
The default test container factory, null, could not be instantiated

Stack Trace:
com.sun.jersey.test.framework.spi.container.TestContainerException: The default test container factory, null, could not be instantiated
	at com.sun.jersey.test.framework.JerseyTest.getDefaultTestContainerFactory(JerseyTest.java:406)
	at com.sun.jersey.test.framework.JerseyTest.getTestContainerFactory(JerseyTest.java:273)
	at com.sun.jersey.test.framework.JerseyTest.<init>(JerseyTest.java:217)
	at org.apache.hadoop.yarn.webapp.JerseyTestBase.<init>(JerseyTestBase.java:27)
	at org.apache.hadoop.yarn.server.resourcemanager.webapp.TestRMWebServices.<init>(TestRMWebServices.java:117)


FAILED:  org.apache.hadoop.yarn.server.resourcemanager.webapp.TestRMWebServices.testAppsRace

Error Message:
The default test container factory, null, could not be instantiated

Stack Trace:
com.sun.jersey.test.framework.spi.container.TestContainerException: The default test container factory, null, could not be instantiated
	at com.sun.jersey.test.framework.JerseyTest.getDefaultTestContainerFactory(JerseyTest.java:406)
	at com.sun.jersey.test.framework.JerseyTest.getTestContainerFactory(JerseyTest.java:273)
	at com.sun.jersey.test.framework.JerseyTest.<init>(JerseyTest.java:217)
	at org.apache.hadoop.yarn.webapp.JerseyTestBase.<init>(JerseyTestBase.java:27)
	at org.apache.hadoop.yarn.server.resourcemanager.webapp.TestRMWebServices.<init>(TestRMWebServices.java:117)


FAILED:  org.apache.hadoop.yarn.server.resourcemanager.webapp.TestRMWebServicesApps.testAppAttemptsSlash

Error Message:
The default test container factory, null, could not be instantiated

Stack Trace:
com.sun.jersey.test.framework.spi.container.TestContainerException: The default test container factory, null, could not be instantiated
	at com.sun.jersey.test.framework.JerseyTest.getDefaultTestContainerFactory(JerseyTest.java:406)
	at com.sun.jersey.test.framework.JerseyTest.getTestContainerFactory(JerseyTest.java:273)
	at com.sun.jersey.test.framework.JerseyTest.<init>(JerseyTest.java:217)
	at org.apache.hadoop.yarn.webapp.JerseyTestBase.<init>(JerseyTestBase.java:27)
	at org.apache.hadoop.yarn.server.resourcemanager.webapp.TestRMWebServicesApps.<init>(TestRMWebServicesApps.java:111)


FAILED:  org.apache.hadoop.yarn.server.resourcemanager.webapp.TestRMWebServicesApps.testAppsQueryStartBeginEnd

Error Message:
The default test container factory, null, could not be instantiated

Stack Trace:
com.sun.jersey.test.framework.spi.container.TestContainerException: The default test container factory, null, could not be instantiated
	at com.sun.jersey.test.framework.JerseyTest.getDefaultTestContainerFactory(JerseyTest.java:406)
	at com.sun.jersey.test.framework.JerseyTest.getTestContainerFactory(JerseyTest.java:273)
	at com.sun.jersey.test.framework.JerseyTest.<init>(JerseyTest.java:217)
	at org.apache.hadoop.yarn.webapp.JerseyTestBase.<init>(JerseyTestBase.java:27)
	at org.apache.hadoop.yarn.server.resourcemanager.webapp.TestRMWebServicesApps.<init>(TestRMWebServicesApps.java:111)


FAILED:  org.apache.hadoop.yarn.server.resourcemanager.webapp.TestRMWebServicesApps.testAppsQueryStartBeginSome

Error Message:
The default test container factory, null, could not be instantiated

Stack Trace:
com.sun.jersey.test.framework.spi.container.TestContainerException: The default test container factory, null, could not be instantiated
	at com.sun.jersey.test.framework.JerseyTest.getDefaultTestContainerFactory(JerseyTest.java:406)
	at com.sun.jersey.test.framework.JerseyTest.getTestContainerFactory(JerseyTest.java:273)
	at com.sun.jersey.test.framework.JerseyTest.<init>(JerseyTest.java:217)
	at org.apache.hadoop.yarn.webapp.JerseyTestBase.<init>(JerseyTestBase.java:27)
	at org.apache.hadoop.yarn.server.resourcemanager.webapp.TestRMWebServicesApps.<init>(TestRMWebServicesApps.java:111)


FAILED:  org.apache.hadoop.yarn.server.resourcemanager.webapp.TestRMWebServicesApps.testAppsQueryStateNone

Error Message:
The default test container factory, null, could not be instantiated

Stack Trace:
com.sun.jersey.test.framework.spi.container.TestContainerException: The default test container factory, null, could not be instantiated
	at com.sun.jersey.test.framework.JerseyTest.getDefaultTestContainerFactory(JerseyTest.java:406)
	at com.sun.jersey.test.framework.JerseyTest.getTestContainerFactory(JerseyTest.java:273)
	at com.sun.jersey.test.framework.JerseyTest.<init>(JerseyTest.java:217)
	at org.apache.hadoop.yarn.webapp.JerseyTestBase.<init>(JerseyTestBase.java:27)
	at org.apache.hadoop.yarn.server.resourcemanager.webapp.TestRMWebServicesApps.<init>(TestRMWebServicesApps.java:111)


FAILED:  org.apache.hadoop.yarn.server.resourcemanager.webapp.TestRMWebServicesApps.testAppAttemtpsDefault

Error Message:
The default test container factory, null, could not be instantiated

Stack Trace:
com.sun.jersey.test.framework.spi.container.TestContainerException: The default test container factory, null, could not be instantiated
	at com.sun.jersey.test.framework.JerseyTest.getDefaultTestContainerFactory(JerseyTest.java:406)
	at com.sun.jersey.test.framework.JerseyTest.getTestContainerFactory(JerseyTest.java:273)
	at com.sun.jersey.test.framework.JerseyTest.<init>(JerseyTest.java:217)
	at org.apache.hadoop.yarn.webapp.JerseyTestBase.<init>(JerseyTestBase.java:27)
	at org.apache.hadoop.yarn.server.resourcemanager.webapp.TestRMWebServicesApps.<init>(TestRMWebServicesApps.java:111)


FAILED:  org.apache.hadoop.yarn.server.resourcemanager.webapp.TestRMWebServicesApps.testAppsSlash

Error Message:
The default test container factory, null, could not be instantiated

Stack Trace:
com.sun.jersey.test.framework.spi.container.TestContainerException: The default test container factory, null, could not be instantiated
	at com.sun.jersey.test.framework.JerseyTest.getDefaultTestContainerFactory(JerseyTest.java:406)
	at com.sun.jersey.test.framework.JerseyTest.getTestContainerFactory(JerseyTest.java:273)
	at com.sun.jersey.test.framework.JerseyTest.<init>(JerseyTest.java:217)
	at org.apache.hadoop.yarn.webapp.JerseyTestBase.<init>(JerseyTestBase.java:27)
	at org.apache.hadoop.yarn.server.resourcemanager.webapp.TestRMWebServicesApps.<init>(TestRMWebServicesApps.java:111)


FAILED:  org.apache.hadoop.yarn.server.resourcemanager.webapp.TestRMWebServicesApps.testInvalidAppAttempts

Error Message:
The default test container factory, null, could not be instantiated

Stack Trace:
com.sun.jersey.test.framework.spi.container.TestContainerException: The default test container factory, null, could not be instantiated
	at com.sun.jersey.test.framework.JerseyTest.getDefaultTestContainerFactory(JerseyTest.java:406)
	at com.sun.jersey.test.framework.JerseyTest.getTestContainerFactory(JerseyTest.java:273)
	at com.sun.jersey.test.framework.JerseyTest.<init>(JerseyTest.java:217)
	at org.apache.hadoop.yarn.webapp.JerseyTestBase.<init>(JerseyTestBase.java:27)
	at org.apache.hadoop.yarn.server.resourcemanager.webapp.TestRMWebServicesApps.<init>(TestRMWebServicesApps.java:111)


FAILED:  org.apache.hadoop.yarn.server.resourcemanager.webapp.TestRMWebServicesApps.testAppsQueryFinishBegin

Error Message:
The default test container factory, null, could not be instantiated

Stack Trace:
com.sun.jersey.test.framework.spi.container.TestContainerException: The default test container factory, null, could not be instantiated
	at com.sun.jersey.test.framework.JerseyTest.getDefaultTestContainerFactory(JerseyTest.java:406)
	at com.sun.jersey.test.framework.JerseyTest.getTestContainerFactory(JerseyTest.java:273)
	at com.sun.jersey.test.framework.JerseyTest.<init>(JerseyTest.java:217)
	at org.apache.hadoop.yarn.webapp.JerseyTestBase.<init>(JerseyTestBase.java:27)
	at org.apache.hadoop.yarn.server.resourcemanager.webapp.TestRMWebServicesApps.<init>(TestRMWebServicesApps.java:111)


FAILED:  org.apache.hadoop.yarn.server.resourcemanager.webapp.TestRMWebServicesApps.testAppsQueryStates

Error Message:
The default test container factory, null, could not be instantiated

Stack Trace:
com.sun.jersey.test.framework.spi.container.TestContainerException: The default test container factory, null, could not be instantiated
	at com.sun.jersey.test.framework.JerseyTest.getDefaultTestContainerFactory(JerseyTest.java:406)
	at com.sun.jersey.test.framework.JerseyTest.getTestContainerFactory(JerseyTest.java:273)
	at com.sun.jersey.test.framework.JerseyTest.<init>(JerseyTest.java:217)
	at org.apache.hadoop.yarn.webapp.JerseyTestBase.<init>(JerseyTestBase.java:27)
	at org.apache.hadoop.yarn.server.resourcemanager.webapp.TestRMWebServicesApps.<init>(TestRMWebServicesApps.java:111)


FAILED:  org.apache.hadoop.yarn.server.resourcemanager.webapp.TestRMWebServicesApps.testAppsXML

Error Message:
The default test container factory, null, could not be instantiated

Stack Trace:
com.sun.jersey.test.framework.spi.container.TestContainerException: The default test container factory, null, could not be instantiated
	at com.sun.jersey.test.framework.JerseyTest.getDefaultTestContainerFactory(JerseyTest.java:406)
	at com.sun.jersey.test.framework.JerseyTest.getTestContainerFactory(JerseyTest.java:273)
	at com.sun.jersey.test.framework.JerseyTest.<init>(JerseyTest.java:217)
	at org.apache.hadoop.yarn.webapp.JerseyTestBase.<init>(JerseyTestBase.java:27)
	at org.apache.hadoop.yarn.server.resourcemanager.webapp.TestRMWebServicesApps.<init>(TestRMWebServicesApps.java:111)


FAILED:  org.apache.hadoop.yarn.server.resourcemanager.webapp.TestRMWebServicesApps.testApps

Error Message:
The default test container factory, null, could not be instantiated

Stack Trace:
com.sun.jersey.test.framework.spi.container.TestContainerException: The default test container factory, null, could not be instantiated
	at com.sun.jersey.test.framework.JerseyTest.getDefaultTestContainerFactory(JerseyTest.java:406)
	at com.sun.jersey.test.framework.JerseyTest.getTestContainerFactory(JerseyTest.java:273)
	at com.sun.jersey.test.framework.JerseyTest.<init>(JerseyTest.java:217)
	at org.apache.hadoop.yarn.webapp.JerseyTestBase.<init>(JerseyTestBase.java:27)
	at org.apache.hadoop.yarn.server.resourcemanager.webapp.TestRMWebServicesApps.<init>(TestRMWebServicesApps.java:111)


FAILED:  org.apache.hadoop.yarn.server.resourcemanager.webapp.TestRMWebServicesApps.testAppsQueryFinalStatusNone

Error Message:
The default test container factory, null, could not be instantiated

Stack Trace:
com.sun.jersey.test.framework.spi.container.TestContainerException: The default test container factory, null, could not be instantiated
	at com.sun.jersey.test.framework.JerseyTest.getDefaultTestContainerFactory(JerseyTest.java:406)
	at com.sun.jersey.test.framework.JerseyTest.getTestContainerFactory(JerseyTest.java:273)
	at com.sun.jersey.test.framework.JerseyTest.<init>(JerseyTest.java:217)
	at org.apache.hadoop.yarn.webapp.JerseyTestBase.<init>(JerseyTestBase.java:27)
	at org.apache.hadoop.yarn.server.resourcemanager.webapp.TestRMWebServicesApps.<init>(TestRMWebServicesApps.java:111)


FAILED:  org.apache.hadoop.yarn.server.resourcemanager.webapp.TestRMWebServicesApps.testSingleAppsXML

Error Message:
The default test container factory, null, could not be instantiated

Stack Trace:
com.sun.jersey.test.framework.spi.container.TestContainerException: The default test container factory, null, could not be instantiated
	at com.sun.jersey.test.framework.JerseyTest.getDefaultTestContainerFactory(JerseyTest.java:406)
	at com.sun.jersey.test.framework.JerseyTest.getTestContainerFactory(JerseyTest.java:273)
	at com.sun.jersey.test.framework.JerseyTest.<init>(JerseyTest.java:217)
	at org.apache.hadoop.yarn.webapp.JerseyTestBase.<init>(JerseyTestBase.java:27)
	at org.apache.hadoop.yarn.server.resourcemanager.webapp.TestRMWebServicesApps.<init>(TestRMWebServicesApps.java:111)


FAILED:  org.apache.hadoop.yarn.server.resourcemanager.webapp.TestRMWebServicesApps.testSingleAppsSlash

Error Message:
The default test container factory, null, could not be instantiated

Stack Trace:
com.sun.jersey.test.framework.spi.container.TestContainerException: The default test container factory, null, could not be instantiated
	at com.sun.jersey.test.framework.JerseyTest.getDefaultTestContainerFactory(JerseyTest.java:406)
	at com.sun.jersey.test.framework.JerseyTest.getTestContainerFactory(JerseyTest.java:273)
	at com.sun.jersey.test.framework.JerseyTest.<init>(JerseyTest.java:217)
	at org.apache.hadoop.yarn.webapp.JerseyTestBase.<init>(JerseyTestBase.java:27)
	at org.apache.hadoop.yarn.server.resourcemanager.webapp.TestRMWebServicesApps.<init>(TestRMWebServicesApps.java:111)


FAILED:  org.apache.hadoop.yarn.server.resourcemanager.webapp.TestRMWebServicesApps.testAppStatistics

Error Message:
The default test container factory, null, could not be instantiated

Stack Trace:
com.sun.jersey.test.framework.spi.container.TestContainerException: The default test container factory, null, could not be instantiated
	at com.sun.jersey.test.framework.JerseyTest.getDefaultTestContainerFactory(JerseyTest.java:406)
	at com.sun.jersey.test.framework.JerseyTest.getTestContainerFactory(JerseyTest.java:273)
	at com.sun.jersey.test.framework.JerseyTest.<init>(JerseyTest.java:217)
	at org.apache.hadoop.yarn.webapp.JerseyTestBase.<init>(JerseyTestBase.java:27)
	at org.apache.hadoop.yarn.server.resourcemanager.webapp.TestRMWebServicesApps.<init>(TestRMWebServicesApps.java:111)


FAILED:  org.apache.hadoop.yarn.server.resourcemanager.webapp.TestRMWebServicesApps.testAppsQueryStartBegin

Error Message:
The default test container factory, null, could not be instantiated

Stack Trace:
com.sun.jersey.test.framework.spi.container.TestContainerException: The default test container factory, null, could not be instantiated
	at com.sun.jersey.test.framework.JerseyTest.getDefaultTestContainerFactory(JerseyTest.java:406)
	at com.sun.jersey.test.framework.JerseyTest.getTestContainerFactory(JerseyTest.java:273)
	at com.sun.jersey.test.framework.JerseyTest.<init>(JerseyTest.java:217)
	at org.apache.hadoop.yarn.webapp.JerseyTestBase.<init>(JerseyTestBase.java:27)
	at org.apache.hadoop.yarn.server.resourcemanager.webapp.TestRMWebServicesApps.<init>(TestRMWebServicesApps.java:111)


FAILED:  org.apache.hadoop.yarn.server.resourcemanager.webapp.TestRMWebServicesApps.testSingleApp

Error Message:
The default test container factory, null, could not be instantiated

Stack Trace:
com.sun.jersey.test.framework.spi.container.TestContainerException: The default test container factory, null, could not be instantiated
	at com.sun.jersey.test.framework.JerseyTest.getDefaultTestContainerFactory(JerseyTest.java:406)
	at com.sun.jersey.test.framework.JerseyTest.getTestContainerFactory(JerseyTest.java:273)
	at com.sun.jersey.test.framework.JerseyTest.<init>(JerseyTest.java:217)
	at org.apache.hadoop.yarn.webapp.JerseyTestBase.<init>(JerseyTestBase.java:27)
	at org.apache.hadoop.yarn.server.resourcemanager.webapp.TestRMWebServicesApps.<init>(TestRMWebServicesApps.java:111)


FAILED:  org.apache.hadoop.yarn.server.resourcemanager.webapp.TestRMWebServicesApps.testAppsQueryStatesComma

Error Message:
The default test container factory, null, could not be instantiated

Stack Trace:
com.sun.jersey.test.framework.spi.container.TestContainerException: The default test container factory, null, could not be instantiated
	at com.sun.jersey.test.framework.JerseyTest.getDefaultTestContainerFactory(JerseyTest.java:406)
	at com.sun.jersey.test.framework.JerseyTest.getTestContainerFactory(JerseyTest.java:273)
	at com.sun.jersey.test.framework.JerseyTest.<init>(JerseyTest.java:217)
	at org.apache.hadoop.yarn.webapp.JerseyTestBase.<init>(JerseyTestBase.java:27)
	at org.apache.hadoop.yarn.server.resourcemanager.webapp.TestRMWebServicesApps.<init>(TestRMWebServicesApps.java:111)


FAILED:  org.apache.hadoop.yarn.server.resourcemanager.webapp.TestRMWebServicesApps.testAppsQueryFinalStatus

Error Message:
The default test container factory, null, could not be instantiated

Stack Trace:
com.sun.jersey.test.framework.spi.container.TestContainerException: The default test container factory, null, could not be instantiated
	at com.sun.jersey.test.framework.JerseyTest.getDefaultTestContainerFactory(JerseyTest.java:406)
	at com.sun.jersey.test.framework.JerseyTest.getTestContainerFactory(JerseyTest.java:273)
	at com.sun.jersey.test.framework.JerseyTest.<init>(JerseyTest.java:217)
	at org.apache.hadoop.yarn.webapp.JerseyTestBase.<init>(JerseyTestBase.java:27)
	at org.apache.hadoop.yarn.server.resourcemanager.webapp.TestRMWebServicesApps.<init>(TestRMWebServicesApps.java:111)


FAILED:  org.apache.hadoop.yarn.server.resourcemanager.webapp.TestRMWebServicesApps.testAppsXMLMulti

Error Message:
The default test container factory, null, could not be instantiated

Stack Trace:
com.sun.jersey.test.framework.spi.container.TestContainerException: The default test container factory, null, could not be instantiated
	at com.sun.jersey.test.framework.JerseyTest.getDefaultTestContainerFactory(JerseyTest.java:406)
	at com.sun.jersey.test.framework.JerseyTest.getTestContainerFactory(JerseyTest.java:273)
	at com.sun.jersey.test.framework.JerseyTest.<init>(JerseyTest.java:217)
	at org.apache.hadoop.yarn.webapp.JerseyTestBase.<init>(JerseyTestBase.java:27)
	at org.apache.hadoop.yarn.server.resourcemanager.webapp.TestRMWebServicesApps.<init>(TestRMWebServicesApps.java:111)


FAILED:  org.apache.hadoop.yarn.server.resourcemanager.webapp.TestRMWebServicesApps.testNonexistAppAttempts

Error Message:
The default test container factory, null, could not be instantiated

Stack Trace:
com.sun.jersey.test.framework.spi.container.TestContainerException: The default test container factory, null, could not be instantiated
	at com.sun.jersey.test.framework.JerseyTest.getDefaultTestContainerFactory(JerseyTest.java:406)
	at com.sun.jersey.test.framework.JerseyTest.getTestContainerFactory(JerseyTest.java:273)
	at com.sun.jersey.test.framework.JerseyTest.<init>(JerseyTest.java:217)
	at org.apache.hadoop.yarn.webapp.JerseyTestBase.<init>(JerseyTestBase.java:27)
	at org.apache.hadoop.yarn.server.resourcemanager.webapp.TestRMWebServicesApps.<init>(TestRMWebServicesApps.java:111)


FAILED:  org.apache.hadoop.yarn.server.resourcemanager.webapp.TestRMWebServicesApps.testNonexistApp

Error Message:
The default test container factory, null, could not be instantiated

Stack Trace:
com.sun.jersey.test.framework.spi.container.TestContainerException: The default test container factory, null, could not be instantiated
	at com.sun.jersey.test.framework.JerseyTest.getDefaultTestContainerFactory(JerseyTest.java:406)
	at com.sun.jersey.test.framework.JerseyTest.getTestContainerFactory(JerseyTest.java:273)
	at com.sun.jersey.test.framework.JerseyTest.<init>(JerseyTest.java:217)
	at org.apache.hadoop.yarn.webapp.JerseyTestBase.<init>(JerseyTestBase.java:27)
	at org.apache.hadoop.yarn.server.resourcemanager.webapp.TestRMWebServicesApps.<init>(TestRMWebServicesApps.java:111)


FAILED:  org.apache.hadoop.yarn.server.resourcemanager.webapp.TestRMWebServicesApps.testAppAttemptsXML

Error Message:
The default test container factory, null, could not be instantiated

Stack Trace:
com.sun.jersey.test.framework.spi.container.TestContainerException: The default test container factory, null, could not be instantiated
	at com.sun.jersey.test.framework.JerseyTest.getDefaultTestContainerFactory(JerseyTest.java:406)
	at com.sun.jersey.test.framework.JerseyTest.getTestContainerFactory(JerseyTest.java:273)
	at com.sun.jersey.test.framework.JerseyTest.<init>(JerseyTest.java:217)
	at org.apache.hadoop.yarn.webapp.JerseyTestBase.<init>(JerseyTestBase.java:27)
	at org.apache.hadoop.yarn.server.resourcemanager.webapp.TestRMWebServicesApps.<init>(TestRMWebServicesApps.java:111)


FAILED:  org.apache.hadoop.yarn.server.resourcemanager.webapp.TestRMWebServicesApps.testAppsQueryStatesInvalid

Error Message:
The default test container factory, null, could not be instantiated

Stack Trace:
com.sun.jersey.test.framework.spi.container.TestContainerException: The default test container factory, null, could not be instantiated
	at com.sun.jersey.test.framework.JerseyTest.getDefaultTestContainerFactory(JerseyTest.java:406)
	at com.sun.jersey.test.framework.JerseyTest.getTestContainerFactory(JerseyTest.java:273)
	at com.sun.jersey.test.framework.JerseyTest.<init>(JerseyTest.java:217)
	at org.apache.hadoop.yarn.webapp.JerseyTestBase.<init>(JerseyTestBase.java:27)
	at org.apache.hadoop.yarn.server.resourcemanager.webapp.TestRMWebServicesApps.<init>(TestRMWebServicesApps.java:111)


FAILED:  org.apache.hadoop.yarn.server.resourcemanager.webapp.TestRMWebServicesApps.testAppsQueryUser

Error Message:
The default test container factory, null, could not be instantiated

Stack Trace:
com.sun.jersey.test.framework.spi.container.TestContainerException: The default test container factory, null, could not be instantiated
	at com.sun.jersey.test.framework.JerseyTest.getDefaultTestContainerFactory(JerseyTest.java:406)
	at com.sun.jersey.test.framework.JerseyTest.getTestContainerFactory(JerseyTest.java:273)
	at com.sun.jersey.test.framework.JerseyTest.<init>(JerseyTest.java:217)
	at org.apache.hadoop.yarn.webapp.JerseyTestBase.<init>(JerseyTestBase.java:27)
	at org.apache.hadoop.yarn.server.resourcemanager.webapp.TestRMWebServicesApps.<init>(TestRMWebServicesApps.java:111)


FAILED:  org.apache.hadoop.yarn.server.resourcemanager.webapp.TestRMWebServicesApps.testAppsQueryStatesNone

Error Message:
The default test container factory, null, could not be instantiated

Stack Trace:
com.sun.jersey.test.framework.spi.container.TestContainerException: The default test container factory, null, could not be instantiated
	at com.sun.jersey.test.framework.JerseyTest.getDefaultTestContainerFactory(JerseyTest.java:406)
	at com.sun.jersey.test.framework.JerseyTest.getTestContainerFactory(JerseyTest.java:273)
	at com.sun.jersey.test.framework.JerseyTest.<init>(JerseyTest.java:217)
	at org.apache.hadoop.yarn.webapp.JerseyTestBase.<init>(JerseyTestBase.java:27)
	at org.apache.hadoop.yarn.server.resourcemanager.webapp.TestRMWebServicesApps.<init>(TestRMWebServicesApps.java:111)


FAILED:  org.apache.hadoop.yarn.server.resourcemanager.webapp.TestRMWebServicesApps.testAppAttempts

Error Message:
The default test container factory, null, could not be instantiated

Stack Trace:
com.sun.jersey.test.framework.spi.container.TestContainerException: The default test container factory, null, could not be instantiated
	at com.sun.jersey.test.framework.JerseyTest.getDefaultTestContainerFactory(JerseyTest.java:406)
	at com.sun.jersey.test.framework.JerseyTest.getTestContainerFactory(JerseyTest.java:273)
	at com.sun.jersey.test.framework.JerseyTest.<init>(JerseyTest.java:217)
	at org.apache.hadoop.yarn.webapp.JerseyTestBase.<init>(JerseyTestBase.java:27)
	at org.apache.hadoop.yarn.server.resourcemanager.webapp.TestRMWebServicesApps.<init>(TestRMWebServicesApps.java:111)


FAILED:  org.apache.hadoop.yarn.server.resourcemanager.webapp.TestRMWebServicesApps.testMultipleAppAttempts

Error Message:
The default test container factory, null, could not be instantiated

Stack Trace:
com.sun.jersey.test.framework.spi.container.TestContainerException: The default test container factory, null, could not be instantiated
	at com.sun.jersey.test.framework.JerseyTest.getDefaultTestContainerFactory(JerseyTest.java:406)
	at com.sun.jersey.test.framework.JerseyTest.getTestContainerFactory(JerseyTest.java:273)
	at com.sun.jersey.test.framework.JerseyTest.<init>(JerseyTest.java:217)
	at org.apache.hadoop.yarn.webapp.JerseyTestBase.<init>(JerseyTestBase.java:27)
	at org.apache.hadoop.yarn.server.resourcemanager.webapp.TestRMWebServicesApps.<init>(TestRMWebServicesApps.java:111)


FAILED:  org.apache.hadoop.yarn.server.resourcemanager.webapp.TestRMWebServicesApps.testAppsQueryFinishEnd

Error Message:
The default test container factory, null, could not be instantiated

Stack Trace:
com.sun.jersey.test.framework.spi.container.TestContainerException: The default test container factory, null, could not be instantiated
	at com.sun.jersey.test.framework.JerseyTest.getDefaultTestContainerFactory(JerseyTest.java:406)
	at com.sun.jersey.test.framework.JerseyTest.getTestContainerFactory(JerseyTest.java:273)
	at com.sun.jersey.test.framework.JerseyTest.<init>(JerseyTest.java:217)
	at org.apache.hadoop.yarn.webapp.JerseyTestBase.<init>(JerseyTestBase.java:27)
	at org.apache.hadoop.yarn.server.resourcemanager.webapp.TestRMWebServicesApps.<init>(TestRMWebServicesApps.java:111)


FAILED:  org.apache.hadoop.yarn.server.resourcemanager.webapp.TestRMWebServicesApps.testAppsQueryLimit

Error Message:
The default test container factory, null, could not be instantiated

Stack Trace:
com.sun.jersey.test.framework.spi.container.TestContainerException: The default test container factory, null, could not be instantiated
	at com.sun.jersey.test.framework.JerseyTest.getDefaultTestContainerFactory(JerseyTest.java:406)
	at com.sun.jersey.test.framework.JerseyTest.getTestContainerFactory(JerseyTest.java:273)
	at com.sun.jersey.test.framework.JerseyTest.<init>(JerseyTest.java:217)
	at org.apache.hadoop.yarn.webapp.JerseyTestBase.<init>(JerseyTestBase.java:27)
	at org.apache.hadoop.yarn.server.resourcemanager.webapp.TestRMWebServicesApps.<init>(TestRMWebServicesApps.java:111)


FAILED:  org.apache.hadoop.yarn.server.resourcemanager.webapp.TestRMWebServicesApps.testAppsQueryQueue

Error Message:
The default test container factory, null, could not be instantiated

Stack Trace:
com.sun.jersey.test.framework.spi.container.TestContainerException: The default test container factory, null, could not be instantiated
	at com.sun.jersey.test.framework.JerseyTest.getDefaultTestContainerFactory(JerseyTest.java:406)
	at com.sun.jersey.test.framework.JerseyTest.getTestContainerFactory(JerseyTest.java:273)
	at com.sun.jersey.test.framework.JerseyTest.<init>(JerseyTest.java:217)
	at org.apache.hadoop.yarn.webapp.JerseyTestBase.<init>(JerseyTestBase.java:27)
	at org.apache.hadoop.yarn.server.resourcemanager.webapp.TestRMWebServicesApps.<init>(TestRMWebServicesApps.java:111)


FAILED:  org.apache.hadoop.yarn.server.resourcemanager.webapp.TestRMWebServicesApps.testAppsQueryState

Error Message:
The default test container factory, null, could not be instantiated

Stack Trace:
com.sun.jersey.test.framework.spi.container.TestContainerException: The default test container factory, null, could not be instantiated
	at com.sun.jersey.test.framework.JerseyTest.getDefaultTestContainerFactory(JerseyTest.java:406)
	at com.sun.jersey.test.framework.JerseyTest.getTestContainerFactory(JerseyTest.java:273)
	at com.sun.jersey.test.framework.JerseyTest.<init>(JerseyTest.java:217)
	at org.apache.hadoop.yarn.webapp.JerseyTestBase.<init>(JerseyTestBase.java:27)
	at org.apache.hadoop.yarn.server.resourcemanager.webapp.TestRMWebServicesApps.<init>(TestRMWebServicesApps.java:111)


FAILED:  org.apache.hadoop.yarn.server.resourcemanager.webapp.TestRMWebServicesApps.testSingleAppsDefault

Error Message:
The default test container factory, null, could not be instantiated

Stack Trace:
com.sun.jersey.test.framework.spi.container.TestContainerException: The default test container factory, null, could not be instantiated
	at com.sun.jersey.test.framework.JerseyTest.getDefaultTestContainerFactory(JerseyTest.java:406)
	at com.sun.jersey.test.framework.JerseyTest.getTestContainerFactory(JerseyTest.java:273)
	at com.sun.jersey.test.framework.JerseyTest.<init>(JerseyTest.java:217)
	at org.apache.hadoop.yarn.webapp.JerseyTestBase.<init>(JerseyTestBase.java:27)
	at org.apache.hadoop.yarn.server.resourcemanager.webapp.TestRMWebServicesApps.<init>(TestRMWebServicesApps.java:111)


FAILED:  org.apache.hadoop.yarn.server.resourcemanager.webapp.TestRMWebServicesApps.testAppsQueryStateInvalid

Error Message:
The default test container factory, null, could not be instantiated

Stack Trace:
com.sun.jersey.test.framework.spi.container.TestContainerException: The default test container factory, null, could not be instantiated
	at com.sun.jersey.test.framework.JerseyTest.getDefaultTestContainerFactory(JerseyTest.java:406)
	at com.sun.jersey.test.framework.JerseyTest.getTestContainerFactory(JerseyTest.java:273)
	at com.sun.jersey.test.framework.JerseyTest.<init>(JerseyTest.java:217)
	at org.apache.hadoop.yarn.webapp.JerseyTestBase.<init>(JerseyTestBase.java:27)
	at org.apache.hadoop.yarn.server.resourcemanager.webapp.TestRMWebServicesApps.<init>(TestRMWebServicesApps.java:111)


FAILED:  org.apache.hadoop.yarn.server.resourcemanager.webapp.TestRMWebServicesApps.testAppsQueryAppTypes

Error Message:
The default test container factory, null, could not be instantiated

Stack Trace:
com.sun.jersey.test.framework.spi.container.TestContainerException: The default test container factory, null, could not be instantiated
	at com.sun.jersey.test.framework.JerseyTest.getDefaultTestContainerFactory(JerseyTest.java:406)
	at com.sun.jersey.test.framework.JerseyTest.getTestContainerFactory(JerseyTest.java:273)
	at com.sun.jersey.test.framework.JerseyTest.<init>(JerseyTest.java:217)
	at org.apache.hadoop.yarn.webapp.JerseyTestBase.<init>(JerseyTestBase.java:27)
	at org.apache.hadoop.yarn.server.resourcemanager.webapp.TestRMWebServicesApps.<init>(TestRMWebServicesApps.java:111)


FAILED:  org.apache.hadoop.yarn.server.resourcemanager.webapp.TestRMWebServicesApps.testAppsQueryFinalStatusInvalid

Error Message:
The default test container factory, null, could not be instantiated

Stack Trace:
com.sun.jersey.test.framework.spi.container.TestContainerException: The default test container factory, null, could not be instantiated
	at com.sun.jersey.test.framework.JerseyTest.getDefaultTestContainerFactory(JerseyTest.java:406)
	at com.sun.jersey.test.framework.JerseyTest.getTestContainerFactory(JerseyTest.java:273)
	at com.sun.jersey.test.framework.JerseyTest.<init>(JerseyTest.java:217)
	at org.apache.hadoop.yarn.webapp.JerseyTestBase.<init>(JerseyTestBase.java:27)
	at org.apache.hadoop.yarn.server.resourcemanager.webapp.TestRMWebServicesApps.<init>(TestRMWebServicesApps.java:111)


FAILED:  org.apache.hadoop.yarn.server.resourcemanager.webapp.TestRMWebServicesApps.testInvalidApp

Error Message:
The default test container factory, null, could not be instantiated

Stack Trace:
com.sun.jersey.test.framework.spi.container.TestContainerException: The default test container factory, null, could not be instantiated
	at com.sun.jersey.test.framework.JerseyTest.getDefaultTestContainerFactory(JerseyTest.java:406)
	at com.sun.jersey.test.framework.JerseyTest.getTestContainerFactory(JerseyTest.java:273)
	at com.sun.jersey.test.framework.JerseyTest.<init>(JerseyTest.java:217)
	at org.apache.hadoop.yarn.webapp.JerseyTestBase.<init>(JerseyTestBase.java:27)
	at org.apache.hadoop.yarn.server.resourcemanager.webapp.TestRMWebServicesApps.<init>(TestRMWebServicesApps.java:111)


FAILED:  org.apache.hadoop.yarn.server.resourcemanager.webapp.TestRMWebServicesApps.testAppsQueryStartEnd

Error Message:
The default test container factory, null, could not be instantiated

Stack Trace:
com.sun.jersey.test.framework.spi.container.TestContainerException: The default test container factory, null, could not be instantiated
	at com.sun.jersey.test.framework.JerseyTest.getDefaultTestContainerFactory(JerseyTest.java:406)
	at com.sun.jersey.test.framework.JerseyTest.getTestContainerFactory(JerseyTest.java:273)
	at com.sun.jersey.test.framework.JerseyTest.<init>(JerseyTest.java:217)
	at org.apache.hadoop.yarn.webapp.JerseyTestBase.<init>(JerseyTestBase.java:27)
	at org.apache.hadoop.yarn.server.resourcemanager.webapp.TestRMWebServicesApps.<init>(TestRMWebServicesApps.java:111)


FAILED:  org.apache.hadoop.yarn.server.resourcemanager.webapp.TestRMWebServicesApps.testAppsDefault

Error Message:
The default test container factory, null, could not be instantiated

Stack Trace:
com.sun.jersey.test.framework.spi.container.TestContainerException: The default test container factory, null, could not be instantiated
	at com.sun.jersey.test.framework.JerseyTest.getDefaultTestContainerFactory(JerseyTest.java:406)
	at com.sun.jersey.test.framework.JerseyTest.getTestContainerFactory(JerseyTest.java:273)
	at com.sun.jersey.test.framework.JerseyTest.<init>(JerseyTest.java:217)
	at org.apache.hadoop.yarn.webapp.JerseyTestBase.<init>(JerseyTestBase.java:27)
	at org.apache.hadoop.yarn.server.resourcemanager.webapp.TestRMWebServicesApps.<init>(TestRMWebServicesApps.java:111)


FAILED:  org.apache.hadoop.yarn.server.resourcemanager.webapp.TestRMWebServicesApps.testAppsQueryFinishBeginEnd

Error Message:
The default test container factory, null, could not be instantiated

Stack Trace:
com.sun.jersey.test.framework.spi.container.TestContainerException: The default test container factory, null, could not be instantiated
	at com.sun.jersey.test.framework.JerseyTest.getDefaultTestContainerFactory(JerseyTest.java:406)
	at com.sun.jersey.test.framework.JerseyTest.getTestContainerFactory(JerseyTest.java:273)
	at com.sun.jersey.test.framework.JerseyTest.<init>(JerseyTest.java:217)
	at org.apache.hadoop.yarn.webapp.JerseyTestBase.<init>(JerseyTestBase.java:27)
	at org.apache.hadoop.yarn.server.resourcemanager.webapp.TestRMWebServicesApps.<init>(TestRMWebServicesApps.java:111)


FAILED:  org.apache.hadoop.yarn.server.resourcemanager.webapp.TestRMWebServicesAppsModification.testGetAppQueue[0]

Error Message:
The default test container factory, null, could not be instantiated

Stack Trace:
com.sun.jersey.test.framework.spi.container.TestContainerException: The default test container factory, null, could not be instantiated
	at com.sun.jersey.test.framework.JerseyTest.getDefaultTestContainerFactory(JerseyTest.java:406)
	at com.sun.jersey.test.framework.JerseyTest.getTestContainerFactory(JerseyTest.java:273)
	at com.sun.jersey.test.framework.JerseyTest.<init>(JerseyTest.java:217)
	at org.apache.hadoop.yarn.webapp.JerseyTestBase.<init>(JerseyTestBase.java:27)
	at org.apache.hadoop.yarn.server.resourcemanager.webapp.TestRMWebServicesAppsModification.<init>(TestRMWebServicesAppsModification.java:277)


FAILED:  org.apache.hadoop.yarn.server.resourcemanager.webapp.TestRMWebServicesAppsModification.testAppMove[0]

Error Message:
The default test container factory, null, could not be instantiated

Stack Trace:
com.sun.jersey.test.framework.spi.container.TestContainerException: The default test container factory, null, could not be instantiated
	at com.sun.jersey.test.framework.JerseyTest.getDefaultTestContainerFactory(JerseyTest.java:406)
	at com.sun.jersey.test.framework.JerseyTest.getTestContainerFactory(JerseyTest.java:273)
	at com.sun.jersey.test.framework.JerseyTest.<init>(JerseyTest.java:217)
	at org.apache.hadoop.yarn.webapp.JerseyTestBase.<init>(JerseyTestBase.java:27)
	at org.apache.hadoop.yarn.server.resourcemanager.webapp.TestRMWebServicesAppsModification.<init>(TestRMWebServicesAppsModification.java:277)


FAILED:  org.apache.hadoop.yarn.server.resourcemanager.webapp.TestRMWebServicesAppsModification.testSingleAppKill[0]

Error Message:
The default test container factory, null, could not be instantiated

Stack Trace:
com.sun.jersey.test.framework.spi.container.TestContainerException: The default test container factory, null, could not be instantiated
	at com.sun.jersey.test.framework.JerseyTest.getDefaultTestContainerFactory(JerseyTest.java:406)
	at com.sun.jersey.test.framework.JerseyTest.getTestContainerFactory(JerseyTest.java:273)
	at com.sun.jersey.test.framework.JerseyTest.<init>(JerseyTest.java:217)
	at org.apache.hadoop.yarn.webapp.JerseyTestBase.<init>(JerseyTestBase.java:27)
	at org.apache.hadoop.yarn.server.resourcemanager.webapp.TestRMWebServicesAppsModification.<init>(TestRMWebServicesAppsModification.java:277)


FAILED:  org.apache.hadoop.yarn.server.resourcemanager.webapp.TestRMWebServicesAppsModification.testSingleAppKillInvalidState[0]

Error Message:
The default test container factory, null, could not be instantiated

Stack Trace:
com.sun.jersey.test.framework.spi.container.TestContainerException: The default test container factory, null, could not be instantiated
	at com.sun.jersey.test.framework.JerseyTest.getDefaultTestContainerFactory(JerseyTest.java:406)
	at com.sun.jersey.test.framework.JerseyTest.getTestContainerFactory(JerseyTest.java:273)
	at com.sun.jersey.test.framework.JerseyTest.<init>(JerseyTest.java:217)
	at org.apache.hadoop.yarn.webapp.JerseyTestBase.<init>(JerseyTestBase.java:27)
	at org.apache.hadoop.yarn.server.resourcemanager.webapp.TestRMWebServicesAppsModification.<init>(TestRMWebServicesAppsModification.java:277)


FAILED:  org.apache.hadoop.yarn.server.resourcemanager.webapp.TestRMWebServicesAppsModification.testSingleAppKillUnauthorized[0]

Error Message:
The default test container factory, null, could not be instantiated

Stack Trace:
com.sun.jersey.test.framework.spi.container.TestContainerException: The default test container factory, null, could not be instantiated
	at com.sun.jersey.test.framework.JerseyTest.getDefaultTestContainerFactory(JerseyTest.java:406)
	at com.sun.jersey.test.framework.JerseyTest.getTestContainerFactory(JerseyTest.java:273)
	at com.sun.jersey.test.framework.JerseyTest.<init>(JerseyTest.java:217)
	at org.apache.hadoop.yarn.webapp.JerseyTestBase.<init>(JerseyTestBase.java:27)
	at org.apache.hadoop.yarn.server.resourcemanager.webapp.TestRMWebServicesAppsModification.<init>(TestRMWebServicesAppsModification.java:277)


FAILED:  org.apache.hadoop.yarn.server.resourcemanager.webapp.TestRMWebServicesAppsModification.testGetNewApplication[0]

Error Message:
The default test container factory, null, could not be instantiated

Stack Trace:
com.sun.jersey.test.framework.spi.container.TestContainerException: The default test container factory, null, could not be instantiated
	at com.sun.jersey.test.framework.JerseyTest.getDefaultTestContainerFactory(JerseyTest.java:406)
	at com.sun.jersey.test.framework.JerseyTest.getTestContainerFactory(JerseyTest.java:273)
	at com.sun.jersey.test.framework.JerseyTest.<init>(JerseyTest.java:217)
	at org.apache.hadoop.yarn.webapp.JerseyTestBase.<init>(JerseyTestBase.java:27)
	at org.apache.hadoop.yarn.server.resourcemanager.webapp.TestRMWebServicesAppsModification.<init>(TestRMWebServicesAppsModification.java:277)


FAILED:  org.apache.hadoop.yarn.server.resourcemanager.webapp.TestRMWebServicesAppsModification.testSingleAppKillInvalidId[0]

Error Message:
The default test container factory, null, could not be instantiated

Stack Trace:
com.sun.jersey.test.framework.spi.container.TestContainerException: The default test container factory, null, could not be instantiated
	at com.sun.jersey.test.framework.JerseyTest.getDefaultTestContainerFactory(JerseyTest.java:406)
	at com.sun.jersey.test.framework.JerseyTest.getTestContainerFactory(JerseyTest.java:273)
	at com.sun.jersey.test.framework.JerseyTest.<init>(JerseyTest.java:217)
	at org.apache.hadoop.yarn.webapp.JerseyTestBase.<init>(JerseyTestBase.java:27)
	at org.apache.hadoop.yarn.server.resourcemanager.webapp.TestRMWebServicesAppsModification.<init>(TestRMWebServicesAppsModification.java:277)


FAILED:  org.apache.hadoop.yarn.server.resourcemanager.webapp.TestRMWebServicesAppsModification.testSingleAppState[0]

Error Message:
The default test container factory, null, could not be instantiated

Stack Trace:
com.sun.jersey.test.framework.spi.container.TestContainerException: The default test container factory, null, could not be instantiated
	at com.sun.jersey.test.framework.JerseyTest.getDefaultTestContainerFactory(JerseyTest.java:406)
	at com.sun.jersey.test.framework.JerseyTest.getTestContainerFactory(JerseyTest.java:273)
	at com.sun.jersey.test.framework.JerseyTest.<init>(JerseyTest.java:217)
	at org.apache.hadoop.yarn.webapp.JerseyTestBase.<init>(JerseyTestBase.java:27)
	at org.apache.hadoop.yarn.server.resourcemanager.webapp.TestRMWebServicesAppsModification.<init>(TestRMWebServicesAppsModification.java:277)


FAILED:  org.apache.hadoop.yarn.server.resourcemanager.webapp.TestRMWebServicesAppsModification.testGetNewApplicationAndSubmit[0]

Error Message:
The default test container factory, null, could not be instantiated

Stack Trace:
com.sun.jersey.test.framework.spi.container.TestContainerException: The default test container factory, null, could not be instantiated
	at com.sun.jersey.test.framework.JerseyTest.getDefaultTestContainerFactory(JerseyTest.java:406)
	at com.sun.jersey.test.framework.JerseyTest.getTestContainerFactory(JerseyTest.java:273)
	at com.sun.jersey.test.framework.JerseyTest.<init>(JerseyTest.java:217)
	at org.apache.hadoop.yarn.webapp.JerseyTestBase.<init>(JerseyTestBase.java:27)
	at org.apache.hadoop.yarn.server.resourcemanager.webapp.TestRMWebServicesAppsModification.<init>(TestRMWebServicesAppsModification.java:277)


FAILED:  org.apache.hadoop.yarn.server.resourcemanager.webapp.TestRMWebServicesAppsModification.testAppSubmitBadJsonAndXML[0]

Error Message:
The default test container factory, null, could not be instantiated

Stack Trace:
com.sun.jersey.test.framework.spi.container.TestContainerException: The default test container factory, null, could not be instantiated
	at com.sun.jersey.test.framework.JerseyTest.getDefaultTestContainerFactory(JerseyTest.java:406)
	at com.sun.jersey.test.framework.JerseyTest.getTestContainerFactory(JerseyTest.java:273)
	at com.sun.jersey.test.framework.JerseyTest.<init>(JerseyTest.java:217)
	at org.apache.hadoop.yarn.webapp.JerseyTestBase.<init>(JerseyTestBase.java:27)
	at org.apache.hadoop.yarn.server.resourcemanager.webapp.TestRMWebServicesAppsModification.<init>(TestRMWebServicesAppsModification.java:277)


FAILED:  org.apache.hadoop.yarn.server.resourcemanager.webapp.TestRMWebServicesAppsModification.testGetAppQueue[1]

Error Message:
The default test container factory, null, could not be instantiated

Stack Trace:
com.sun.jersey.test.framework.spi.container.TestContainerException: The default test container factory, null, could not be instantiated
	at com.sun.jersey.test.framework.JerseyTest.getDefaultTestContainerFactory(JerseyTest.java:406)
	at com.sun.jersey.test.framework.JerseyTest.getTestContainerFactory(JerseyTest.java:273)
	at com.sun.jersey.test.framework.JerseyTest.<init>(JerseyTest.java:217)
	at org.apache.hadoop.yarn.webapp.JerseyTestBase.<init>(JerseyTestBase.java:27)
	at org.apache.hadoop.yarn.server.resourcemanager.webapp.TestRMWebServicesAppsModification.<init>(TestRMWebServicesAppsModification.java:277)


FAILED:  org.apache.hadoop.yarn.server.resourcemanager.webapp.TestRMWebServicesAppsModification.testAppMove[1]

Error Message:
The default test container factory, null, could not be instantiated

Stack Trace:
com.sun.jersey.test.framework.spi.container.TestContainerException: The default test container factory, null, could not be instantiated
	at com.sun.jersey.test.framework.JerseyTest.getDefaultTestContainerFactory(JerseyTest.java:406)
	at com.sun.jersey.test.framework.JerseyTest.getTestContainerFactory(JerseyTest.java:273)
	at com.sun.jersey.test.framework.JerseyTest.<init>(JerseyTest.java:217)
	at org.apache.hadoop.yarn.webapp.JerseyTestBase.<init>(JerseyTestBase.java:27)
	at org.apache.hadoop.yarn.server.resourcemanager.webapp.TestRMWebServicesAppsModification.<init>(TestRMWebServicesAppsModification.java:277)


FAILED:  org.apache.hadoop.yarn.server.resourcemanager.webapp.TestRMWebServicesAppsModification.testSingleAppKill[1]

Error Message:
The default test container factory, null, could not be instantiated

Stack Trace:
com.sun.jersey.test.framework.spi.container.TestContainerException: The default test container factory, null, could not be instantiated
	at com.sun.jersey.test.framework.JerseyTest.getDefaultTestContainerFactory(JerseyTest.java:406)
	at com.sun.jersey.test.framework.JerseyTest.getTestContainerFactory(JerseyTest.java:273)
	at com.sun.jersey.test.framework.JerseyTest.<init>(JerseyTest.java:217)
	at org.apache.hadoop.yarn.webapp.JerseyTestBase.<init>(JerseyTestBase.java:27)
	at org.apache.hadoop.yarn.server.resourcemanager.webapp.TestRMWebServicesAppsModification.<init>(TestRMWebServicesAppsModification.java:277)


FAILED:  org.apache.hadoop.yarn.server.resourcemanager.webapp.TestRMWebServicesAppsModification.testSingleAppKillInvalidState[1]

Error Message:
The default test container factory, null, could not be instantiated

Stack Trace:
com.sun.jersey.test.framework.spi.container.TestContainerException: The default test container factory, null, could not be instantiated
	at com.sun.jersey.test.framework.JerseyTest.getDefaultTestContainerFactory(JerseyTest.java:406)
	at com.sun.jersey.test.framework.JerseyTest.getTestContainerFactory(JerseyTest.java:273)
	at com.sun.jersey.test.framework.JerseyTest.<init>(JerseyTest.java:217)
	at org.apache.hadoop.yarn.webapp.JerseyTestBase.<init>(JerseyTestBase.java:27)
	at org.apache.hadoop.yarn.server.resourcemanager.webapp.TestRMWebServicesAppsModification.<init>(TestRMWebServicesAppsModification.java:277)


FAILED:  org.apache.hadoop.yarn.server.resourcemanager.webapp.TestRMWebServicesAppsModification.testSingleAppKillUnauthorized[1]

Error Message:
The default test container factory, null, could not be instantiated

Stack Trace:
com.sun.jersey.test.framework.spi.container.TestContainerException: The default test container factory, null, could not be instantiated
	at com.sun.jersey.test.framework.JerseyTest.getDefaultTestContainerFactory(JerseyTest.java:406)
	at com.sun.jersey.test.framework.JerseyTest.getTestContainerFactory(JerseyTest.java:273)
	at com.sun.jersey.test.framework.JerseyTest.<init>(JerseyTest.java:217)
	at org.apache.hadoop.yarn.webapp.JerseyTestBase.<init>(JerseyTestBase.java:27)
	at org.apache.hadoop.yarn.server.resourcemanager.webapp.TestRMWebServicesAppsModification.<init>(TestRMWebServicesAppsModification.java:277)


FAILED:  org.apache.hadoop.yarn.server.resourcemanager.webapp.TestRMWebServicesAppsModification.testGetNewApplication[1]

Error Message:
The default test container factory, null, could not be instantiated

Stack Trace:
com.sun.jersey.test.framework.spi.container.TestContainerException: The default test container factory, null, could not be instantiated
	at com.sun.jersey.test.framework.JerseyTest.getDefaultTestContainerFactory(JerseyTest.java:406)
	at com.sun.jersey.test.framework.JerseyTest.getTestContainerFactory(JerseyTest.java:273)
	at com.sun.jersey.test.framework.JerseyTest.<init>(JerseyTest.java:217)
	at org.apache.hadoop.yarn.webapp.JerseyTestBase.<init>(JerseyTestBase.java:27)
	at org.apache.hadoop.yarn.server.resourcemanager.webapp.TestRMWebServicesAppsModification.<init>(TestRMWebServicesAppsModification.java:277)


FAILED:  org.apache.hadoop.yarn.server.resourcemanager.webapp.TestRMWebServicesAppsModification.testSingleAppKillInvalidId[1]

Error Message:
The default test container factory, null, could not be instantiated

Stack Trace:
com.sun.jersey.test.framework.spi.container.TestContainerException: The default test container factory, null, could not be instantiated
	at com.sun.jersey.test.framework.JerseyTest.getDefaultTestContainerFactory(JerseyTest.java:406)
	at com.sun.jersey.test.framework.JerseyTest.getTestContainerFactory(JerseyTest.java:273)
	at com.sun.jersey.test.framework.JerseyTest.<init>(JerseyTest.java:217)
	at org.apache.hadoop.yarn.webapp.JerseyTestBase.<init>(JerseyTestBase.java:27)
	at org.apache.hadoop.yarn.server.resourcemanager.webapp.TestRMWebServicesAppsModification.<init>(TestRMWebServicesAppsModification.java:277)


FAILED:  org.apache.hadoop.yarn.server.resourcemanager.webapp.TestRMWebServicesAppsModification.testSingleAppState[1]

Error Message:
The default test container factory, null, could not be instantiated

Stack Trace:
com.sun.jersey.test.framework.spi.container.TestContainerException: The default test container factory, null, could not be instantiated
	at com.sun.jersey.test.framework.JerseyTest.getDefaultTestContainerFactory(JerseyTest.java:406)
	at com.sun.jersey.test.framework.JerseyTest.getTestContainerFactory(JerseyTest.java:273)
	at com.sun.jersey.test.framework.JerseyTest.<init>(JerseyTest.java:217)
	at org.apache.hadoop.yarn.webapp.JerseyTestBase.<init>(JerseyTestBase.java:27)
	at org.apache.hadoop.yarn.server.resourcemanager.webapp.TestRMWebServicesAppsModification.<init>(TestRMWebServicesAppsModification.java:277)


FAILED:  org.apache.hadoop.yarn.server.resourcemanager.webapp.TestRMWebServicesAppsModification.testGetNewApplicationAndSubmit[1]

Error Message:
The default test container factory, null, could not be instantiated

Stack Trace:
com.sun.jersey.test.framework.spi.container.TestContainerException: The default test container factory, null, could not be instantiated
	at com.sun.jersey.test.framework.JerseyTest.getDefaultTestContainerFactory(JerseyTest.java:406)
	at com.sun.jersey.test.framework.JerseyTest.getTestContainerFactory(JerseyTest.java:273)
	at com.sun.jersey.test.framework.JerseyTest.<init>(JerseyTest.java:217)
	at org.apache.hadoop.yarn.webapp.JerseyTestBase.<init>(JerseyTestBase.java:27)
	at org.apache.hadoop.yarn.server.resourcemanager.webapp.TestRMWebServicesAppsModification.<init>(TestRMWebServicesAppsModification.java:277)


FAILED:  org.apache.hadoop.yarn.server.resourcemanager.webapp.TestRMWebServicesAppsModification.testAppSubmitBadJsonAndXML[1]

Error Message:
The default test container factory, null, could not be instantiated

Stack Trace:
com.sun.jersey.test.framework.spi.container.TestContainerException: The default test container factory, null, could not be instantiated
	at com.sun.jersey.test.framework.JerseyTest.getDefaultTestContainerFactory(JerseyTest.java:406)
	at com.sun.jersey.test.framework.JerseyTest.getTestContainerFactory(JerseyTest.java:273)
	at com.sun.jersey.test.framework.JerseyTest.<init>(JerseyTest.java:217)
	at org.apache.hadoop.yarn.webapp.JerseyTestBase.<init>(JerseyTestBase.java:27)
	at org.apache.hadoop.yarn.server.resourcemanager.webapp.TestRMWebServicesAppsModification.<init>(TestRMWebServicesAppsModification.java:277)


FAILED:  org.apache.hadoop.yarn.server.resourcemanager.webapp.TestRMWebServicesAppsModification.testGetAppQueue[2]

Error Message:
The default test container factory, null, could not be instantiated

Stack Trace:
com.sun.jersey.test.framework.spi.container.TestContainerException: The default test container factory, null, could not be instantiated
	at com.sun.jersey.test.framework.JerseyTest.getDefaultTestContainerFactory(JerseyTest.java:406)
	at com.sun.jersey.test.framework.JerseyTest.getTestContainerFactory(JerseyTest.java:273)
	at com.sun.jersey.test.framework.JerseyTest.<init>(JerseyTest.java:217)
	at org.apache.hadoop.yarn.webapp.JerseyTestBase.<init>(JerseyTestBase.java:27)
	at org.apache.hadoop.yarn.server.resourcemanager.webapp.TestRMWebServicesAppsModification.<init>(TestRMWebServicesAppsModification.java:277)


FAILED:  org.apache.hadoop.yarn.server.resourcemanager.webapp.TestRMWebServicesAppsModification.testAppMove[2]

Error Message:
The default test container factory, null, could not be instantiated

Stack Trace:
com.sun.jersey.test.framework.spi.container.TestContainerException: The default test container factory, null, could not be instantiated
	at com.sun.jersey.test.framework.JerseyTest.getDefaultTestContainerFactory(JerseyTest.java:406)
	at com.sun.jersey.test.framework.JerseyTest.getTestContainerFactory(JerseyTest.java:273)
	at com.sun.jersey.test.framework.JerseyTest.<init>(JerseyTest.java:217)
	at org.apache.hadoop.yarn.webapp.JerseyTestBase.<init>(JerseyTestBase.java:27)
	at org.apache.hadoop.yarn.server.resourcemanager.webapp.TestRMWebServicesAppsModification.<init>(TestRMWebServicesAppsModification.java:277)


FAILED:  org.apache.hadoop.yarn.server.resourcemanager.webapp.TestRMWebServicesAppsModification.testSingleAppKill[2]

Error Message:
The default test container factory, null, could not be instantiated

Stack Trace:
com.sun.jersey.test.framework.spi.container.TestContainerException: The default test container factory, null, could not be instantiated
	at com.sun.jersey.test.framework.JerseyTest.getDefaultTestContainerFactory(JerseyTest.java:406)
	at com.sun.jersey.test.framework.JerseyTest.getTestContainerFactory(JerseyTest.java:273)
	at com.sun.jersey.test.framework.JerseyTest.<init>(JerseyTest.java:217)
	at org.apache.hadoop.yarn.webapp.JerseyTestBase.<init>(JerseyTestBase.java:27)
	at org.apache.hadoop.yarn.server.resourcemanager.webapp.TestRMWebServicesAppsModification.<init>(TestRMWebServicesAppsModification.java:277)


FAILED:  org.apache.hadoop.yarn.server.resourcemanager.webapp.TestRMWebServicesAppsModification.testSingleAppKillInvalidState[2]

Error Message:
The default test container factory, null, could not be instantiated

Stack Trace:
com.sun.jersey.test.framework.spi.container.TestContainerException: The default test container factory, null, could not be instantiated
	at com.sun.jersey.test.framework.JerseyTest.getDefaultTestContainerFactory(JerseyTest.java:406)
	at com.sun.jersey.test.framework.JerseyTest.getTestContainerFactory(JerseyTest.java:273)
	at com.sun.jersey.test.framework.JerseyTest.<init>(JerseyTest.java:217)
	at org.apache.hadoop.yarn.webapp.JerseyTestBase.<init>(JerseyTestBase.java:27)
	at org.apache.hadoop.yarn.server.resourcemanager.webapp.TestRMWebServicesAppsModification.<init>(TestRMWebServicesAppsModification.java:277)


FAILED:  org.apache.hadoop.yarn.server.resourcemanager.webapp.TestRMWebServicesAppsModification.testSingleAppKillUnauthorized[2]

Error Message:
The default test container factory, null, could not be instantiated

Stack Trace:
com.sun.jersey.test.framework.spi.container.TestContainerException: The default test container factory, null, could not be instantiated
	at com.sun.jersey.test.framework.JerseyTest.getDefaultTestContainerFactory(JerseyTest.java:406)
	at com.sun.jersey.test.framework.JerseyTest.getTestContainerFactory(JerseyTest.java:273)
	at com.sun.jersey.test.framework.JerseyTest.<init>(JerseyTest.java:217)
	at org.apache.hadoop.yarn.webapp.JerseyTestBase.<init>(JerseyTestBase.java:27)
	at org.apache.hadoop.yarn.server.resourcemanager.webapp.TestRMWebServicesAppsModification.<init>(TestRMWebServicesAppsModification.java:277)


FAILED:  org.apache.hadoop.yarn.server.resourcemanager.webapp.TestRMWebServicesAppsModification.testGetNewApplication[2]

Error Message:
The default test container factory, null, could not be instantiated

Stack Trace:
com.sun.jersey.test.framework.spi.container.TestContainerException: The default test container factory, null, could not be instantiated
	at com.sun.jersey.test.framework.JerseyTest.getDefaultTestContainerFactory(JerseyTest.java:406)
	at com.sun.jersey.test.framework.JerseyTest.getTestContainerFactory(JerseyTest.java:273)
	at com.sun.jersey.test.framework.JerseyTest.<init>(JerseyTest.java:217)
	at org.apache.hadoop.yarn.webapp.JerseyTestBase.<init>(JerseyTestBase.java:27)
	at org.apache.hadoop.yarn.server.resourcemanager.webapp.TestRMWebServicesAppsModification.<init>(TestRMWebServicesAppsModification.java:277)


FAILED:  org.apache.hadoop.yarn.server.resourcemanager.webapp.TestRMWebServicesAppsModification.testSingleAppKillInvalidId[2]

Error Message:
The default test container factory, null, could not be instantiated

Stack Trace:
com.sun.jersey.test.framework.spi.container.TestContainerException: The default test container factory, null, could not be instantiated
	at com.sun.jersey.test.framework.JerseyTest.getDefaultTestContainerFactory(JerseyTest.java:406)
	at com.sun.jersey.test.framework.JerseyTest.getTestContainerFactory(JerseyTest.java:273)
	at com.sun.jersey.test.framework.JerseyTest.<init>(JerseyTest.java:217)
	at org.apache.hadoop.yarn.webapp.JerseyTestBase.<init>(JerseyTestBase.java:27)
	at org.apache.hadoop.yarn.server.resourcemanager.webapp.TestRMWebServicesAppsModification.<init>(TestRMWebServicesAppsModification.java:277)


FAILED:  org.apache.hadoop.yarn.server.resourcemanager.webapp.TestRMWebServicesAppsModification.testSingleAppState[2]

Error Message:
The default test container factory, null, could not be instantiated

Stack Trace:
com.sun.jersey.test.framework.spi.container.TestContainerException: The default test container factory, null, could not be instantiated
	at com.sun.jersey.test.framework.JerseyTest.getDefaultTestContainerFactory(JerseyTest.java:406)
	at com.sun.jersey.test.framework.JerseyTest.getTestContainerFactory(JerseyTest.java:273)
	at com.sun.jersey.test.framework.JerseyTest.<init>(JerseyTest.java:217)
	at org.apache.hadoop.yarn.webapp.JerseyTestBase.<init>(JerseyTestBase.java:27)
	at org.apache.hadoop.yarn.server.resourcemanager.webapp.TestRMWebServicesAppsModification.<init>(TestRMWebServicesAppsModification.java:277)


FAILED:  org.apache.hadoop.yarn.server.resourcemanager.webapp.TestRMWebServicesAppsModification.testGetNewApplicationAndSubmit[2]

Error Message:
The default test container factory, null, could not be instantiated

Stack Trace:
com.sun.jersey.test.framework.spi.container.TestContainerException: The default test container factory, null, could not be instantiated
	at com.sun.jersey.test.framework.JerseyTest.getDefaultTestContainerFactory(JerseyTest.java:406)
	at com.sun.jersey.test.framework.JerseyTest.getTestContainerFactory(JerseyTest.java:273)
	at com.sun.jersey.test.framework.JerseyTest.<init>(JerseyTest.java:217)
	at org.apache.hadoop.yarn.webapp.JerseyTestBase.<init>(JerseyTestBase.java:27)
	at org.apache.hadoop.yarn.server.resourcemanager.webapp.TestRMWebServicesAppsModification.<init>(TestRMWebServicesAppsModification.java:277)


FAILED:  org.apache.hadoop.yarn.server.resourcemanager.webapp.TestRMWebServicesAppsModification.testAppSubmitBadJsonAndXML[2]

Error Message:
The default test container factory, null, could not be instantiated

Stack Trace:
com.sun.jersey.test.framework.spi.container.TestContainerException: The default test container factory, null, could not be instantiated
	at com.sun.jersey.test.framework.JerseyTest.getDefaultTestContainerFactory(JerseyTest.java:406)
	at com.sun.jersey.test.framework.JerseyTest.getTestContainerFactory(JerseyTest.java:273)
	at com.sun.jersey.test.framework.JerseyTest.<init>(JerseyTest.java:217)
	at org.apache.hadoop.yarn.webapp.JerseyTestBase.<init>(JerseyTestBase.java:27)
	at org.apache.hadoop.yarn.server.resourcemanager.webapp.TestRMWebServicesAppsModification.<init>(TestRMWebServicesAppsModification.java:277)


FAILED:  org.apache.hadoop.yarn.server.resourcemanager.webapp.TestRMWebServicesAppsModification.testGetAppQueue[3]

Error Message:
The default test container factory, null, could not be instantiated

Stack Trace:
com.sun.jersey.test.framework.spi.container.TestContainerException: The default test container factory, null, could not be instantiated
	at com.sun.jersey.test.framework.JerseyTest.getDefaultTestContainerFactory(JerseyTest.java:406)
	at com.sun.jersey.test.framework.JerseyTest.getTestContainerFactory(JerseyTest.java:273)
	at com.sun.jersey.test.framework.JerseyTest.<init>(JerseyTest.java:217)
	at org.apache.hadoop.yarn.webapp.JerseyTestBase.<init>(JerseyTestBase.java:27)
	at org.apache.hadoop.yarn.server.resourcemanager.webapp.TestRMWebServicesAppsModification.<init>(TestRMWebServicesAppsModification.java:277)


FAILED:  org.apache.hadoop.yarn.server.resourcemanager.webapp.TestRMWebServicesAppsModification.testAppMove[3]

Error Message:
The default test container factory, null, could not be instantiated

Stack Trace:
com.sun.jersey.test.framework.spi.container.TestContainerException: The default test container factory, null, could not be instantiated
	at com.sun.jersey.test.framework.JerseyTest.getDefaultTestContainerFactory(JerseyTest.java:406)
	at com.sun.jersey.test.framework.JerseyTest.getTestContainerFactory(JerseyTest.java:273)
	at com.sun.jersey.test.framework.JerseyTest.<init>(JerseyTest.java:217)
	at org.apache.hadoop.yarn.webapp.JerseyTestBase.<init>(JerseyTestBase.java:27)
	at org.apache.hadoop.yarn.server.resourcemanager.webapp.TestRMWebServicesAppsModification.<init>(TestRMWebServicesAppsModification.java:277)


FAILED:  org.apache.hadoop.yarn.server.resourcemanager.webapp.TestRMWebServicesAppsModification.testSingleAppKill[3]

Error Message:
The default test container factory, null, could not be instantiated

Stack Trace:
com.sun.jersey.test.framework.spi.container.TestContainerException: The default test container factory, null, could not be instantiated
	at com.sun.jersey.test.framework.JerseyTest.getDefaultTestContainerFactory(JerseyTest.java:406)
	at com.sun.jersey.test.framework.JerseyTest.getTestContainerFactory(JerseyTest.java:273)
	at com.sun.jersey.test.framework.JerseyTest.<init>(JerseyTest.java:217)
	at org.apache.hadoop.yarn.webapp.JerseyTestBase.<init>(JerseyTestBase.java:27)
	at org.apache.hadoop.yarn.server.resourcemanager.webapp.TestRMWebServicesAppsModification.<init>(TestRMWebServicesAppsModification.java:277)


FAILED:  org.apache.hadoop.yarn.server.resourcemanager.webapp.TestRMWebServicesAppsModification.testSingleAppKillInvalidState[3]

Error Message:
The default test container factory, null, could not be instantiated

Stack Trace:
com.sun.jersey.test.framework.spi.container.TestContainerException: The default test container factory, null, could not be instantiated
	at com.sun.jersey.test.framework.JerseyTest.getDefaultTestContainerFactory(JerseyTest.java:406)
	at com.sun.jersey.test.framework.JerseyTest.getTestContainerFactory(JerseyTest.java:273)
	at com.sun.jersey.test.framework.JerseyTest.<init>(JerseyTest.java:217)
	at org.apache.hadoop.yarn.webapp.JerseyTestBase.<init>(JerseyTestBase.java:27)
	at org.apache.hadoop.yarn.server.resourcemanager.webapp.TestRMWebServicesAppsModification.<init>(TestRMWebServicesAppsModification.java:277)


FAILED:  org.apache.hadoop.yarn.server.resourcemanager.webapp.TestRMWebServicesAppsModification.testSingleAppKillUnauthorized[3]

Error Message:
The default test container factory, null, could not be instantiated

Stack Trace:
com.sun.jersey.test.framework.spi.container.TestContainerException: The default test container factory, null, could not be instantiated
	at com.sun.jersey.test.framework.JerseyTest.getDefaultTestContainerFactory(JerseyTest.java:406)
	at com.sun.jersey.test.framework.JerseyTest.getTestContainerFactory(JerseyTest.java:273)
	at com.sun.jersey.test.framework.JerseyTest.<init>(JerseyTest.java:217)
	at org.apache.hadoop.yarn.webapp.JerseyTestBase.<init>(JerseyTestBase.java:27)
	at org.apache.hadoop.yarn.server.resourcemanager.webapp.TestRMWebServicesAppsModification.<init>(TestRMWebServicesAppsModification.java:277)


FAILED:  org.apache.hadoop.yarn.server.resourcemanager.webapp.TestRMWebServicesAppsModification.testGetNewApplication[3]

Error Message:
The default test container factory, null, could not be instantiated

Stack Trace:
com.sun.jersey.test.framework.spi.container.TestContainerException: The default test container factory, null, could not be instantiated
	at com.sun.jersey.test.framework.JerseyTest.getDefaultTestContainerFactory(JerseyTest.java:406)
	at com.sun.jersey.test.framework.JerseyTest.getTestContainerFactory(JerseyTest.java:273)
	at com.sun.jersey.test.framework.JerseyTest.<init>(JerseyTest.java:217)
	at org.apache.hadoop.yarn.webapp.JerseyTestBase.<init>(JerseyTestBase.java:27)
	at org.apache.hadoop.yarn.server.resourcemanager.webapp.TestRMWebServicesAppsModification.<init>(TestRMWebServicesAppsModification.java:277)


FAILED:  org.apache.hadoop.yarn.server.resourcemanager.webapp.TestRMWebServicesAppsModification.testSingleAppKillInvalidId[3]

Error Message:
The default test container factory, null, could not be instantiated

Stack Trace:
com.sun.jersey.test.framework.spi.container.TestContainerException: The default test container factory, null, could not be instantiated
	at com.sun.jersey.test.framework.JerseyTest.getDefaultTestContainerFactory(JerseyTest.java:406)
	at com.sun.jersey.test.framework.JerseyTest.getTestContainerFactory(JerseyTest.java:273)
	at com.sun.jersey.test.framework.JerseyTest.<init>(JerseyTest.java:217)
	at org.apache.hadoop.yarn.webapp.JerseyTestBase.<init>(JerseyTestBase.java:27)
	at org.apache.hadoop.yarn.server.resourcemanager.webapp.TestRMWebServicesAppsModification.<init>(TestRMWebServicesAppsModification.java:277)


FAILED:  org.apache.hadoop.yarn.server.resourcemanager.webapp.TestRMWebServicesAppsModification.testSingleAppState[3]

Error Message:
The default test container factory, null, could not be instantiated

Stack Trace:
com.sun.jersey.test.framework.spi.container.TestContainerException: The default test container factory, null, could not be instantiated
	at com.sun.jersey.test.framework.JerseyTest.getDefaultTestContainerFactory(JerseyTest.java:406)
	at com.sun.jersey.test.framework.JerseyTest.getTestContainerFactory(JerseyTest.java:273)
	at com.sun.jersey.test.framework.JerseyTest.<init>(JerseyTest.java:217)
	at org.apache.hadoop.yarn.webapp.JerseyTestBase.<init>(JerseyTestBase.java:27)
	at org.apache.hadoop.yarn.server.resourcemanager.webapp.TestRMWebServicesAppsModification.<init>(TestRMWebServicesAppsModification.java:277)


FAILED:  org.apache.hadoop.yarn.server.resourcemanager.webapp.TestRMWebServicesAppsModification.testGetNewApplicationAndSubmit[3]

Error Message:
The default test container factory, null, could not be instantiated

Stack Trace:
com.sun.jersey.test.framework.spi.container.TestContainerException: The default test container factory, null, could not be instantiated
	at com.sun.jersey.test.framework.JerseyTest.getDefaultTestContainerFactory(JerseyTest.java:406)
	at com.sun.jersey.test.framework.JerseyTest.getTestContainerFactory(JerseyTest.java:273)
	at com.sun.jersey.test.framework.JerseyTest.<init>(JerseyTest.java:217)
	at org.apache.hadoop.yarn.webapp.JerseyTestBase.<init>(JerseyTestBase.java:27)
	at org.apache.hadoop.yarn.server.resourcemanager.webapp.TestRMWebServicesAppsModification.<init>(TestRMWebServicesAppsModification.java:277)


FAILED:  org.apache.hadoop.yarn.server.resourcemanager.webapp.TestRMWebServicesAppsModification.testAppSubmitBadJsonAndXML[3]

Error Message:
The default test container factory, null, could not be instantiated

Stack Trace:
com.sun.jersey.test.framework.spi.container.TestContainerException: The default test container factory, null, could not be instantiated
	at com.sun.jersey.test.framework.JerseyTest.getDefaultTestContainerFactory(JerseyTest.java:406)
	at com.sun.jersey.test.framework.JerseyTest.getTestContainerFactory(JerseyTest.java:273)
	at com.sun.jersey.test.framework.JerseyTest.<init>(JerseyTest.java:217)
	at org.apache.hadoop.yarn.webapp.JerseyTestBase.<init>(JerseyTestBase.java:27)
	at org.apache.hadoop.yarn.server.resourcemanager.webapp.TestRMWebServicesAppsModification.<init>(TestRMWebServicesAppsModification.java:277)


FAILED:  org.apache.hadoop.yarn.server.resourcemanager.webapp.TestRMWebServicesCapacitySched.testPerUserResourcesXML

Error Message:
The default test container factory, null, could not be instantiated

Stack Trace:
com.sun.jersey.test.framework.spi.container.TestContainerException: The default test container factory, null, could not be instantiated
	at com.sun.jersey.test.framework.JerseyTest.getDefaultTestContainerFactory(JerseyTest.java:406)
	at com.sun.jersey.test.framework.JerseyTest.getTestContainerFactory(JerseyTest.java:273)
	at com.sun.jersey.test.framework.JerseyTest.<init>(JerseyTest.java:217)
	at org.apache.hadoop.yarn.webapp.JerseyTestBase.<init>(JerseyTestBase.java:27)
	at org.apache.hadoop.yarn.server.resourcemanager.webapp.TestRMWebServicesCapacitySched.<init>(TestRMWebServicesCapacitySched.java:163)


FAILED:  org.apache.hadoop.yarn.server.resourcemanager.webapp.TestRMWebServicesCapacitySched.testClusterSchedulerXML

Error Message:
The default test container factory, null, could not be instantiated

Stack Trace:
com.sun.jersey.test.framework.spi.container.TestContainerException: The default test container factory, null, could not be instantiated
	at com.sun.jersey.test.framework.JerseyTest.getDefaultTestContainerFactory(JerseyTest.java:406)
	at com.sun.jersey.test.framework.JerseyTest.getTestContainerFactory(JerseyTest.java:273)
	at com.sun.jersey.test.framework.JerseyTest.<init>(JerseyTest.java:217)
	at org.apache.hadoop.yarn.webapp.JerseyTestBase.<init>(JerseyTestBase.java:27)
	at org.apache.hadoop.yarn.server.resourcemanager.webapp.TestRMWebServicesCapacitySched.<init>(TestRMWebServicesCapacitySched.java:163)


FAILED:  org.apache.hadoop.yarn.server.resourcemanager.webapp.TestRMWebServicesCapacitySched.testClusterScheduler

Error Message:
The default test container factory, null, could not be instantiated

Stack Trace:
com.sun.jersey.test.framework.spi.container.TestContainerException: The default test container factory, null, could not be instantiated
	at com.sun.jersey.test.framework.JerseyTest.getDefaultTestContainerFactory(JerseyTest.java:406)
	at com.sun.jersey.test.framework.JerseyTest.getTestContainerFactory(JerseyTest.java:273)
	at com.sun.jersey.test.framework.JerseyTest.<init>(JerseyTest.java:217)
	at org.apache.hadoop.yarn.webapp.JerseyTestBase.<init>(JerseyTestBase.java:27)
	at org.apache.hadoop.yarn.server.resourcemanager.webapp.TestRMWebServicesCapacitySched.<init>(TestRMWebServicesCapacitySched.java:163)


FAILED:  org.apache.hadoop.yarn.server.resourcemanager.webapp.TestRMWebServicesCapacitySched.testResourceInfo

Error Message:
The default test container factory, null, could not be instantiated

Stack Trace:
com.sun.jersey.test.framework.spi.container.TestContainerException: The default test container factory, null, could not be instantiated
	at com.sun.jersey.test.framework.JerseyTest.getDefaultTestContainerFactory(JerseyTest.java:406)
	at com.sun.jersey.test.framework.JerseyTest.getTestContainerFactory(JerseyTest.java:273)
	at com.sun.jersey.test.framework.JerseyTest.<init>(JerseyTest.java:217)
	at org.apache.hadoop.yarn.webapp.JerseyTestBase.<init>(JerseyTestBase.java:27)
	at org.apache.hadoop.yarn.server.resourcemanager.webapp.TestRMWebServicesCapacitySched.<init>(TestRMWebServicesCapacitySched.java:163)


FAILED:  org.apache.hadoop.yarn.server.resourcemanager.webapp.TestRMWebServicesCapacitySched.testPerUserResourcesJSON

Error Message:
The default test container factory, null, could not be instantiated

Stack Trace:
com.sun.jersey.test.framework.spi.container.TestContainerException: The default test container factory, null, could not be instantiated
	at com.sun.jersey.test.framework.JerseyTest.getDefaultTestContainerFactory(JerseyTest.java:406)
	at com.sun.jersey.test.framework.JerseyTest.getTestContainerFactory(JerseyTest.java:273)
	at com.sun.jersey.test.framework.JerseyTest.<init>(JerseyTest.java:217)
	at org.apache.hadoop.yarn.webapp.JerseyTestBase.<init>(JerseyTestBase.java:27)
	at org.apache.hadoop.yarn.server.resourcemanager.webapp.TestRMWebServicesCapacitySched.<init>(TestRMWebServicesCapacitySched.java:163)


FAILED:  org.apache.hadoop.yarn.server.resourcemanager.webapp.TestRMWebServicesCapacitySched.testClusterSchedulerDefault

Error Message:
The default test container factory, null, could not be instantiated

Stack Trace:
com.sun.jersey.test.framework.spi.container.TestContainerException: The default test container factory, null, could not be instantiated
	at com.sun.jersey.test.framework.JerseyTest.getDefaultTestContainerFactory(JerseyTest.java:406)
	at com.sun.jersey.test.framework.JerseyTest.getTestContainerFactory(JerseyTest.java:273)
	at com.sun.jersey.test.framework.JerseyTest.<init>(JerseyTest.java:217)
	at org.apache.hadoop.yarn.webapp.JerseyTestBase.<init>(JerseyTestBase.java:27)
	at org.apache.hadoop.yarn.server.resourcemanager.webapp.TestRMWebServicesCapacitySched.<init>(TestRMWebServicesCapacitySched.java:163)


FAILED:  org.apache.hadoop.yarn.server.resourcemanager.webapp.TestRMWebServicesCapacitySched.testClusterSchedulerSlash

Error Message:
The default test container factory, null, could not be instantiated

Stack Trace:
com.sun.jersey.test.framework.spi.container.TestContainerException: The default test container factory, null, could not be instantiated
	at com.sun.jersey.test.framework.JerseyTest.getDefaultTestContainerFactory(JerseyTest.java:406)
	at com.sun.jersey.test.framework.JerseyTest.getTestContainerFactory(JerseyTest.java:273)
	at com.sun.jersey.test.framework.JerseyTest.<init>(JerseyTest.java:217)
	at org.apache.hadoop.yarn.webapp.JerseyTestBase.<init>(JerseyTestBase.java:27)
	at org.apache.hadoop.yarn.server.resourcemanager.webapp.TestRMWebServicesCapacitySched.<init>(TestRMWebServicesCapacitySched.java:163)


FAILED:  org.apache.hadoop.yarn.server.resourcemanager.webapp.TestRMWebServicesDelegationTokens.testCancelDelegationToken[0]

Error Message:
The default test container factory, null, could not be instantiated

Stack Trace:
com.sun.jersey.test.framework.spi.container.TestContainerException: The default test container factory, null, could not be instantiated
	at com.sun.jersey.test.framework.JerseyTest.getDefaultTestContainerFactory(JerseyTest.java:406)
	at com.sun.jersey.test.framework.JerseyTest.getTestContainerFactory(JerseyTest.java:273)
	at com.sun.jersey.test.framework.JerseyTest.<init>(JerseyTest.java:217)
	at org.apache.hadoop.yarn.webapp.JerseyTestBase.<init>(JerseyTestBase.java:27)
	at org.apache.hadoop.yarn.server.resourcemanager.webapp.TestRMWebServicesDelegationTokens.<init>(TestRMWebServicesDelegationTokens.java:217)


FAILED:  org.apache.hadoop.yarn.server.resourcemanager.webapp.TestRMWebServicesDelegationTokens.testRenewDelegationToken[0]

Error Message:
The default test container factory, null, could not be instantiated

Stack Trace:
com.sun.jersey.test.framework.spi.container.TestContainerException: The default test container factory, null, could not be instantiated
	at com.sun.jersey.test.framework.JerseyTest.getDefaultTestContainerFactory(JerseyTest.java:406)
	at com.sun.jersey.test.framework.JerseyTest.getTestContainerFactory(JerseyTest.java:273)
	at com.sun.jersey.test.framework.JerseyTest.<init>(JerseyTest.java:217)
	at org.apache.hadoop.yarn.webapp.JerseyTestBase.<init>(JerseyTestBase.java:27)
	at org.apache.hadoop.yarn.server.resourcemanager.webapp.TestRMWebServicesDelegationTokens.<init>(TestRMWebServicesDelegationTokens.java:217)


FAILED:  org.apache.hadoop.yarn.server.resourcemanager.webapp.TestRMWebServicesDelegationTokens.testCreateDelegationToken[0]

Error Message:
The default test container factory, null, could not be instantiated

Stack Trace:
com.sun.jersey.test.framework.spi.container.TestContainerException: The default test container factory, null, could not be instantiated
	at com.sun.jersey.test.framework.JerseyTest.getDefaultTestContainerFactory(JerseyTest.java:406)
	at com.sun.jersey.test.framework.JerseyTest.getTestContainerFactory(JerseyTest.java:273)
	at com.sun.jersey.test.framework.JerseyTest.<init>(JerseyTest.java:217)
	at org.apache.hadoop.yarn.webapp.JerseyTestBase.<init>(JerseyTestBase.java:27)
	at org.apache.hadoop.yarn.server.resourcemanager.webapp.TestRMWebServicesDelegationTokens.<init>(TestRMWebServicesDelegationTokens.java:217)


FAILED:  org.apache.hadoop.yarn.server.resourcemanager.webapp.TestRMWebServicesDelegationTokens.testCancelDelegationToken[1]

Error Message:
The default test container factory, null, could not be instantiated

Stack Trace:
com.sun.jersey.test.framework.spi.container.TestContainerException: The default test container factory, null, could not be instantiated
	at com.sun.jersey.test.framework.JerseyTest.getDefaultTestContainerFactory(JerseyTest.java:406)
	at com.sun.jersey.test.framework.JerseyTest.getTestContainerFactory(JerseyTest.java:273)
	at com.sun.jersey.test.framework.JerseyTest.<init>(JerseyTest.java:217)
	at org.apache.hadoop.yarn.webapp.JerseyTestBase.<init>(JerseyTestBase.java:27)
	at org.apache.hadoop.yarn.server.resourcemanager.webapp.TestRMWebServicesDelegationTokens.<init>(TestRMWebServicesDelegationTokens.java:217)


FAILED:  org.apache.hadoop.yarn.server.resourcemanager.webapp.TestRMWebServicesDelegationTokens.testRenewDelegationToken[1]

Error Message:
The default test container factory, null, could not be instantiated

Stack Trace:
com.sun.jersey.test.framework.spi.container.TestContainerException: The default test container factory, null, could not be instantiated
	at com.sun.jersey.test.framework.JerseyTest.getDefaultTestContainerFactory(JerseyTest.java:406)
	at com.sun.jersey.test.framework.JerseyTest.getTestContainerFactory(JerseyTest.java:273)
	at com.sun.jersey.test.framework.JerseyTest.<init>(JerseyTest.java:217)
	at org.apache.hadoop.yarn.webapp.JerseyTestBase.<init>(JerseyTestBase.java:27)
	at org.apache.hadoop.yarn.server.resourcemanager.webapp.TestRMWebServicesDelegationTokens.<init>(TestRMWebServicesDelegationTokens.java:217)


FAILED:  org.apache.hadoop.yarn.server.resourcemanager.webapp.TestRMWebServicesDelegationTokens.testCreateDelegationToken[1]

Error Message:
The default test container factory, null, could not be instantiated

Stack Trace:
com.sun.jersey.test.framework.spi.container.TestContainerException: The default test container factory, null, could not be instantiated
	at com.sun.jersey.test.framework.JerseyTest.getDefaultTestContainerFactory(JerseyTest.java:406)
	at com.sun.jersey.test.framework.JerseyTest.getTestContainerFactory(JerseyTest.java:273)
	at com.sun.jersey.test.framework.JerseyTest.<init>(JerseyTest.java:217)
	at org.apache.hadoop.yarn.webapp.JerseyTestBase.<init>(JerseyTestBase.java:27)
	at org.apache.hadoop.yarn.server.resourcemanager.webapp.TestRMWebServicesDelegationTokens.<init>(TestRMWebServicesDelegationTokens.java:217)


FAILED:  org.apache.hadoop.yarn.server.resourcemanager.webapp.TestRMWebServicesFairScheduler.testClusterScheduler

Error Message:
The default test container factory, null, could not be instantiated

Stack Trace:
com.sun.jersey.test.framework.spi.container.TestContainerException: The default test container factory, null, could not be instantiated
	at com.sun.jersey.test.framework.JerseyTest.getDefaultTestContainerFactory(JerseyTest.java:406)
	at com.sun.jersey.test.framework.JerseyTest.getTestContainerFactory(JerseyTest.java:273)
	at com.sun.jersey.test.framework.JerseyTest.<init>(JerseyTest.java:217)
	at org.apache.hadoop.yarn.webapp.JerseyTestBase.<init>(JerseyTestBase.java:27)
	at org.apache.hadoop.yarn.server.resourcemanager.webapp.TestRMWebServicesFairScheduler.<init>(TestRMWebServicesFairScheduler.java:73)


FAILED:  org.apache.hadoop.yarn.server.resourcemanager.webapp.TestRMWebServicesFairScheduler.testClusterSchedulerSlash

Error Message:
The default test container factory, null, could not be instantiated

Stack Trace:
com.sun.jersey.test.framework.spi.container.TestContainerException: The default test container factory, null, could not be instantiated
	at com.sun.jersey.test.framework.JerseyTest.getDefaultTestContainerFactory(JerseyTest.java:406)
	at com.sun.jersey.test.framework.JerseyTest.getTestContainerFactory(JerseyTest.java:273)
	at com.sun.jersey.test.framework.JerseyTest.<init>(JerseyTest.java:217)
	at org.apache.hadoop.yarn.webapp.JerseyTestBase.<init>(JerseyTestBase.java:27)
	at org.apache.hadoop.yarn.server.resourcemanager.webapp.TestRMWebServicesFairScheduler.<init>(TestRMWebServicesFairScheduler.java:73)


FAILED:  org.apache.hadoop.yarn.server.resourcemanager.webapp.TestRMWebServicesNodeLabels.testNodeLabels

Error Message:
The default test container factory, null, could not be instantiated

Stack Trace:
com.sun.jersey.test.framework.spi.container.TestContainerException: The default test container factory, null, could not be instantiated
	at com.sun.jersey.test.framework.JerseyTest.getDefaultTestContainerFactory(JerseyTest.java:406)
	at com.sun.jersey.test.framework.JerseyTest.getTestContainerFactory(JerseyTest.java:273)
	at com.sun.jersey.test.framework.JerseyTest.<init>(JerseyTest.java:217)
	at org.apache.hadoop.yarn.webapp.JerseyTestBase.<init>(JerseyTestBase.java:27)
	at org.apache.hadoop.yarn.server.resourcemanager.webapp.TestRMWebServicesNodeLabels.<init>(TestRMWebServicesNodeLabels.java:100)


FAILED:  org.apache.hadoop.yarn.server.resourcemanager.webapp.TestRMWebServicesNodes.testNonexistNodeXML

Error Message:
The default test container factory, null, could not be instantiated

Stack Trace:
com.sun.jersey.test.framework.spi.container.TestContainerException: The default test container factory, null, could not be instantiated
	at com.sun.jersey.test.framework.JerseyTest.getDefaultTestContainerFactory(JerseyTest.java:406)
	at com.sun.jersey.test.framework.JerseyTest.getTestContainerFactory(JerseyTest.java:273)
	at com.sun.jersey.test.framework.JerseyTest.<init>(JerseyTest.java:217)
	at org.apache.hadoop.yarn.webapp.JerseyTestBase.<init>(JerseyTestBase.java:27)
	at org.apache.hadoop.yarn.server.resourcemanager.webapp.TestRMWebServicesNodes.<init>(TestRMWebServicesNodes.java:103)


FAILED:  org.apache.hadoop.yarn.server.resourcemanager.webapp.TestRMWebServicesNodes.testInvalidNode

Error Message:
The default test container factory, null, could not be instantiated

Stack Trace:
com.sun.jersey.test.framework.spi.container.TestContainerException: The default test container factory, null, could not be instantiated
	at com.sun.jersey.test.framework.JerseyTest.getDefaultTestContainerFactory(JerseyTest.java:406)
	at com.sun.jersey.test.framework.JerseyTest.getTestContainerFactory(JerseyTest.java:273)
	at com.sun.jersey.test.framework.JerseyTest.<init>(JerseyTest.java:217)
	at org.apache.hadoop.yarn.webapp.JerseyTestBase.<init>(JerseyTestBase.java:27)
	at org.apache.hadoop.yarn.server.resourcemanager.webapp.TestRMWebServicesNodes.<init>(TestRMWebServicesNodes.java:103)


FAILED:  org.apache.hadoop.yarn.server.resourcemanager.webapp.TestRMWebServicesNodes.testNodes

Error Message:
The default test container factory, null, could not be instantiated

Stack Trace:
com.sun.jersey.test.framework.spi.container.TestContainerException: The default test container factory, null, could not be instantiated
	at com.sun.jersey.test.framework.JerseyTest.getDefaultTestContainerFactory(JerseyTest.java:406)
	at com.sun.jersey.test.framework.JerseyTest.getTestContainerFactory(JerseyTest.java:273)
	at com.sun.jersey.test.framework.JerseyTest.<init>(JerseyTest.java:217)
	at org.apache.hadoop.yarn.webapp.JerseyTestBase.<init>(JerseyTestBase.java:27)
	at org.apache.hadoop.yarn.server.resourcemanager.webapp.TestRMWebServicesNodes.<init>(TestRMWebServicesNodes.java:103)


FAILED:  org.apache.hadoop.yarn.server.resourcemanager.webapp.TestRMWebServicesNodes.testNonexistNode

Error Message:
The default test container factory, null, could not be instantiated

Stack Trace:
com.sun.jersey.test.framework.spi.container.TestContainerException: The default test container factory, null, could not be instantiated
	at com.sun.jersey.test.framework.JerseyTest.getDefaultTestContainerFactory(JerseyTest.java:406)
	at com.sun.jersey.test.framework.JerseyTest.getTestContainerFactory(JerseyTest.java:273)
	at com.sun.jersey.test.framework.JerseyTest.<init>(JerseyTest.java:217)
	at org.apache.hadoop.yarn.webapp.JerseyTestBase.<init>(JerseyTestBase.java:27)
	at org.apache.hadoop.yarn.server.resourcemanager.webapp.TestRMWebServicesNodes.<init>(TestRMWebServicesNodes.java:103)


FAILED:  org.apache.hadoop.yarn.server.resourcemanager.webapp.TestRMWebServicesNodes.testQueryAll

Error Message:
The default test container factory, null, could not be instantiated

Stack Trace:
com.sun.jersey.test.framework.spi.container.TestContainerException: The default test container factory, null, could not be instantiated
	at com.sun.jersey.test.framework.JerseyTest.getDefaultTestContainerFactory(JerseyTest.java:406)
	at com.sun.jersey.test.framework.JerseyTest.getTestContainerFactory(JerseyTest.java:273)
	at com.sun.jersey.test.framework.JerseyTest.<init>(JerseyTest.java:217)
	at org.apache.hadoop.yarn.webapp.JerseyTestBase.<init>(JerseyTestBase.java:27)
	at org.apache.hadoop.yarn.server.resourcemanager.webapp.TestRMWebServicesNodes.<init>(TestRMWebServicesNodes.java:103)


FAILED:  org.apache.hadoop.yarn.server.resourcemanager.webapp.TestRMWebServicesNodes.testNodesQueryHealthyFalse

Error Message:
The default test container factory, null, could not be instantiated

Stack Trace:
com.sun.jersey.test.framework.spi.container.TestContainerException: The default test container factory, null, could not be instantiated
	at com.sun.jersey.test.framework.JerseyTest.getDefaultTestContainerFactory(JerseyTest.java:406)
	at com.sun.jersey.test.framework.JerseyTest.getTestContainerFactory(JerseyTest.java:273)
	at com.sun.jersey.test.framework.JerseyTest.<init>(JerseyTest.java:217)
	at org.apache.hadoop.yarn.webapp.JerseyTestBase.<init>(JerseyTestBase.java:27)
	at org.apache.hadoop.yarn.server.resourcemanager.webapp.TestRMWebServicesNodes.<init>(TestRMWebServicesNodes.java:103)


FAILED:  org.apache.hadoop.yarn.server.resourcemanager.webapp.TestRMWebServicesNodes.testSingleNodeQueryStateLost

Error Message:
The default test container factory, null, could not be instantiated

Stack Trace:
com.sun.jersey.test.framework.spi.container.TestContainerException: The default test container factory, null, could not be instantiated
	at com.sun.jersey.test.framework.JerseyTest.getDefaultTestContainerFactory(JerseyTest.java:406)
	at com.sun.jersey.test.framework.JerseyTest.getTestContainerFactory(JerseyTest.java:273)
	at com.sun.jersey.test.framework.JerseyTest.<init>(JerseyTest.java:217)
	at org.apache.hadoop.yarn.webapp.JerseyTestBase.<init>(JerseyTestBase.java:27)
	at org.apache.hadoop.yarn.server.resourcemanager.webapp.TestRMWebServicesNodes.<init>(TestRMWebServicesNodes.java:103)


FAILED:  org.apache.hadoop.yarn.server.resourcemanager.webapp.TestRMWebServicesNodes.testNodesQueryRunning

Error Message:
The default test container factory, null, could not be instantiated

Stack Trace:
com.sun.jersey.test.framework.spi.container.TestContainerException: The default test container factory, null, could not be instantiated
	at com.sun.jersey.test.framework.JerseyTest.getDefaultTestContainerFactory(JerseyTest.java:406)
	at com.sun.jersey.test.framework.JerseyTest.getTestContainerFactory(JerseyTest.java:273)
	at com.sun.jersey.test.framework.JerseyTest.<init>(JerseyTest.java:217)
	at org.apache.hadoop.yarn.webapp.JerseyTestBase.<init>(JerseyTestBase.java:27)
	at org.apache.hadoop.yarn.server.resourcemanager.webapp.TestRMWebServicesNodes.<init>(TestRMWebServicesNodes.java:103)


FAILED:  org.apache.hadoop.yarn.server.resourcemanager.webapp.TestRMWebServicesNodes.testSingleNodesXML

Error Message:
The default test container factory, null, could not be instantiated

Stack Trace:
com.sun.jersey.test.framework.spi.container.TestContainerException: The default test container factory, null, could not be instantiated
	at com.sun.jersey.test.framework.JerseyTest.getDefaultTestContainerFactory(JerseyTest.java:406)
	at com.sun.jersey.test.framework.JerseyTest.getTestContainerFactory(JerseyTest.java:273)
	at com.sun.jersey.test.framework.JerseyTest.<init>(JerseyTest.java:217)
	at org.apache.hadoop.yarn.webapp.JerseyTestBase.<init>(JerseyTestBase.java:27)
	at org.apache.hadoop.yarn.server.resourcemanager.webapp.TestRMWebServicesNodes.<init>(TestRMWebServicesNodes.java:103)


FAILED:  org.apache.hadoop.yarn.server.resourcemanager.webapp.TestRMWebServicesNodes.testSingleNode

Error Message:
The default test container factory, null, could not be instantiated

Stack Trace:
com.sun.jersey.test.framework.spi.container.TestContainerException: The default test container factory, null, could not be instantiated
	at com.sun.jersey.test.framework.JerseyTest.getDefaultTestContainerFactory(JerseyTest.java:406)
	at com.sun.jersey.test.framework.JerseyTest.getTestContainerFactory(JerseyTest.java:273)
	at com.sun.jersey.test.framework.JerseyTest.<init>(JerseyTest.java:217)
	at org.apache.hadoop.yarn.webapp.JerseyTestBase.<init>(JerseyTestBase.java:27)
	at org.apache.hadoop.yarn.server.resourcemanager.webapp.TestRMWebServicesNodes.<init>(TestRMWebServicesNodes.java:103)


FAILED:  org.apache.hadoop.yarn.server.resourcemanager.webapp.TestRMWebServicesNodes.testNodesDefaultWithUnHealthyNode

Error Message:
The default test container factory, null, could not be instantiated

Stack Trace:
com.sun.jersey.test.framework.spi.container.TestContainerException: The default test container factory, null, could not be instantiated
	at com.sun.jersey.test.framework.JerseyTest.getDefaultTestContainerFactory(JerseyTest.java:406)
	at com.sun.jersey.test.framework.JerseyTest.getTestContainerFactory(JerseyTest.java:273)
	at com.sun.jersey.test.framework.JerseyTest.<init>(JerseyTest.java:217)
	at org.apache.hadoop.yarn.webapp.JerseyTestBase.<init>(JerseyTestBase.java:27)
	at org.apache.hadoop.yarn.server.resourcemanager.webapp.TestRMWebServicesNodes.<init>(TestRMWebServicesNodes.java:103)


FAILED:  org.apache.hadoop.yarn.server.resourcemanager.webapp.TestRMWebServicesNodes.testNodesQueryStateInvalid

Error Message:
The default test container factory, null, could not be instantiated

Stack Trace:
com.sun.jersey.test.framework.spi.container.TestContainerException: The default test container factory, null, could not be instantiated
	at com.sun.jersey.test.framework.JerseyTest.getDefaultTestContainerFactory(JerseyTest.java:406)
	at com.sun.jersey.test.framework.JerseyTest.getTestContainerFactory(JerseyTest.java:273)
	at com.sun.jersey.test.framework.JerseyTest.<init>(JerseyTest.java:217)
	at org.apache.hadoop.yarn.webapp.JerseyTestBase.<init>(JerseyTestBase.java:27)
	at org.apache.hadoop.yarn.server.resourcemanager.webapp.TestRMWebServicesNodes.<init>(TestRMWebServicesNodes.java:103)


FAILED:  org.apache.hadoop.yarn.server.resourcemanager.webapp.TestRMWebServicesNodes.testNodesQueryNew

Error Message:
The default test container factory, null, could not be instantiated

Stack Trace:
com.sun.jersey.test.framework.spi.container.TestContainerException: The default test container factory, null, could not be instantiated
	at com.sun.jersey.test.framework.JerseyTest.getDefaultTestContainerFactory(JerseyTest.java:406)
	at com.sun.jersey.test.framework.JerseyTest.getTestContainerFactory(JerseyTest.java:273)
	at com.sun.jersey.test.framework.JerseyTest.<init>(JerseyTest.java:217)
	at org.apache.hadoop.yarn.webapp.JerseyTestBase.<init>(JerseyTestBase.java:27)
	at org.apache.hadoop.yarn.server.resourcemanager.webapp.TestRMWebServicesNodes.<init>(TestRMWebServicesNodes.java:103)


FAILED:  org.apache.hadoop.yarn.server.resourcemanager.webapp.TestRMWebServicesNodes.testNonexistNodeDefault

Error Message:
The default test container factory, null, could not be instantiated

Stack Trace:
com.sun.jersey.test.framework.spi.container.TestContainerException: The default test container factory, null, could not be instantiated
	at com.sun.jersey.test.framework.JerseyTest.getDefaultTestContainerFactory(JerseyTest.java:406)
	at com.sun.jersey.test.framework.JerseyTest.getTestContainerFactory(JerseyTest.java:273)
	at com.sun.jersey.test.framework.JerseyTest.<init>(JerseyTest.java:217)
	at org.apache.hadoop.yarn.webapp.JerseyTestBase.<init>(JerseyTestBase.java:27)
	at org.apache.hadoop.yarn.server.resourcemanager.webapp.TestRMWebServicesNodes.<init>(TestRMWebServicesNodes.java:103)


FAILED:  org.apache.hadoop.yarn.server.resourcemanager.webapp.TestRMWebServicesNodes.testNodes2XML

Error Message:
The default test container factory, null, could not be instantiated

Stack Trace:
com.sun.jersey.test.framework.spi.container.TestContainerException: The default test container factory, null, could not be instantiated
	at com.sun.jersey.test.framework.JerseyTest.getDefaultTestContainerFactory(JerseyTest.java:406)
	at com.sun.jersey.test.framework.JerseyTest.getTestContainerFactory(JerseyTest.java:273)
	at com.sun.jersey.test.framework.JerseyTest.<init>(JerseyTest.java:217)
	at org.apache.hadoop.yarn.webapp.JerseyTestBase.<init>(JerseyTestBase.java:27)
	at org.apache.hadoop.yarn.server.resourcemanager.webapp.TestRMWebServicesNodes.<init>(TestRMWebServicesNodes.java:103)


FAILED:  org.apache.hadoop.yarn.server.resourcemanager.webapp.TestRMWebServicesNodes.testSingleNodeDefault

Error Message:
The default test container factory, null, could not be instantiated

Stack Trace:
com.sun.jersey.test.framework.spi.container.TestContainerException: The default test container factory, null, could not be instantiated
	at com.sun.jersey.test.framework.JerseyTest.getDefaultTestContainerFactory(JerseyTest.java:406)
	at com.sun.jersey.test.framework.JerseyTest.getTestContainerFactory(JerseyTest.java:273)
	at com.sun.jersey.test.framework.JerseyTest.<init>(JerseyTest.java:217)
	at org.apache.hadoop.yarn.webapp.JerseyTestBase.<init>(JerseyTestBase.java:27)
	at org.apache.hadoop.yarn.server.resourcemanager.webapp.TestRMWebServicesNodes.<init>(TestRMWebServicesNodes.java:103)


FAILED:  org.apache.hadoop.yarn.server.resourcemanager.webapp.TestRMWebServicesNodes.testSingleNodeSlash

Error Message:
The default test container factory, null, could not be instantiated

Stack Trace:
com.sun.jersey.test.framework.spi.container.TestContainerException: The default test container factory, null, could not be instantiated
	at com.sun.jersey.test.framework.JerseyTest.getDefaultTestContainerFactory(JerseyTest.java:406)
	at com.sun.jersey.test.framework.JerseyTest.getTestContainerFactory(JerseyTest.java:273)
	at com.sun.jersey.test.framework.JerseyTest.<init>(JerseyTest.java:217)
	at org.apache.hadoop.yarn.webapp.JerseyTestBase.<init>(JerseyTestBase.java:27)
	at org.apache.hadoop.yarn.server.resourcemanager.webapp.TestRMWebServicesNodes.<init>(TestRMWebServicesNodes.java:103)


FAILED:  org.apache.hadoop.yarn.server.resourcemanager.webapp.TestRMWebServicesNodes.testNodesSlash

Error Message:
The default test container factory, null, could not be instantiated

Stack Trace:
com.sun.jersey.test.framework.spi.container.TestContainerException: The default test container factory, null, could not be instantiated
	at com.sun.jersey.test.framework.JerseyTest.getDefaultTestContainerFactory(JerseyTest.java:406)
	at com.sun.jersey.test.framework.JerseyTest.getTestContainerFactory(JerseyTest.java:273)
	at com.sun.jersey.test.framework.JerseyTest.<init>(JerseyTest.java:217)
	at org.apache.hadoop.yarn.webapp.JerseyTestBase.<init>(JerseyTestBase.java:27)
	at org.apache.hadoop.yarn.server.resourcemanager.webapp.TestRMWebServicesNodes.<init>(TestRMWebServicesNodes.java:103)


FAILED:  org.apache.hadoop.yarn.server.resourcemanager.webapp.TestRMWebServicesNodes.testNodesQueryStateLost

Error Message:
The default test container factory, null, could not be instantiated

Stack Trace:
com.sun.jersey.test.framework.spi.container.TestContainerException: The default test container factory, null, could not be instantiated
	at com.sun.jersey.test.framework.JerseyTest.getDefaultTestContainerFactory(JerseyTest.java:406)
	at com.sun.jersey.test.framework.JerseyTest.getTestContainerFactory(JerseyTest.java:273)
	at com.sun.jersey.test.framework.JerseyTest.<init>(JerseyTest.java:217)
	at org.apache.hadoop.yarn.webapp.JerseyTestBase.<init>(JerseyTestBase.java:27)
	at org.apache.hadoop.yarn.server.resourcemanager.webapp.TestRMWebServicesNodes.<init>(TestRMWebServicesNodes.java:103)


FAILED:  org.apache.hadoop.yarn.server.resourcemanager.webapp.TestRMWebServicesNodes.testNodesQueryStateNone

Error Message:
The default test container factory, null, could not be instantiated

Stack Trace:
com.sun.jersey.test.framework.spi.container.TestContainerException: The default test container factory, null, could not be instantiated
	at com.sun.jersey.test.framework.JerseyTest.getDefaultTestContainerFactory(JerseyTest.java:406)
	at com.sun.jersey.test.framework.JerseyTest.getTestContainerFactory(JerseyTest.java:273)
	at com.sun.jersey.test.framework.JerseyTest.<init>(JerseyTest.java:217)
	at org.apache.hadoop.yarn.webapp.JerseyTestBase.<init>(JerseyTestBase.java:27)
	at org.apache.hadoop.yarn.server.resourcemanager.webapp.TestRMWebServicesNodes.<init>(TestRMWebServicesNodes.java:103)


FAILED:  org.apache.hadoop.yarn.server.resourcemanager.webapp.TestRMWebServicesNodes.testNodesXML

Error Message:
The default test container factory, null, could not be instantiated

Stack Trace:
com.sun.jersey.test.framework.spi.container.TestContainerException: The default test container factory, null, could not be instantiated
	at com.sun.jersey.test.framework.JerseyTest.getDefaultTestContainerFactory(JerseyTest.java:406)
	at com.sun.jersey.test.framework.JerseyTest.getTestContainerFactory(JerseyTest.java:273)
	at com.sun.jersey.test.framework.JerseyTest.<init>(JerseyTest.java:217)
	at org.apache.hadoop.yarn.webapp.JerseyTestBase.<init>(JerseyTestBase.java:27)
	at org.apache.hadoop.yarn.server.resourcemanager.webapp.TestRMWebServicesNodes.<init>(TestRMWebServicesNodes.java:103)


FAILED:  org.apache.hadoop.yarn.server.resourcemanager.webapp.TestRMWebServicesNodes.testNodesDefault

Error Message:
The default test container factory, null, could not be instantiated

Stack Trace:
com.sun.jersey.test.framework.spi.container.TestContainerException: The default test container factory, null, could not be instantiated
	at com.sun.jersey.test.framework.JerseyTest.getDefaultTestContainerFactory(JerseyTest.java:406)
	at com.sun.jersey.test.framework.JerseyTest.getTestContainerFactory(JerseyTest.java:273)
	at com.sun.jersey.test.framework.JerseyTest.<init>(JerseyTest.java:217)
	at org.apache.hadoop.yarn.webapp.JerseyTestBase.<init>(JerseyTestBase.java:27)
	at org.apache.hadoop.yarn.server.resourcemanager.webapp.TestRMWebServicesNodes.<init>(TestRMWebServicesNodes.java:103)



Mime
  • Unnamed multipart/mixed (inline, None, 0 bytes)
View raw message