hadoop-yarn-dev mailing list archives

Site index · List index
Message view « Date » · « Thread »
Top « Date » · « Thread »
From Apache Jenkins Server <jenk...@builds.apache.org>
Subject Build failed in Jenkins: Hadoop-Yarn-trunk-Java8 #157
Date Wed, 08 Apr 2015 10:41:40 GMT
See <https://builds.apache.org/job/Hadoop-Yarn-trunk-Java8/157/changes>

Changes:

[omalley] HADOOP-11717. Support JWT tokens for web single sign on to the Hadoop

[xgong] YARN-3110. Few issues in ApplicationHistory web ui. Contributed by Naganarasimha G
R

[xgong] YARN-3294. Allow dumping of Capacity Scheduler debug logs via web UI for

[szetszwo] HDFS-8049. Add @InterfaceAudience.Private annotation to hdfs client implementation.
Contributed by Takuya Fukudome

[cnauroth] HDFS-8038. PBImageDelimitedTextWriter#getEntry output HDFS path in platform-specific
format. Contributed by Xiaoyu Yao.

[cnauroth] HADOOP-11796. Skip TestShellBasedIdMapping.testStaticMapUpdate on Windows. Contributed
by Xiaoyu Yao.

[rkanter] YARN-3429. Fix incorrect CHANGES.txt

[arp] HADOOP-11801. Update BUILDING.txt for Ubuntu. (Contributed by Gabor Liptak)

[yzhang] HDFS-5215. dfs.datanode.du.reserved is not considered while computing

[szetszwo] HDFS-8079. Move dfs.client.retry.* confs from DFSConfigKeys to HdfsClientConfigKeys.Retry.

[vinayakumarb] HDFS-8073. Split BlockPlacementPolicyDefault.chooseTarget(..) so it can be
easily overrided. (Contributed by Walter Su)

[wheat9] HDFS-8080. Separate JSON related routines used by WebHdfsFileSystem to a package
local class. Contributed by Haohui Mai.

[ozawa] YARN-3457. NPE when NodeManager.serviceInit fails and stopRecoveryStore called. Contributed
by Bibin A Chundatt.

------------------------------------------
[...truncated 4173 lines...]
[INFO] 
[INFO] --- maven-surefire-plugin:2.17:test (default-test) @ hadoop-yarn-server-nodemanager
---
[INFO] Surefire report directory: <https://builds.apache.org/job/Hadoop-Yarn-trunk-Java8/ws/hadoop-yarn-project/hadoop-yarn/hadoop-yarn-server/hadoop-yarn-server-nodemanager/target/surefire-reports>

-------------------------------------------------------
 T E S T S
-------------------------------------------------------

-------------------------------------------------------
 T E S T S
-------------------------------------------------------
Java HotSpot(TM) 64-Bit Server VM warning: ignoring option MaxPermSize=768m; support was removed
in 8.0
Running org.apache.hadoop.yarn.server.nodemanager.TestNodeManagerResync
Tests run: 5, Failures: 0, Errors: 0, Skipped: 0, Time elapsed: 20.58 sec - in org.apache.hadoop.yarn.server.nodemanager.TestNodeManagerResync
Java HotSpot(TM) 64-Bit Server VM warning: ignoring option MaxPermSize=768m; support was removed
in 8.0
Running org.apache.hadoop.yarn.server.nodemanager.util.TestProcessIdFileReader
Tests run: 3, Failures: 0, Errors: 0, Skipped: 0, Time elapsed: 0.183 sec - in org.apache.hadoop.yarn.server.nodemanager.util.TestProcessIdFileReader
Java HotSpot(TM) 64-Bit Server VM warning: ignoring option MaxPermSize=768m; support was removed
in 8.0
Running org.apache.hadoop.yarn.server.nodemanager.util.TestCgroupsLCEResourcesHandler
Tests run: 5, Failures: 0, Errors: 0, Skipped: 0, Time elapsed: 1.097 sec - in org.apache.hadoop.yarn.server.nodemanager.util.TestCgroupsLCEResourcesHandler
Java HotSpot(TM) 64-Bit Server VM warning: ignoring option MaxPermSize=768m; support was removed
in 8.0
Running org.apache.hadoop.yarn.server.nodemanager.util.TestNodeManagerHardwareUtils
Tests run: 1, Failures: 0, Errors: 0, Skipped: 0, Time elapsed: 0.502 sec - in org.apache.hadoop.yarn.server.nodemanager.util.TestNodeManagerHardwareUtils
Java HotSpot(TM) 64-Bit Server VM warning: ignoring option MaxPermSize=768m; support was removed
in 8.0
Running org.apache.hadoop.yarn.server.nodemanager.TestNodeStatusUpdater
Tests run: 14, Failures: 0, Errors: 0, Skipped: 0, Time elapsed: 64.807 sec - in org.apache.hadoop.yarn.server.nodemanager.TestNodeStatusUpdater
Java HotSpot(TM) 64-Bit Server VM warning: ignoring option MaxPermSize=768m; support was removed
in 8.0
Running org.apache.hadoop.yarn.server.nodemanager.TestDockerContainerExecutor
Tests run: 1, Failures: 0, Errors: 0, Skipped: 0, Time elapsed: 0.586 sec - in org.apache.hadoop.yarn.server.nodemanager.TestDockerContainerExecutor
Java HotSpot(TM) 64-Bit Server VM warning: ignoring option MaxPermSize=768m; support was removed
in 8.0
Running org.apache.hadoop.yarn.server.nodemanager.TestLinuxContainerExecutor
Tests run: 8, Failures: 0, Errors: 0, Skipped: 8, Time elapsed: 0.814 sec - in org.apache.hadoop.yarn.server.nodemanager.TestLinuxContainerExecutor
Java HotSpot(TM) 64-Bit Server VM warning: ignoring option MaxPermSize=768m; support was removed
in 8.0
Running org.apache.hadoop.yarn.server.nodemanager.TestLinuxContainerExecutorWithMocks
Tests run: 8, Failures: 0, Errors: 0, Skipped: 0, Time elapsed: 0.954 sec - in org.apache.hadoop.yarn.server.nodemanager.TestLinuxContainerExecutorWithMocks
Java HotSpot(TM) 64-Bit Server VM warning: ignoring option MaxPermSize=768m; support was removed
in 8.0
Running org.apache.hadoop.yarn.server.nodemanager.security.TestNMTokenSecretManagerInNM
Tests run: 1, Failures: 0, Errors: 0, Skipped: 0, Time elapsed: 1.054 sec - in org.apache.hadoop.yarn.server.nodemanager.security.TestNMTokenSecretManagerInNM
Java HotSpot(TM) 64-Bit Server VM warning: ignoring option MaxPermSize=768m; support was removed
in 8.0
Running org.apache.hadoop.yarn.server.nodemanager.security.TestNMContainerTokenSecretManager
Tests run: 1, Failures: 0, Errors: 0, Skipped: 0, Time elapsed: 1.249 sec - in org.apache.hadoop.yarn.server.nodemanager.security.TestNMContainerTokenSecretManager
Java HotSpot(TM) 64-Bit Server VM warning: ignoring option MaxPermSize=768m; support was removed
in 8.0
Running org.apache.hadoop.yarn.server.nodemanager.TestRecordFactory
Tests run: 1, Failures: 0, Errors: 0, Skipped: 0, Time elapsed: 0.23 sec - in org.apache.hadoop.yarn.server.nodemanager.TestRecordFactory
Java HotSpot(TM) 64-Bit Server VM warning: ignoring option MaxPermSize=768m; support was removed
in 8.0
Running org.apache.hadoop.yarn.server.nodemanager.recovery.TestNMLeveldbStateStoreService
Tests run: 12, Failures: 0, Errors: 0, Skipped: 0, Time elapsed: 1.595 sec - in org.apache.hadoop.yarn.server.nodemanager.recovery.TestNMLeveldbStateStoreService
Java HotSpot(TM) 64-Bit Server VM warning: ignoring option MaxPermSize=768m; support was removed
in 8.0
Running org.apache.hadoop.yarn.server.nodemanager.TestContainerManagerWithLCE
Tests run: 10, Failures: 0, Errors: 0, Skipped: 0, Time elapsed: 1.165 sec - in org.apache.hadoop.yarn.server.nodemanager.TestContainerManagerWithLCE
Java HotSpot(TM) 64-Bit Server VM warning: ignoring option MaxPermSize=768m; support was removed
in 8.0
Running org.apache.hadoop.yarn.server.nodemanager.TestRPCFactories
Tests run: 1, Failures: 0, Errors: 0, Skipped: 0, Time elapsed: 0.686 sec - in org.apache.hadoop.yarn.server.nodemanager.TestRPCFactories
Java HotSpot(TM) 64-Bit Server VM warning: ignoring option MaxPermSize=768m; support was removed
in 8.0
Running org.apache.hadoop.yarn.server.nodemanager.TestContainerExecutor
Tests run: 5, Failures: 0, Errors: 0, Skipped: 3, Time elapsed: 0.633 sec - in org.apache.hadoop.yarn.server.nodemanager.TestContainerExecutor
Java HotSpot(TM) 64-Bit Server VM warning: ignoring option MaxPermSize=768m; support was removed
in 8.0
Running org.apache.hadoop.yarn.server.nodemanager.TestNodeManagerShutdown
Tests run: 2, Failures: 0, Errors: 0, Skipped: 0, Time elapsed: 5.683 sec - in org.apache.hadoop.yarn.server.nodemanager.TestNodeManagerShutdown
Java HotSpot(TM) 64-Bit Server VM warning: ignoring option MaxPermSize=768m; support was removed
in 8.0
Running org.apache.hadoop.yarn.server.nodemanager.metrics.TestNodeManagerMetrics
Tests run: 1, Failures: 0, Errors: 0, Skipped: 0, Time elapsed: 0.725 sec - in org.apache.hadoop.yarn.server.nodemanager.metrics.TestNodeManagerMetrics
Java HotSpot(TM) 64-Bit Server VM warning: ignoring option MaxPermSize=768m; support was removed
in 8.0
Running org.apache.hadoop.yarn.server.nodemanager.TestNodeManager
Tests run: 1, Failures: 0, Errors: 0, Skipped: 0, Time elapsed: 0.855 sec - in org.apache.hadoop.yarn.server.nodemanager.TestNodeManager
Java HotSpot(TM) 64-Bit Server VM warning: ignoring option MaxPermSize=768m; support was removed
in 8.0
Running org.apache.hadoop.yarn.server.nodemanager.TestNodeManagerReboot
Tests run: 1, Failures: 0, Errors: 0, Skipped: 0, Time elapsed: 5.654 sec - in org.apache.hadoop.yarn.server.nodemanager.TestNodeManagerReboot
Java HotSpot(TM) 64-Bit Server VM warning: ignoring option MaxPermSize=768m; support was removed
in 8.0
Running org.apache.hadoop.yarn.server.nodemanager.TestDefaultContainerExecutor
Tests run: 3, Failures: 0, Errors: 0, Skipped: 0, Time elapsed: 11.34 sec - in org.apache.hadoop.yarn.server.nodemanager.TestDefaultContainerExecutor
Java HotSpot(TM) 64-Bit Server VM warning: ignoring option MaxPermSize=768m; support was removed
in 8.0
Running org.apache.hadoop.yarn.server.nodemanager.api.protocolrecords.impl.pb.TestPBLocalizerRPC
Tests run: 1, Failures: 0, Errors: 0, Skipped: 0, Time elapsed: 0.84 sec - in org.apache.hadoop.yarn.server.nodemanager.api.protocolrecords.impl.pb.TestPBLocalizerRPC
Java HotSpot(TM) 64-Bit Server VM warning: ignoring option MaxPermSize=768m; support was removed
in 8.0
Running org.apache.hadoop.yarn.server.nodemanager.api.protocolrecords.impl.pb.TestPBRecordImpl
Tests run: 4, Failures: 0, Errors: 0, Skipped: 0, Time elapsed: 0.54 sec - in org.apache.hadoop.yarn.server.nodemanager.api.protocolrecords.impl.pb.TestPBRecordImpl
Java HotSpot(TM) 64-Bit Server VM warning: ignoring option MaxPermSize=768m; support was removed
in 8.0
Running org.apache.hadoop.yarn.server.nodemanager.TestLocalDirsHandlerService
Tests run: 3, Failures: 0, Errors: 0, Skipped: 0, Time elapsed: 0.717 sec - in org.apache.hadoop.yarn.server.nodemanager.TestLocalDirsHandlerService
Java HotSpot(TM) 64-Bit Server VM warning: ignoring option MaxPermSize=768m; support was removed
in 8.0
Running org.apache.hadoop.yarn.server.nodemanager.TestNodeHealthService
Tests run: 1, Failures: 0, Errors: 0, Skipped: 0, Time elapsed: 0.871 sec - in org.apache.hadoop.yarn.server.nodemanager.TestNodeHealthService
Java HotSpot(TM) 64-Bit Server VM warning: ignoring option MaxPermSize=768m; support was removed
in 8.0
Running org.apache.hadoop.yarn.server.nodemanager.containermanager.container.TestContainer
Tests run: 18, Failures: 0, Errors: 0, Skipped: 0, Time elapsed: 1.731 sec - in org.apache.hadoop.yarn.server.nodemanager.containermanager.container.TestContainer
Java HotSpot(TM) 64-Bit Server VM warning: ignoring option MaxPermSize=768m; support was removed
in 8.0
Running org.apache.hadoop.yarn.server.nodemanager.containermanager.TestNMProxy
Tests run: 1, Failures: 0, Errors: 0, Skipped: 0, Time elapsed: 3.178 sec - in org.apache.hadoop.yarn.server.nodemanager.containermanager.TestNMProxy
Java HotSpot(TM) 64-Bit Server VM warning: ignoring option MaxPermSize=768m; support was removed
in 8.0
Running org.apache.hadoop.yarn.server.nodemanager.containermanager.logaggregation.TestLogAggregationService
Tests run: 16, Failures: 0, Errors: 0, Skipped: 0, Time elapsed: 30.778 sec - in org.apache.hadoop.yarn.server.nodemanager.containermanager.logaggregation.TestLogAggregationService
Java HotSpot(TM) 64-Bit Server VM warning: ignoring option MaxPermSize=768m; support was removed
in 8.0
Running org.apache.hadoop.yarn.server.nodemanager.containermanager.TestContainerManager
Tests run: 10, Failures: 0, Errors: 0, Skipped: 0, Time elapsed: 24.838 sec - in org.apache.hadoop.yarn.server.nodemanager.containermanager.TestContainerManager
Java HotSpot(TM) 64-Bit Server VM warning: ignoring option MaxPermSize=768m; support was removed
in 8.0
Running org.apache.hadoop.yarn.server.nodemanager.containermanager.monitor.TestContainerMetrics
Tests run: 2, Failures: 0, Errors: 0, Skipped: 0, Time elapsed: 0.887 sec - in org.apache.hadoop.yarn.server.nodemanager.containermanager.monitor.TestContainerMetrics
Java HotSpot(TM) 64-Bit Server VM warning: ignoring option MaxPermSize=768m; support was removed
in 8.0
Running org.apache.hadoop.yarn.server.nodemanager.containermanager.monitor.TestContainersMonitor
Tests run: 3, Failures: 0, Errors: 0, Skipped: 0, Time elapsed: 6.883 sec - in org.apache.hadoop.yarn.server.nodemanager.containermanager.monitor.TestContainersMonitor
Java HotSpot(TM) 64-Bit Server VM warning: ignoring option MaxPermSize=768m; support was removed
in 8.0
Running org.apache.hadoop.yarn.server.nodemanager.containermanager.loghandler.TestNonAggregatingLogHandler
Tests run: 6, Failures: 0, Errors: 0, Skipped: 0, Time elapsed: 1.257 sec - in org.apache.hadoop.yarn.server.nodemanager.containermanager.loghandler.TestNonAggregatingLogHandler
Java HotSpot(TM) 64-Bit Server VM warning: ignoring option MaxPermSize=768m; support was removed
in 8.0
Running org.apache.hadoop.yarn.server.nodemanager.containermanager.TestAuxServices
Tests run: 6, Failures: 0, Errors: 0, Skipped: 0, Time elapsed: 0.784 sec - in org.apache.hadoop.yarn.server.nodemanager.containermanager.TestAuxServices
Java HotSpot(TM) 64-Bit Server VM warning: ignoring option MaxPermSize=768m; support was removed
in 8.0
Running org.apache.hadoop.yarn.server.nodemanager.containermanager.TestContainerManagerRecovery
Tests run: 1, Failures: 0, Errors: 0, Skipped: 0, Time elapsed: 1.58 sec - in org.apache.hadoop.yarn.server.nodemanager.containermanager.TestContainerManagerRecovery
Java HotSpot(TM) 64-Bit Server VM warning: ignoring option MaxPermSize=768m; support was removed
in 8.0
Running org.apache.hadoop.yarn.server.nodemanager.containermanager.launcher.TestContainerLaunch
Tests run: 16, Failures: 0, Errors: 0, Skipped: 4, Time elapsed: 19.879 sec - in org.apache.hadoop.yarn.server.nodemanager.containermanager.launcher.TestContainerLaunch
Java HotSpot(TM) 64-Bit Server VM warning: ignoring option MaxPermSize=768m; support was removed
in 8.0
Running org.apache.hadoop.yarn.server.nodemanager.containermanager.localizer.TestLocalCacheDirectoryManager
Tests run: 5, Failures: 0, Errors: 0, Skipped: 0, Time elapsed: 1.079 sec - in org.apache.hadoop.yarn.server.nodemanager.containermanager.localizer.TestLocalCacheDirectoryManager
Java HotSpot(TM) 64-Bit Server VM warning: ignoring option MaxPermSize=768m; support was removed
in 8.0
Running org.apache.hadoop.yarn.server.nodemanager.containermanager.localizer.TestContainerLocalizer
Tests run: 3, Failures: 0, Errors: 0, Skipped: 0, Time elapsed: 1.181 sec - in org.apache.hadoop.yarn.server.nodemanager.containermanager.localizer.TestContainerLocalizer
Java HotSpot(TM) 64-Bit Server VM warning: ignoring option MaxPermSize=768m; support was removed
in 8.0
Running org.apache.hadoop.yarn.server.nodemanager.containermanager.localizer.TestLocalResourcesTrackerImpl
Tests run: 8, Failures: 0, Errors: 0, Skipped: 0, Time elapsed: 1.05 sec - in org.apache.hadoop.yarn.server.nodemanager.containermanager.localizer.TestLocalResourcesTrackerImpl
Java HotSpot(TM) 64-Bit Server VM warning: ignoring option MaxPermSize=768m; support was removed
in 8.0
Running org.apache.hadoop.yarn.server.nodemanager.containermanager.localizer.sharedcache.TestSharedCacheUploadService
Tests run: 2, Failures: 0, Errors: 0, Skipped: 0, Time elapsed: 0.679 sec - in org.apache.hadoop.yarn.server.nodemanager.containermanager.localizer.sharedcache.TestSharedCacheUploadService
Java HotSpot(TM) 64-Bit Server VM warning: ignoring option MaxPermSize=768m; support was removed
in 8.0
Running org.apache.hadoop.yarn.server.nodemanager.containermanager.localizer.sharedcache.TestSharedCacheUploader
Tests run: 6, Failures: 0, Errors: 0, Skipped: 0, Time elapsed: 0.899 sec - in org.apache.hadoop.yarn.server.nodemanager.containermanager.localizer.sharedcache.TestSharedCacheUploader
Java HotSpot(TM) 64-Bit Server VM warning: ignoring option MaxPermSize=768m; support was removed
in 8.0
Running org.apache.hadoop.yarn.server.nodemanager.containermanager.localizer.TestLocalResource
Tests run: 2, Failures: 0, Errors: 0, Skipped: 0, Time elapsed: 0.387 sec - in org.apache.hadoop.yarn.server.nodemanager.containermanager.localizer.TestLocalResource
Java HotSpot(TM) 64-Bit Server VM warning: ignoring option MaxPermSize=768m; support was removed
in 8.0
Running org.apache.hadoop.yarn.server.nodemanager.containermanager.localizer.TestResourceRetention
Tests run: 1, Failures: 0, Errors: 0, Skipped: 0, Time elapsed: 0.769 sec - in org.apache.hadoop.yarn.server.nodemanager.containermanager.localizer.TestResourceRetention
Java HotSpot(TM) 64-Bit Server VM warning: ignoring option MaxPermSize=768m; support was removed
in 8.0
Running org.apache.hadoop.yarn.server.nodemanager.containermanager.localizer.TestLocalizedResource
Tests run: 1, Failures: 0, Errors: 0, Skipped: 0, Time elapsed: 0.558 sec - in org.apache.hadoop.yarn.server.nodemanager.containermanager.localizer.TestLocalizedResource
Java HotSpot(TM) 64-Bit Server VM warning: ignoring option MaxPermSize=768m; support was removed
in 8.0
Running org.apache.hadoop.yarn.server.nodemanager.containermanager.localizer.TestResourceLocalizationService
Tests run: 13, Failures: 0, Errors: 1, Skipped: 0, Time elapsed: 5.38 sec <<< FAILURE!
- in org.apache.hadoop.yarn.server.nodemanager.containermanager.localizer.TestResourceLocalizationService
testPublicResourceInitializesLocalDir(org.apache.hadoop.yarn.server.nodemanager.containermanager.localizer.TestResourceLocalizationService)
 Time elapsed: 0.249 sec  <<< ERROR!
java.io.IOException: Unable to delete directory target/org.apache.hadoop.yarn.server.nodemanager.containermanager.localizer.TestResourceLocalizationService/1.
	at org.apache.commons.io.FileUtils.deleteDirectory(FileUtils.java:1541)
	at org.apache.commons.io.FileUtils.forceDelete(FileUtils.java:2270)
	at org.apache.commons.io.FileUtils.cleanDirectory(FileUtils.java:1653)
	at org.apache.commons.io.FileUtils.deleteDirectory(FileUtils.java:1535)
	at org.apache.hadoop.yarn.server.nodemanager.containermanager.localizer.TestResourceLocalizationService.cleanup(TestResourceLocalizationService.java:186)

Java HotSpot(TM) 64-Bit Server VM warning: ignoring option MaxPermSize=768m; support was removed
in 8.0
Running org.apache.hadoop.yarn.server.nodemanager.containermanager.application.TestApplication
Tests run: 8, Failures: 0, Errors: 0, Skipped: 0, Time elapsed: 5.212 sec - in org.apache.hadoop.yarn.server.nodemanager.containermanager.application.TestApplication
Java HotSpot(TM) 64-Bit Server VM warning: ignoring option MaxPermSize=768m; support was removed
in 8.0
Running org.apache.hadoop.yarn.server.nodemanager.TestDirectoryCollection
Tests run: 6, Failures: 0, Errors: 0, Skipped: 0, Time elapsed: 0.657 sec - in org.apache.hadoop.yarn.server.nodemanager.TestDirectoryCollection
Java HotSpot(TM) 64-Bit Server VM warning: ignoring option MaxPermSize=768m; support was removed
in 8.0
Running org.apache.hadoop.yarn.server.nodemanager.TestNMAuditLogger
Tests run: 3, Failures: 0, Errors: 0, Skipped: 0, Time elapsed: 0.884 sec - in org.apache.hadoop.yarn.server.nodemanager.TestNMAuditLogger
Java HotSpot(TM) 64-Bit Server VM warning: ignoring option MaxPermSize=768m; support was removed
in 8.0
Running org.apache.hadoop.yarn.server.nodemanager.TestNodeStatusUpdaterForLabels
Tests run: 1, Failures: 0, Errors: 0, Skipped: 0, Time elapsed: 4.138 sec - in org.apache.hadoop.yarn.server.nodemanager.TestNodeStatusUpdaterForLabels
Java HotSpot(TM) 64-Bit Server VM warning: ignoring option MaxPermSize=768m; support was removed
in 8.0
Running org.apache.hadoop.yarn.server.nodemanager.TestDeletionService
Tests run: 6, Failures: 0, Errors: 0, Skipped: 0, Time elapsed: 22.536 sec - in org.apache.hadoop.yarn.server.nodemanager.TestDeletionService
Java HotSpot(TM) 64-Bit Server VM warning: ignoring option MaxPermSize=768m; support was removed
in 8.0
Running org.apache.hadoop.yarn.server.nodemanager.TestDockerContainerExecutorWithMocks
Tests run: 4, Failures: 0, Errors: 0, Skipped: 0, Time elapsed: 1.046 sec - in org.apache.hadoop.yarn.server.nodemanager.TestDockerContainerExecutorWithMocks
Java HotSpot(TM) 64-Bit Server VM warning: ignoring option MaxPermSize=768m; support was removed
in 8.0
Running org.apache.hadoop.yarn.server.nodemanager.TestEventFlow
Tests run: 1, Failures: 0, Errors: 0, Skipped: 0, Time elapsed: 5.479 sec - in org.apache.hadoop.yarn.server.nodemanager.TestEventFlow
Java HotSpot(TM) 64-Bit Server VM warning: ignoring option MaxPermSize=768m; support was removed
in 8.0
Running org.apache.hadoop.yarn.server.nodemanager.webapp.TestNMWebServices
Tests run: 11, Failures: 0, Errors: 0, Skipped: 0, Time elapsed: 5.89 sec - in org.apache.hadoop.yarn.server.nodemanager.webapp.TestNMWebServices
Java HotSpot(TM) 64-Bit Server VM warning: ignoring option MaxPermSize=768m; support was removed
in 8.0
Running org.apache.hadoop.yarn.server.nodemanager.webapp.TestNMWebServicesContainers
Tests run: 12, Failures: 0, Errors: 0, Skipped: 0, Time elapsed: 5.937 sec - in org.apache.hadoop.yarn.server.nodemanager.webapp.TestNMWebServicesContainers
Java HotSpot(TM) 64-Bit Server VM warning: ignoring option MaxPermSize=768m; support was removed
in 8.0
Running org.apache.hadoop.yarn.server.nodemanager.webapp.TestContainerLogsPage
Tests run: 4, Failures: 0, Errors: 0, Skipped: 1, Time elapsed: 1.112 sec - in org.apache.hadoop.yarn.server.nodemanager.webapp.TestContainerLogsPage
Java HotSpot(TM) 64-Bit Server VM warning: ignoring option MaxPermSize=768m; support was removed
in 8.0
Running org.apache.hadoop.yarn.server.nodemanager.webapp.TestNMWebServicesApps
Tests run: 19, Failures: 0, Errors: 0, Skipped: 0, Time elapsed: 7.651 sec - in org.apache.hadoop.yarn.server.nodemanager.webapp.TestNMWebServicesApps
Java HotSpot(TM) 64-Bit Server VM warning: ignoring option MaxPermSize=768m; support was removed
in 8.0
Running org.apache.hadoop.yarn.server.nodemanager.webapp.TestNMWebServer
Tests run: 3, Failures: 0, Errors: 0, Skipped: 0, Time elapsed: 2.138 sec - in org.apache.hadoop.yarn.server.nodemanager.webapp.TestNMWebServer

Results :

Tests in error: 
  TestResourceLocalizationService.cleanup:186 ยป IO Unable to delete directory ta...

Tests run: 291, Failures: 0, Errors: 1, Skipped: 16

[INFO] ------------------------------------------------------------------------
[INFO] Reactor Summary:
[INFO] 
[INFO] hadoop-yarn ....................................... SUCCESS [  3.077 s]
[INFO] hadoop-yarn-api ................................... SUCCESS [ 55.840 s]
[INFO] hadoop-yarn-common ................................ SUCCESS [02:17 min]
[INFO] hadoop-yarn-server ................................ SUCCESS [  0.053 s]
[INFO] hadoop-yarn-server-common ......................... SUCCESS [ 33.770 s]
[INFO] hadoop-yarn-server-nodemanager .................... FAILURE [05:33 min]
[INFO] hadoop-yarn-server-web-proxy ...................... SKIPPED
[INFO] hadoop-yarn-server-applicationhistoryservice ...... SKIPPED
[INFO] hadoop-yarn-server-resourcemanager ................ SKIPPED
[INFO] hadoop-yarn-server-tests .......................... SKIPPED
[INFO] hadoop-yarn-client ................................ SKIPPED
[INFO] hadoop-yarn-server-sharedcachemanager ............. SKIPPED
[INFO] hadoop-yarn-applications .......................... SKIPPED
[INFO] hadoop-yarn-applications-distributedshell ......... SKIPPED
[INFO] hadoop-yarn-applications-unmanaged-am-launcher .... SKIPPED
[INFO] hadoop-yarn-site .................................. SKIPPED
[INFO] hadoop-yarn-registry .............................. SKIPPED
[INFO] hadoop-yarn-project ............................... SKIPPED
[INFO] ------------------------------------------------------------------------
[INFO] BUILD FAILURE
[INFO] ------------------------------------------------------------------------
[INFO] Total time: 09:24 min
[INFO] Finished at: 2015-04-08T10:41:28+00:00
[INFO] Final Memory: 77M/743M
[INFO] ------------------------------------------------------------------------
[ERROR] Failed to execute goal org.apache.maven.plugins:maven-surefire-plugin:2.17:test (default-test)
on project hadoop-yarn-server-nodemanager: There are test failures.
[ERROR] 
[ERROR] Please refer to <https://builds.apache.org/job/Hadoop-Yarn-trunk-Java8/ws/hadoop-yarn-project/hadoop-yarn/hadoop-yarn-server/hadoop-yarn-server-nodemanager/target/surefire-reports>
for the individual test results.
[ERROR] -> [Help 1]
[ERROR] 
[ERROR] To see the full stack trace of the errors, re-run Maven with the -e switch.
[ERROR] Re-run Maven using the -X switch to enable full debug logging.
[ERROR] 
[ERROR] For more information about the errors and possible solutions, please read the following
articles:
[ERROR] [Help 1] http://cwiki.apache.org/confluence/display/MAVEN/MojoFailureException
[ERROR] 
[ERROR] After correcting the problems, you can resume the build with the command
[ERROR]   mvn <goals> -rf :hadoop-yarn-server-nodemanager
Build step 'Execute shell' marked build as failure
Archiving artifacts
Recording test results
Updating HADOOP-11801
Updating HDFS-8080
Updating YARN-3110
Updating HDFS-8038
Updating YARN-3457
Updating HDFS-8079
Updating YARN-3294
Updating HDFS-8073
Updating HADOOP-11717
Updating HDFS-8049
Updating HDFS-5215
Updating YARN-3429
Updating HADOOP-11796

Mime
View raw message