hadoop-yarn-dev mailing list archives

Site index · List index
Message view « Date » · « Thread »
Top « Date » · « Thread »
From Apache Jenkins Server <jenk...@builds.apache.org>
Subject Failed: YARN-3533 PreCommit Build #7467
Date Thu, 23 Apr 2015 05:25:47 GMT
Jira: https://issues.apache.org/jira/browse/YARN-3533
Build: https://builds.apache.org/job/PreCommit-YARN-Build/7467/

###################################################################################
########################## LAST 60 LINES OF THE CONSOLE ###########################
[...truncated 243 lines...]
|  +1  |      release audit  |  0m 20s    | The applied patch does not increase 
|      |                     |            | the total number of release audit
|      |                     |            | warnings.
|  +1  |         checkstyle  |  5m 26s    | There were no new checkstyle 
|      |                     |            | issues.
|  +1  |            install  |  1m 32s    | mvn install still works. 
|  +1  |    eclipse:eclipse  |  0m 31s    | The patch built with 
|      |                     |            | eclipse:eclipse.
|  +1  |           findbugs  |  1m 14s    | The patch does not introduce any 
|      |                     |            | new Findbugs (version 2.0.3)
|      |                     |            | warnings.
|  -1  |         yarn tests  |  52m 47s   | Tests failed in 
|      |                     |            | hadoop-yarn-server-resourcemanager.
|      |                     |  74m 35s   | 


             Reason | Tests
 Failed unit tests  |  hadoop.yarn.server.resourcemanager.scheduler.capacity.TestContainerAllocation



|| Subsystem || Report/Notes ||
============================================================================
| Patch URL | http://issues.apache.org/jira/secure/attachment/12727472/YARN-3533.001.patch
|
| Optional Tests | javac unit findbugs checkstyle |
| git revision | trunk / a100be6 |
| hadoop-yarn-server-resourcemanager test log | /home/jenkins/jenkins-slave/workspace/PreCommit-YARN-Build/../patchprocess/testrun_hadoop-yarn-server-resourcemanager.txt
|
| Test Results | https://builds.apache.org/job/PreCommit-YARN-Build/7467/testReport/ |


============================================================================
============================================================================
                          Adding comment to JIRA
============================================================================
============================================================================


Comment added.
7f2ccc81a0dc7c27ddcf56f42e9d334812657385 logged out


============================================================================
============================================================================
                              Finished build.
============================================================================
============================================================================


Build step 'Execute shell' marked build as failure
Archiving artifacts
Sending artifact delta relative to PreCommit-YARN-Build #7452
Archived 19 artifacts
Archive block size is 32768
Received 787 blocks and 143803945 bytes
Compression is 15.2%
Took 42 sec
[description-setter] Could not determine description.
Recording test results
Email was triggered for: Failure
Sending email for trigger: Failure



###################################################################################
############################## FAILED TESTS (if any) ##############################
1 tests failed.
FAILED:  org.apache.hadoop.yarn.server.resourcemanager.scheduler.capacity.TestContainerAllocation.testAMContainerAllocationWhenDNSUnavailable

Error Message:
test timed out after 30000 milliseconds

Stack Trace:
java.lang.Exception: test timed out after 30000 milliseconds
	at java.lang.Thread.sleep(Native Method)
	at org.apache.hadoop.yarn.server.resourcemanager.MockRM.waitForState(MockRM.java:151)
	at org.apache.hadoop.yarn.server.resourcemanager.MockRM.launchAM(MockRM.java:692)
	at org.apache.hadoop.yarn.server.resourcemanager.MockRM.launchAndRegisterAM(MockRM.java:702)
	at org.apache.hadoop.yarn.server.resourcemanager.scheduler.capacity.TestContainerAllocation.testAMContainerAllocationWhenDNSUnavailable(TestContainerAllocation.java:336)



Mime
  • Unnamed multipart/mixed (inline, None, 0 bytes)
View raw message