hadoop-yarn-dev mailing list archives

Site index · List index
Message view « Date » · « Thread »
Top « Date » · « Thread »
From Apache Jenkins Server <jenk...@builds.apache.org>
Subject Failed: YARN-2368 PreCommit Build #6904
Date Tue, 10 Mar 2015 21:19:37 GMT
Jira: https://issues.apache.org/jira/browse/YARN-2368
Build: https://builds.apache.org/job/PreCommit-YARN-Build/6904/

###################################################################################
########################## LAST 60 LINES OF THE CONSOLE ###########################
[...truncated 3735 lines...]
    {color:green}+1 javadoc{color}.  There were no new javadoc warning messages.

    {color:green}+1 eclipse:eclipse{color}.  The patch built with eclipse:eclipse.

    {color:red}-1 findbugs{color}.  The patch appears to introduce 5 new Findbugs (version
2.0.3) warnings.

    {color:green}+1 release audit{color}.  The applied patch does not increase the total number
of release audit warnings.

    {color:red}-1 core tests{color}.  The patch failed these unit tests in hadoop-yarn-project/hadoop-yarn/hadoop-yarn-api
hadoop-yarn-project/hadoop-yarn/hadoop-yarn-common hadoop-yarn-project/hadoop-yarn/hadoop-yarn-server/hadoop-yarn-server-resourcemanager:

                  org.apache.hadoop.yarn.server.resourcemanager.scheduler.capacity.TestContainerAllocation

Test results: https://builds.apache.org/job/PreCommit-YARN-Build/6904//testReport/
Findbugs warnings: https://builds.apache.org/job/PreCommit-YARN-Build/6904//artifact/patchprocess/newPatchFindbugsWarningshadoop-yarn-server-resourcemanager.html
Console output: https://builds.apache.org/job/PreCommit-YARN-Build/6904//console

This message is automatically generated.


======================================================================
======================================================================
    Adding comment to Jira.
======================================================================
======================================================================


Comment added.
d3c8ac626c9c432156e58a84ca4bfa1b67249bf1 logged out


======================================================================
======================================================================
    Finished build.
======================================================================
======================================================================


Build step 'Execute shell' marked build as failure
Archiving artifacts
Sending artifact delta relative to PreCommit-YARN-Build #6896
ERROR: Failed to archive {patchprocess/patchJavacWarnings.txt=patchprocess/patchJavacWarnings.txt,
patchprocess/patchJavadocWarnings.txt=patchprocess/patchJavadocWarnings.txt, patchprocess/newPatchFindbugsWarningshadoop-yarn-server-resourcemanager.xml=patchprocess/newPatchFindbugsWarningshadoop-yarn-server-resourcemanager.xml,
patchprocess/trunkJavadocWarnings.txt=patchprocess/trunkJavadocWarnings.txt, patchprocess/patchFindbugsWarningshadoop-yarn-common.xml=patchprocess/patchFindbugsWarningshadoop-yarn-common.xml,
patchprocess/patchFindbugsWarningshadoop-yarn-api.xml=patchprocess/patchFindbugsWarningshadoop-yarn-api.xml,
patchprocess/diffJavadocWarnings.txt=patchprocess/diffJavadocWarnings.txt, patchprocess/testrun_hadoop-yarn-api.txt=patchprocess/testrun_hadoop-yarn-api.txt,
patchprocess/patchFindBugsOutputhadoop-yarn-server-resourcemanager.txt=patchprocess/patchFindBugsOutputhadoop-yarn-server-resourcemanager.txt,
patchprocess/newPatchFindbugsWarningshadoop-yarn-common.xml=patchprocess/newPatchFindbugsWarningshadoop-yarn-common.xml,
patchprocess/trunkJavacWarnings.txt=patchprocess/trunkJavacWarnings.txt, patchprocess/newPatchFindbugsWarningshadoop-yarn-server-resourcemanager.html=patchprocess/newPatchFindbugsWarningshadoop-yarn-server-resourcemanager.html,
patchprocess/testrun_hadoop-yarn-server-resourcemanager.txt=patchprocess/testrun_hadoop-yarn-server-resourcemanager.txt,
patchprocess/patchReleaseAuditOutput.txt=patchprocess/patchReleaseAuditOutput.txt, patchprocess/patchReleaseAuditWarnings.txt=patchprocess/patchReleaseAuditWarnings.txt,
patchprocess/filteredPatchJavacWarnings.txt=patchprocess/filteredPatchJavacWarnings.txt, patchprocess/patchFindbugsWarningshadoop-yarn-server-resourcemanager.xml=patchprocess/patchFindbugsWarningshadoop-yarn-server-resourcemanager.xml,
patchprocess/newPatchFindbugsWarningshadoop-yarn-common.html=patchprocess/newPatchFindbugsWarningshadoop-yarn-common.html,
patchprocess/testrun_hadoop-yarn-common.txt=patchprocess/testrun_hadoop-yarn-common.txt, patchprocess/patchEclipseOutput.txt=patchprocess/patchEclipseOutput.txt,
patchprocess/newPatchFindbugsWarningshadoop-yarn-api.html=patchprocess/newPatchFindbugsWarningshadoop-yarn-api.html,
patchprocess/newPatchFindbugsWarningshadoop-yarn-api.xml=patchprocess/newPatchFindbugsWarningshadoop-yarn-api.xml,
patchprocess/patchFindBugsOutputhadoop-yarn-api.txt=patchprocess/patchFindBugsOutputhadoop-yarn-api.txt,
patchprocess/filteredTrunkJavacWarnings.txt=patchprocess/filteredTrunkJavacWarnings.txt, patchprocess/patchFindBugsOutputhadoop-yarn-common.txt=patchprocess/patchFindBugsOutputhadoop-yarn-common.txt}
due to internal error; falling back to full archiving
java.lang.IllegalStateException: checksum mismatch after transfer (6577874794637500483 vs.
3109086039); /x1/jenkins/jenkins-home/jobs/PreCommit-YARN-Build/builds/2015-03-10_19-49-59/archive/patchprocess/patchJavadocWarnings.txt
may be corrupted
	at jsync.protocol.FileSequenceReader.read(FileSequenceReader.java:45)
	at com.cloudbees.jenkins.plugins.jsync.archiver.JSyncArtifactManager.remoteSync(JSyncArtifactManager.java:145)
	at com.cloudbees.jenkins.plugins.jsync.archiver.JSyncArtifactManager.archive(JSyncArtifactManager.java:68)
	at hudson.tasks.ArtifactArchiver.perform(ArtifactArchiver.java:140)
	at hudson.tasks.BuildStepMonitor$1.perform(BuildStepMonitor.java:20)
	at hudson.model.AbstractBuild$AbstractBuildExecution.perform(AbstractBuild.java:756)
	at hudson.model.AbstractBuild$AbstractBuildExecution.performAllBuildSteps(AbstractBuild.java:720)
	at hudson.model.Build$BuildExecution.post2(Build.java:182)
	at hudson.model.AbstractBuild$AbstractBuildExecution.post(AbstractBuild.java:669)
	at hudson.model.Run.execute(Run.java:1731)
	at hudson.model.FreeStyleBuild.run(FreeStyleBuild.java:43)
	at hudson.model.ResourceController.execute(ResourceController.java:88)
	at hudson.model.Executor.run(Executor.java:232)
Description set: MAPREDUCE-4815
Recording test results
Email was triggered for: Failure
Sending email for trigger: Failure



###################################################################################
############################## FAILED TESTS (if any) ##############################
1 tests failed.
REGRESSION:  org.apache.hadoop.yarn.server.resourcemanager.scheduler.capacity.TestContainerAllocation.testAMContainerAllocationWhenDNSUnavailable

Error Message:
test timed out after 30000 milliseconds

Stack Trace:
java.lang.Exception: test timed out after 30000 milliseconds
	at java.lang.Thread.sleep(Native Method)
	at org.apache.hadoop.yarn.server.resourcemanager.MockRM.waitForState(MockRM.java:131)
	at org.apache.hadoop.yarn.server.resourcemanager.MockRM.launchAndRegisterAM(MockRM.java:669)
	at org.apache.hadoop.yarn.server.resourcemanager.scheduler.capacity.TestContainerAllocation.testAMContainerAllocationWhenDNSUnavailable(TestContainerAllocation.java:322)



Mime
  • Unnamed multipart/mixed (inline, None, 0 bytes)
View raw message