hadoop-yarn-dev mailing list archives

Site index · List index
Message view « Date » · « Thread »
Top « Date » · « Thread »
From Apache Jenkins Server <jenk...@builds.apache.org>
Subject Failed: YARN-3422 PreCommit Build #7151
Date Mon, 30 Mar 2015 19:19:52 GMT
Jira: https://issues.apache.org/jira/browse/YARN-3422
Build: https://builds.apache.org/job/PreCommit-YARN-Build/7151/

###################################################################################
########################## LAST 60 LINES OF THE CONSOLE ###########################
[...truncated 3244 lines...]
  against trunk revision 82fa3ad.

    {color:green}+1 @author{color}.  The patch does not contain any @author tags.

    {color:red}-1 tests included{color}.  The patch doesn't appear to include any new or modified
tests.
                        Please justify why no new tests are needed for this patch.
                        Also please list what manual steps were performed to verify this patch.

    {color:green}+1 javac{color}.  The applied patch does not increase the total number of
javac compiler warnings.

    {color:green}+1 javadoc{color}.  There were no new javadoc warning messages.

    {color:green}+1 eclipse:eclipse{color}.  The patch built with eclipse:eclipse.

    {color:green}+1 findbugs{color}.  The patch does not introduce any new Findbugs (version
2.0.3) warnings.

    {color:green}+1 release audit{color}.  The applied patch does not increase the total number
of release audit warnings.

    {color:red}-1 core tests{color}.  The patch failed these unit tests in hadoop-yarn-project/hadoop-yarn/hadoop-yarn-server/hadoop-yarn-server-applicationhistoryservice:

                  org.apache.hadoop.yarn.server.timeline.TestLeveldbTimelineStore

Test results: https://builds.apache.org/job/PreCommit-YARN-Build/7151//testReport/
Console output: https://builds.apache.org/job/PreCommit-YARN-Build/7151//console

This message is automatically generated.


======================================================================
======================================================================
    Adding comment to Jira.
======================================================================
======================================================================


Comment added.
82cea35a0dcac23e9e6bf243b166fa39e3f9f7ac logged out


======================================================================
======================================================================
    Finished build.
======================================================================
======================================================================


Build step 'Execute shell' marked build as failure
Archiving artifacts
Sending artifact delta relative to PreCommit-YARN-Build #7147
Archived 15 artifacts
Archive block size is 32768
Received 62 blocks and 6815843 bytes
Compression is 23.0%
Took 2.5 sec
[description-setter] Could not determine description.
Recording test results
Publish JUnit test result report is waiting for a checkpoint on PreCommit-YARN-Build #7150
Email was triggered for: Failure
Sending email for trigger: Failure



###################################################################################
############################## FAILED TESTS (if any) ##############################
1 tests failed.
FAILED:  org.apache.hadoop.yarn.server.timeline.TestLeveldbTimelineStore.testGetEntitiesWithPrimaryFilters

Error Message:
expected:<0> but was:<1>

Stack Trace:
java.lang.AssertionError: expected:<0> but was:<1>
	at org.junit.Assert.fail(Assert.java:88)
	at org.junit.Assert.failNotEquals(Assert.java:743)
	at org.junit.Assert.assertEquals(Assert.java:118)
	at org.junit.Assert.assertEquals(Assert.java:555)
	at org.junit.Assert.assertEquals(Assert.java:542)
	at org.apache.hadoop.yarn.server.timeline.TimelineStoreTestUtils.testGetEntitiesWithPrimaryFilters(TimelineStoreTestUtils.java:725)
	at org.apache.hadoop.yarn.server.timeline.TestLeveldbTimelineStore.testGetEntitiesWithPrimaryFilters(TestLeveldbTimelineStore.java:119)



Mime
  • Unnamed multipart/mixed (inline, None, 0 bytes)
View raw message