hadoop-yarn-dev mailing list archives

Site index · List index
Message view « Date » · « Thread »
Top « Date » · « Thread »
From Apache Jenkins Server <jenk...@builds.apache.org>
Subject Failed: YARN-3345 PreCommit Build #6959
Date Sat, 14 Mar 2015 00:28:54 GMT
Jira: https://issues.apache.org/jira/browse/YARN-3345
Build: https://builds.apache.org/job/PreCommit-YARN-Build/6959/

###################################################################################
########################## LAST 60 LINES OF THE CONSOLE ###########################
[...truncated 3848 lines...]

    {color:green}+1 @author{color}.  The patch does not contain any @author tags.

    {color:green}+1 tests included{color}.  The patch appears to include 5 new or modified
test files.

      {color:red}-1 javac{color}.  The applied patch generated 1153 javac compiler warnings
(more than the trunk's current 1152 warnings).

    {color:green}+1 javadoc{color}.  There were no new javadoc warning messages.

    {color:green}+1 eclipse:eclipse{color}.  The patch built with eclipse:eclipse.

    {color:red}-1 findbugs{color}.  The patch appears to introduce 8 new Findbugs (version
2.0.3) warnings.

        {color:red}-1 release audit{color}.  The applied patch generated 1 release audit warnings.

    {color:red}-1 core tests{color}.  The patch failed these unit tests in hadoop-yarn-project/hadoop-yarn/hadoop-yarn-api
hadoop-yarn-project/hadoop-yarn/hadoop-yarn-common hadoop-yarn-project/hadoop-yarn/hadoop-yarn-server/hadoop-yarn-server-resourcemanager:

                  org.apache.hadoop.yarn.nodelabels.TestFileSystemNodeLabelsStore

Test results: https://builds.apache.org/job/PreCommit-YARN-Build/6959//testReport/
Release audit warnings: https://builds.apache.org/job/PreCommit-YARN-Build/6959//artifact/patchprocess/patchReleaseAuditProblems.txt
Findbugs warnings: https://builds.apache.org/job/PreCommit-YARN-Build/6959//artifact/patchprocess/newPatchFindbugsWarningshadoop-yarn-common.html
Findbugs warnings: https://builds.apache.org/job/PreCommit-YARN-Build/6959//artifact/patchprocess/newPatchFindbugsWarningshadoop-yarn-server-resourcemanager.html
Javac warnings: https://builds.apache.org/job/PreCommit-YARN-Build/6959//artifact/patchprocess/diffJavacWarnings.txt
Console output: https://builds.apache.org/job/PreCommit-YARN-Build/6959//console

This message is automatically generated.


======================================================================
======================================================================
    Adding comment to Jira.
======================================================================
======================================================================


Comment added.
d3f3f2a589f62278d6092d6f7de1e7a8635c9061 logged out


======================================================================
======================================================================
    Finished build.
======================================================================
======================================================================


Build step 'Execute shell' marked build as failure
Archiving artifacts
Sending artifact delta relative to PreCommit-YARN-Build #6957
Archived 27 artifacts
Archive block size is 32768
Received 55 blocks and 7178145 bytes
Compression is 20.1%
Took 1.7 sec
[description-setter] Could not determine description.
Recording test results
Email was triggered for: Failure
Sending email for trigger: Failure



###################################################################################
############################## FAILED TESTS (if any) ##############################
1 tests failed.
FAILED:  org.apache.hadoop.yarn.nodelabels.TestFileSystemNodeLabelsStore.testSerilizationAfterRecovery

Error Message:
null

Stack Trace:
java.lang.NullPointerException: null
	at org.apache.hadoop.yarn.nodelabels.FileSystemNodeLabelsStore.setNodeLabelsAttributes(FileSystemNodeLabelsStore.java:164)
	at org.apache.hadoop.yarn.nodelabels.CommonNodeLabelsManager.handleStoreEvent(CommonNodeLabelsManager.java:200)
	at org.apache.hadoop.yarn.nodelabels.CommonNodeLabelsManager$ForwardingEventHandler.handle(CommonNodeLabelsManager.java:171)
	at org.apache.hadoop.yarn.nodelabels.CommonNodeLabelsManager$ForwardingEventHandler.handle(CommonNodeLabelsManager.java:166)
	at org.apache.hadoop.yarn.event.InlineDispatcher.dispatch(InlineDispatcher.java:44)
	at org.apache.hadoop.yarn.event.InlineDispatcher$TestEventHandler.handle(InlineDispatcher.java:34)
	at org.apache.hadoop.yarn.nodelabels.CommonNodeLabelsManager.setNodeLabelsAttributes(CommonNodeLabelsManager.java:861)
	at org.apache.hadoop.yarn.nodelabels.TestFileSystemNodeLabelsStore.testSerilizationAfterRecovery(TestFileSystemNodeLabelsStore.java:223)



Mime
  • Unnamed multipart/mixed (inline, None, 0 bytes)
View raw message