hadoop-yarn-dev mailing list archives

Site index · List index
Message view « Date » · « Thread »
Top « Date » · « Thread »
From Apache Jenkins Server <jenk...@builds.apache.org>
Subject Failed: YARN-3345 PreCommit Build #6982
Date Mon, 16 Mar 2015 22:17:19 GMT
Jira: https://issues.apache.org/jira/browse/YARN-3345
Build: https://builds.apache.org/job/PreCommit-YARN-Build/6982/

###################################################################################
########################## LAST 60 LINES OF THE CONSOLE ###########################
[...truncated 3837 lines...]
  http://issues.apache.org/jira/secure/attachment/12704866/YARN-3345.3.patch
  against trunk revision ce5de93.

    {color:green}+1 @author{color}.  The patch does not contain any @author tags.

    {color:green}+1 tests included{color}.  The patch appears to include 5 new or modified
test files.

    {color:green}+1 javac{color}.  The applied patch does not increase the total number of
javac compiler warnings.

    {color:green}+1 javadoc{color}.  There were no new javadoc warning messages.

    {color:green}+1 eclipse:eclipse{color}.  The patch built with eclipse:eclipse.

    {color:red}-1 findbugs{color}.  The patch appears to introduce 5 new Findbugs (version
2.0.3) warnings.

        {color:red}-1 release audit{color}.  The applied patch generated 1 release audit warnings.

    {color:red}-1 core tests{color}.  The patch failed these unit tests in hadoop-yarn-project/hadoop-yarn/hadoop-yarn-api
hadoop-yarn-project/hadoop-yarn/hadoop-yarn-common hadoop-yarn-project/hadoop-yarn/hadoop-yarn-server/hadoop-yarn-server-resourcemanager:

                  org.apache.hadoop.yarn.api.TestPBImplRecords

Test results: https://builds.apache.org/job/PreCommit-YARN-Build/6982//testReport/
Release audit warnings: https://builds.apache.org/job/PreCommit-YARN-Build/6982//artifact/patchprocess/patchReleaseAuditProblems.txt
Findbugs warnings: https://builds.apache.org/job/PreCommit-YARN-Build/6982//artifact/patchprocess/newPatchFindbugsWarningshadoop-yarn-server-resourcemanager.html
Console output: https://builds.apache.org/job/PreCommit-YARN-Build/6982//console

This message is automatically generated.


======================================================================
======================================================================
    Adding comment to Jira.
======================================================================
======================================================================


Comment added.
8ed984fedfe010f6922229a6aa71fe1c21483c13 logged out


======================================================================
======================================================================
    Finished build.
======================================================================
======================================================================


Build step 'Execute shell' marked build as failure
Archiving artifacts
Sending artifact delta relative to PreCommit-YARN-Build #6981
Archived 26 artifacts
Archive block size is 32768
Received 44 blocks and 7520048 bytes
Compression is 16.1%
Took 1.6 sec
[description-setter] Could not determine description.
Recording test results
Email was triggered for: Failure
Sending email for trigger: Failure



###################################################################################
############################## FAILED TESTS (if any) ##############################
1 tests failed.
FAILED:  org.apache.hadoop.yarn.api.TestPBImplRecords.testSetNodeLabelsAttributesRequestPBImpl

Error Message:
hashCode not designed

Stack Trace:
java.lang.AssertionError: hashCode not designed
	at org.apache.hadoop.yarn.api.records.impl.pb.NodeLabelAttributesPBImpl.hashCode(NodeLabelAttributesPBImpl.java:122)
	at java.lang.Object.toString(Object.java:237)
	at java.lang.String.valueOf(String.java:2854)
	at java.lang.StringBuilder.append(StringBuilder.java:128)
	at java.util.AbstractCollection.toString(AbstractCollection.java:458)
	at java.util.Formatter$FormatSpecifier.printString(Formatter.java:2838)
	at java.util.Formatter$FormatSpecifier.print(Formatter.java:2718)
	at java.util.Formatter.format(Formatter.java:2488)
	at java.util.Formatter.format(Formatter.java:2423)
	at java.lang.String.format(String.java:2797)
	at org.apache.hadoop.yarn.api.TestPBImplRecords.getGetSetPairs(TestPBImplRecords.java:573)
	at org.apache.hadoop.yarn.api.TestPBImplRecords.validatePBImplRecord(TestPBImplRecords.java:587)
	at org.apache.hadoop.yarn.api.TestPBImplRecords.testSetNodeLabelsAttributesRequestPBImpl(TestPBImplRecords.java:1294)



Mime
  • Unnamed multipart/mixed (inline, None, 0 bytes)
View raw message