hadoop-yarn-dev mailing list archives

Site index · List index
Message view « Date » · « Thread »
Top « Date » · « Thread »
From Apache Jenkins Server <jenk...@builds.apache.org>
Subject Build failed in Jenkins: Hadoop-Yarn-trunk #868
Date Mon, 16 Mar 2015 10:44:51 GMT
See <https://builds.apache.org/job/Hadoop-Yarn-trunk/868/changes>

Changes:

[xgong] YARN-3171. Sort by Application id, AppAttempt and ContainerID doesn't

------------------------------------------
[...truncated 7011 lines...]
     [exec]    char *resources, *resources_key, *resources_value;
     [exec]                                      ^
     [exec] <https://builds.apache.org/job/Hadoop-Yarn-trunk/ws/hadoop-yarn-project/hadoop-yarn/hadoop-yarn-server/hadoop-yarn-server-nodemanager/src/main/native/container-executor/impl/main.c>:116:21:
warning: unused variable 'resources_key' [-Wunused-variable]
     [exec]    char *resources, *resources_key, *resources_value;
     [exec]                      ^
     [exec] /home/jenkDependee "<https://builds.apache.org/job/Hadoop-Yarn-trunk/ws/hadoop-yarn-project/hadoop-yarn/hadoop-yarn-server/hadoop-yarnins/jenkins-slave/workspace/Hadoop-Yarn-trunk/hadoop-yarn-project/hadoop-yarn/hadoop-yarn-server/hadoop-yarn-server-nodemanager/-server-nodemanager/target/native/CMakeFiles/container-executor.dir/DependInfo.cmake">
is newer than depender "/home/jenkins/jenksrc/main/native/container-executor/impl/main.c:143:9:
warning: ignoring return value of 'setuid', declared with attribute warn_uins-slave/workspace/Hadoop-Yarn-trunk/hadoop-yarn-project/hadoop-yarn/hadoop-yarn-server/hadoop-yarn-server-nodemanager/target/nnused_result
[-Wunused-result]
     [exec]    setuid(0);
     [exec]          ^
     [exec] <https://builds.apache.org/job/Hadoop-Yarn-trunk/ws/hadoop-yarn-projative/CMakeFiles/container-executor.dir/depend.internal".>
     [exec] Dependee "<https://builds.apache.org/job/Hadoop-Yarn-trunk/ws/hadoect/hadoop-yarn/hadoop-yarn-server/hadoop-yarn-server-nodemanager/src/main/native/container-executor/impl/main.c>:145:9:
warning:op-yarn-project/hadoop-yarn/hadoop-yarn-server/hadoop-yarn-server-nodemanager/target/native/CMakeFiles/CMakeDirectoryInformation
ignoring return value of 'setgid', declared with attribute warn_unused_result [-Wunused-result]
     [exec]    setgid(group_info->gr_gid);
     [exec] .cmake" is newer than depender "<https://builds.apache.org/job/Hadoop-Yarn-trunk/ws/hadoop-yarn-project/hadoop-yarn/hadoop-y>
        ^
     [exec] arn-server/hadoop-yarn-server-nodemanager/target/native/CMakeFiles/container-executor.dir/depend.internal".
     [exec] Scanning dependencies of target container-executor
     [exec] make[2]: Leaving directory `<https://builds.apache.org/job/Hadoop-Yarn-trunk/ws/hadoop-yarn-project/hadoop-yarn/hadoop-yarn-server/hadoop-yarn-server-nodemanager/target/native'>
     [exec] make -f CMakeFiles/container-executor.dir/build.make CMakeFiles/container-executor.dir/build
     [exec] make[2]: Entering directory `<https://builds.apache.org/job/Hadoop-Yarn-trunk/ws/hadoop-yarn-project/hadoop-yarn/hadoop-yarn-server/hadoop-yarn-server-nodemanager/target/native'>
     [exec] /usr/bin/cmake -E cmake_progress_report <https://builds.apache.org/job/Hadoop-Yarn-trunk/ws/hadoop-yarn-project/hadoop-yarn/hadoop-yarn-server/hadoop-yarn-server-nodemanager/target/native/CMakeFiles>
3
     [exec] [ 75%] Building C object CMakeFiles/container-executor.dir/main/native/container-executor/impl/main.c.o
     [exec] /usr/bin/cc   -g -Wall -O2 -D_GNU_SOURCE -D_REENTRANT -I<https://builds.apache.org/job/Hadoop-Yarn-trunk/ws/hadoop-yarn-project/hadoop-yarn/hadoop-yarn-server/hadoop-yarn-server-nodemanager/src>
-I<https://builds.apache.org/job/Hadoop-Yarn-trunk/ws/hadoop-yarn-project/hadoop-yarn/hadoop-yarn-server/hadoop-yarn-server-nodemanager/target/native>
-I<https://builds.apache.org/job/Hadoop-Yarn-trunk/ws/hadoop-yarn-project/hadoop-yarn/hadoop-yarn-server/hadoop-yarn-server-nodemanager/src/main/native/container-executor>
-I<https://builds.apache.org/job/Hadoop-Yarn-trunk/ws/hadoop-yarn-project/hadoop-yarn/hadoop-yarn-server/hadoop-yarn-server-nodemanager/src/main/native/container-executor/impl>
   -o CMakeFiles/container-executor.dir/main/native/container-executor/impl/main.c.o   -c
<https://builds.apache.org/job/Hadoop-Yarn-trunk/ws/hadoop-yarn-project/hadoop-yarn/hadoop-yarn-server/hadoop-yarn-server-nodemanager/src/main/native/container-executor/impl/main.c>
     [exec] Linking C executable target/usr/local/bin/container-executor
     [exec] /usr/bin/cmake -E cmake_link_script CMakeFiles/container-executor.dir/link.txt
--verbose=1
     [exec] /usr/bin/cc   -g -Wall -O2 -D_GNU_SOURCE -D_REENTRANT    CMakeFiles/container-executor.dir/main/native/container-executor/impl/main.c.o
 -o target/usr/local/bin/container-executor -rdynamic libcontainer.a 
     [exec] make[2]: Leaving directory `<https://builds.apache.org/job/Hadoop-Yarn-trunk/ws/hadoop-yarn-project/hadoop-yarn/hadoop-yarn-server/hadoop-yarn-server-nodemanager/target/native'>
     [exec] /usr/bin/cmake -E cmake_progress_report <https://builds.apache.org/job/Hadoop-Yarn-trunk/ws/hadoop-yarn-project/hadoop-yarn/hadoop-yarn-server/hadoop-yarn-server-nodemanager/target/native/CMakeFiles>
 3
     [exec] [ 75%] Built target container-executor
     [exec] make -f CMakeFiles/test-container-executor.dir/build.make CMakeFiles/test-container-executor.dir/depend
     [exec] make[2]: Entering directory `<https://builds.apache.org/job/Hadoop-Yarn-trunk/ws/hadoop-yarn-project/hadoop-yarn/hadoop-yarn-server/hadoop-yarn-server-nodemanager/target/native'>
     [exec] cd <https://builds.apache.org/job/Hadoop-Yarn-trunk/ws/hadoop-yarn-project/hadoop-yarn/hadoop-yarn-server/hadoop-yarn-server-nodemanager/target/native>
&& /usr/bin/cmake -E cmake_depends "Unix Makefiles" <https://builds.apache.org/job/Hadoop-Yarn-trunk/ws/hadoop-yarn-project/hadoop-yarn/hadoop-yarn-server/hadoop-yarn-server-nodemanager/src>
<https://builds.apache.org/job/Hadoop-Yarn-trunk/ws/hadoop-yarn-project/hadoop-yarn/hadoop-yarn-server/hadoop-yarn-server-nodemanager/src>
<https://builds.apache.org/job/Hadoop-Yarn-trunk/ws/hadoop-yarn-project/hadoop-yarn/hadoop-yarn-server/hadoop-yarn-server-nodemanager/target/native>
<https://builds.apache.org/job/Hadoop-Yarn-trunk/ws/hadoop-yarn-project/hadoop-yarn/hadoop-yarn-server/hadoop-yarn-server-nodemanager/target/native>
<https://builds.apache.org/job/Hadoop-Yarn-trunk/ws/hadoop-yarn-project/hadoop-yarn/hadoop-yarn-server/hadoop-yarn-server-nodemanager/target/native/CMakeFiles/test-container-executor.dir/DependInfo.cmake>
--color=
     [exec] Dependee "<https://builds.apache.org/job/Hadoop-Yarn-trunk/ws/hadoop-yarn-project/hadoop-yarn/hadoop-yarn-server/hadoop-yarn-server-nodemanager/target/native/CMakeFiles/test-container-executor.dir/DependInfo.cmake">
is newer than depender "<https://builds.apache.org/job/Hadoop-Yarn-trunk/ws/hadoop-yarn-project/hadoop-yarn/hadoop-yarn-server/hadoop-yarn-server-nodemanager/target/native/CMakeFiles/test-container-executor.dir/depend.internal".>
     [exec] Dependee "<https://builds.apache.org/job/Hadoop-Yarn-trunk/ws/hadoop-yarn-project/hadoop-yarn/hadoop-yarn-server/hadoop-yarn-server-nodemanager/target/native/CMakeFiles/CMakeDirectoryInformation.cmake">
is newer than depender "<https://builds.apache.org/job/Hadoop-Yarn-trunk/ws/hadoop-yarn-project/hadoop-yarn/hadoop-yarn-server/hadoop-yarn-server-nodemanager/target/native/CMakeFiles/test-container-executor.dir/depend.internal".>
     [exec] <https://builds.apache.org/job/Hadoop-Yarn-trunk/ws/hadoop-yarn-project/hadoop-yarn/hadoop-yarn-server/hadoop-yarn-server-nodemanager/src/main/native/container-executor/test/test-container-executor.c>:
In function 'main':
     [exec] <https://builds.apache.org/job/Hadoop-Yarn-trunk/ws/hadoop-yarn-project/hadoop-yarn/hadoop-yarn-server/hadoop-yarn-server-nodemanager/src/main/native/container-executor/test/test-container-executor.c>:821:10:
warning: ignoring return value of 'seteuid', declared with attribute warn_unused_result [-Wunused-result]
     [exec]    seteuid(0);
     [exec]           ^
     [exec] Scanning dependencies of target test-container-executor
     [exec] make[2]: Leaving directory `<https://builds.apache.org/job/Hadoop-Yarn-trunk/ws/hadoop-yarn-project/hadoop-yarn/hadoop-yarn-server/hadoop-yarn-server-nodemanager/target/native'>
     [exec] make -f CMakeFiles/test-container-executor.dir/build.make CMakeFiles/test-container-executor.dir/build
     [exec] make[2]: Entering directory `<https://builds.apache.org/job/Hadoop-Yarn-trunk/ws/hadoop-yarn-project/hadoop-yarn/hadoop-yarn-server/hadoop-yarn-server-nodemanager/target/native'>
     [exec] /usr/bin/cmake -E cmake_progress_report <https://builds.apache.org/job/Hadoop-Yarn-trunk/ws/hadoop-yarn-project/hadoop-yarn/hadoop-yarn-server/hadoop-yarn-server-nodemanager/target/native/CMakeFiles>
4
     [exec] [100%] Building C object CMakeFiles/test-container-executor.dir/main/native/container-executor/test/test-container-executor.c.o
     [exec] /usr/bin/cc   -g -Wall -O2 -D_GNU_SOURCE -D_REENTRANT -I<https://builds.apache.org/job/Hadoop-Yarn-trunk/ws/hadoop-yarn-project/hadoop-yarn/hadoop-yarn-server/hadoop-yarn-server-nodemanager/src>
-I<https://builds.apache.org/job/Hadoop-Yarn-trunk/ws/hadoop-yarn-project/hadoop-yarn/hadoop-yarn-server/hadoop-yarn-server-nodemanager/target/native>
-I<https://builds.apache.org/job/Hadoop-Yarn-trunk/ws/hadoop-yarn-project/hadoop-yarn/hadoop-yarn-server/hadoop-yarn-server-nodemanager/src/main/native/container-executor>
-I<https://builds.apache.org/job/Hadoop-Yarn-trunk/ws/hadoop-yarn-project/hadoop-yarn/hadoop-yarn-server/hadoop-yarn-server-nodemanager/src/main/native/container-executor/impl>
   -o CMakeFiles/test-container-executor.dir/main/native/container-executor/test/test-container-executor.c.o
  -c <https://builds.apache.org/job/Hadoop-Yarn-trunk/ws/hadoop-yarn-project/hadoop-yarn/hadoop-yarn-server/hadoop-yarn-server-nodemanager/src/main/native/container-executor/test/test-container-executor.c>
     [exec] Linking C executable target/usr/local/bin/test-container-executor
     [exec] /usr/bin/cmake -E cmake_link_script CMakeFiles/test-container-executor.dir/link.txt
--verbose=1
     [exec] /usr/bin/cc   -g -Wall -O2 -D_GNU_SOURCE -D_REENTRANT    CMakeFiles/test-container-executor.dir/main/native/container-executor/test/test-container-executor.c.o
 -o target/usr/local/bin/test-container-executor -rdynamic libcontainer.a 
     [exec] make[2]: Leaving directory `<https://builds.apache.org/job/Hadoop-Yarn-trunk/ws/hadoop-yarn-project/hadoop-yarn/hadoop-yarn-server/hadoop-yarn-server-nodemanager/target/native'>
     [exec] /usr/bin/cmake -E cmake_progress_report <https://builds.apache.org/job/Hadoop-Yarn-trunk/ws/hadoop-yarn-project/hadoop-yarn/hadoop-yarn-server/hadoop-yarn-server-nodemanager/target/native/CMakeFiles>
 4
     [exec] [100%] Built target test-container-executor
     [exec] make[1]: Leaving directory `<https://builds.apache.org/job/Hadoop-Yarn-trunk/ws/hadoop-yarn-project/hadoop-yarn/hadoop-yarn-server/hadoop-yarn-server-nodemanager/target/native'>
     [exec] /usr/bin/cmake -E cmake_progress_start <https://builds.apache.org/job/Hadoop-Yarn-trunk/ws/hadoop-yarn-project/hadoop-yarn/hadoop-yarn-server/hadoop-yarn-server-nodemanager/target/native/CMakeFiles>
0
     [exec] [ 50%] Built target container
     [exec] [ 75%] Built target container-executor
     [exec] [100%] Built target test-container-executor
[INFO] Executed tasks
[INFO] 
[INFO] --- maven-resources-plugin:2.6:testResources (default-testResources) @ hadoop-yarn-server-nodemanager
---
[INFO] Using 'UTF-8' encoding to copy filtered resources.
[INFO] Copying 5 resources
[INFO] 
[INFO] --- maven-compiler-plugin:3.1:testCompile (default-testCompile) @ hadoop-yarn-server-nodemanager
---
[INFO] Changes detected - recompiling the module!
[INFO] Compiling 66 source files to <https://builds.apache.org/job/Hadoop-Yarn-trunk/ws/hadoop-yarn-project/hadoop-yarn/hadoop-yarn-server/hadoop-yarn-server-nodemanager/target/test-classes>
[WARNING] <https://builds.apache.org/job/Hadoop-Yarn-trunk/ws/hadoop-yarn-project/hadoop-yarn/hadoop-yarn-server/hadoop-yarn-server-nodemanager/src/test/java/org/apache/hadoop/yarn/server/nodemanager/containermanager/launcher/TestContainerLaunch.java>:
<https://builds.apache.org/job/Hadoop-Yarn-trunk/ws/hadoop-yarn-project/hadoop-yarn/hadoop-yarn-server/hadoop-yarn-server-nodemanager/src/test/java/org/apache/hadoop/yarn/server/nodemanager/containermanager/launcher/TestContainerLaunch.java>
uses or overrides a deprecated API.
[WARNING] <https://builds.apache.org/job/Hadoop-Yarn-trunk/ws/hadoop-yarn-project/hadoop-yarn/hadoop-yarn-server/hadoop-yarn-server-nodemanager/src/test/java/org/apache/hadoop/yarn/server/nodemanager/containermanager/launcher/TestContainerLaunch.java>:
Recompile with -Xlint:deprecation for details.
[WARNING] <https://builds.apache.org/job/Hadoop-Yarn-trunk/ws/hadoop-yarn-project/hadoop-yarn/hadoop-yarn-server/hadoop-yarn-server-nodemanager/src/test/java/org/apache/hadoop/yarn/server/nodemanager/containermanager/TestAuxServices.java>:
<https://builds.apache.org/job/Hadoop-Yarn-trunk/ws/hadoop-yarn-project/hadoop-yarn/hadoop-yarn-server/hadoop-yarn-server-nodemanager/src/test/java/org/apache/hadoop/yarn/server/nodemanager/containermanager/TestAuxServices.java>
uses unchecked or unsafe operations.
[WARNING] <https://builds.apache.org/job/Hadoop-Yarn-trunk/ws/hadoop-yarn-project/hadoop-yarn/hadoop-yarn-server/hadoop-yarn-server-nodemanager/src/test/java/org/apache/hadoop/yarn/server/nodemanager/containermanager/TestAuxServices.java>:
Recompile with -Xlint:unchecked for details.
[INFO] 
[INFO] --- maven-surefire-plugin:2.17:test (default-test) @ hadoop-yarn-server-nodemanager
---
[INFO] Surefire report directory: <https://builds.apache.org/job/Hadoop-Yarn-trunk/ws/hadoop-yarn-project/hadoop-yarn/hadoop-yarn-server/hadoop-yarn-server-nodemanager/target/surefire-reports>

-------------------------------------------------------
 T E S T S
-------------------------------------------------------

-------------------------------------------------------
 T E S T S
-------------------------------------------------------
Running org.apache.hadoop.yarn.server.nodemanager.TestNodeManagerResync
Tests run: 5, Failures: 0, Errors: 0, Skipped: 0, Time elapsed: 20.994 sec - in org.apache.hadoop.yarn.server.nodemanager.TestNodeManagerResync
Running org.apache.hadoop.yarn.server.nodemanager.util.TestProcessIdFileReader
Tests run: 3, Failures: 0, Errors: 0, Skipped: 0, Time elapsed: 0.203 sec - in org.apache.hadoop.yarn.server.nodemanager.util.TestProcessIdFileReader
Running org.apache.hadoop.yarn.server.nodemanager.util.TestCgroupsLCEResourcesHandler
Tests run: 5, Failures: 0, Errors: 0, Skipped: 0, Time elapsed: 1.365 sec - in org.apache.hadoop.yarn.server.nodemanager.util.TestCgroupsLCEResourcesHandler
Running org.apache.hadoop.yarn.server.nodemanager.util.TestNodeManagerHardwareUtils
Tests run: 1, Failures: 0, Errors: 0, Skipped: 0, Time elapsed: 0.594 sec - in org.apache.hadoop.yarn.server.nodemanager.util.TestNodeManagerHardwareUtils
Running org.apache.hadoop.yarn.server.nodemanager.TestNodeStatusUpdater
Tests run: 14, Failures: 0, Errors: 0, Skipped: 0, Time elapsed: 65.581 sec - in org.apache.hadoop.yarn.server.nodemanager.TestNodeStatusUpdater
Running org.apache.hadoop.yarn.server.nodemanager.TestDockerContainerExecutor
Tests run: 1, Failures: 0, Errors: 0, Skipped: 0, Time elapsed: 0.74 sec - in org.apache.hadoop.yarn.server.nodemanager.TestDockerContainerExecutor
Running org.apache.hadoop.yarn.server.nodemanager.TestLinuxContainerExecutor
Tests run: 6, Failures: 0, Errors: 0, Skipped: 0, Time elapsed: 1.369 sec - in org.apache.hadoop.yarn.server.nodemanager.TestLinuxContainerExecutor
Running org.apache.hadoop.yarn.server.nodemanager.TestLinuxContainerExecutorWithMocks
Tests run: 8, Failures: 0, Errors: 0, Skipped: 0, Time elapsed: 1.275 sec - in org.apache.hadoop.yarn.server.nodemanager.TestLinuxContainerExecutorWithMocks
Running org.apache.hadoop.yarn.server.nodemanager.security.TestNMTokenSecretManagerInNM
Tests run: 1, Failures: 0, Errors: 0, Skipped: 0, Time elapsed: 1.386 sec - in org.apache.hadoop.yarn.server.nodemanager.security.TestNMTokenSecretManagerInNM
Running org.apache.hadoop.yarn.server.nodemanager.security.TestNMContainerTokenSecretManager
Tests run: 1, Failures: 0, Errors: 0, Skipped: 0, Time elapsed: 6.553 sec - in org.apache.hadoop.yarn.server.nodemanager.security.TestNMContainerTokenSecretManager
Running org.apache.hadoop.yarn.server.nodemanager.TestRecordFactory
Tests run: 1, Failures: 0, Errors: 0, Skipped: 0, Time elapsed: 0.221 sec - in org.apache.hadoop.yarn.server.nodemanager.TestRecordFactory
Running org.apache.hadoop.yarn.server.nodemanager.recovery.TestNMLeveldbStateStoreService
Tests run: 12, Failures: 0, Errors: 0, Skipped: 0, Time elapsed: 2.081 sec - in org.apache.hadoop.yarn.server.nodemanager.recovery.TestNMLeveldbStateStoreService
Running org.apache.hadoop.yarn.server.nodemanager.TestContainerManagerWithLCE
Tests run: 10, Failures: 0, Errors: 0, Skipped: 0, Time elapsed: 1.524 sec - in org.apache.hadoop.yarn.server.nodemanager.TestContainerManagerWithLCE
Running org.apache.hadoop.yarn.server.nodemanager.TestRPCFactories
Tests run: 1, Failures: 0, Errors: 0, Skipped: 0, Time elapsed: 0.894 sec - in org.apache.hadoop.yarn.server.nodemanager.TestRPCFactories
Running org.apache.hadoop.yarn.server.nodemanager.TestContainerExecutor
Tests run: 5, Failures: 0, Errors: 0, Skipped: 3, Time elapsed: 0.851 sec - in org.apache.hadoop.yarn.server.nodemanager.TestContainerExecutor
Running org.apache.hadoop.yarn.server.nodemanager.TestNodeManagerShutdown
Tests run: 2, Failures: 0, Errors: 0, Skipped: 0, Time elapsed: 5.995 sec - in org.apache.hadoop.yarn.server.nodemanager.TestNodeManagerShutdown
Running org.apache.hadoop.yarn.server.nodemanager.metrics.TestNodeManagerMetrics
Tests run: 1, Failures: 0, Errors: 0, Skipped: 0, Time elapsed: 0.806 sec - in org.apache.hadoop.yarn.server.nodemanager.metrics.TestNodeManagerMetrics
Running org.apache.hadoop.yarn.server.nodemanager.TestNodeManager
Tests run: 1, Failures: 0, Errors: 0, Skipped: 0, Time elapsed: 1.076 sec - in org.apache.hadoop.yarn.server.nodemanager.TestNodeManager
Running org.apache.hadoop.yarn.server.nodemanager.TestNodeManagerReboot
Tests run: 1, Failures: 0, Errors: 0, Skipped: 0, Time elapsed: 5.947 sec - in org.apache.hadoop.yarn.server.nodemanager.TestNodeManagerReboot
Running org.apache.hadoop.yarn.server.nodemanager.TestDefaultContainerExecutor
Tests run: 3, Failures: 0, Errors: 0, Skipped: 0, Time elapsed: 11.674 sec - in org.apache.hadoop.yarn.server.nodemanager.TestDefaultContainerExecutor
Running org.apache.hadoop.yarn.server.nodemanager.api.protocolrecords.impl.pb.TestPBLocalizerRPC
Tests run: 1, Failures: 0, Errors: 0, Skipped: 0, Time elapsed: 1.079 sec - in org.apache.hadoop.yarn.server.nodemanager.api.protocolrecords.impl.pb.TestPBLocalizerRPC
Running org.apache.hadoop.yarn.server.nodemanager.api.protocolrecords.impl.pb.TestPBRecordImpl
Tests run: 4, Failures: 0, Errors: 0, Skipped: 0, Time elapsed: 0.597 sec - in org.apache.hadoop.yarn.server.nodemanager.api.protocolrecords.impl.pb.TestPBRecordImpl
Running org.apache.hadoop.yarn.server.nodemanager.TestLocalDirsHandlerService
Tests run: 3, Failures: 0, Errors: 0, Skipped: 0, Time elapsed: 0.978 sec - in org.apache.hadoop.yarn.server.nodemanager.TestLocalDirsHandlerService
Running org.apache.hadoop.yarn.server.nodemanager.TestNodeHealthService
Tests run: 1, Failures: 0, Errors: 0, Skipped: 0, Time elapsed: 1.176 sec - in org.apache.hadoop.yarn.server.nodemanager.TestNodeHealthService
Running org.apache.hadoop.yarn.server.nodemanager.containermanager.container.TestContainer
Tests run: 18, Failures: 0, Errors: 0, Skipped: 0, Time elapsed: 2.257 sec - in org.apache.hadoop.yarn.server.nodemanager.containermanager.container.TestContainer
Running org.apache.hadoop.yarn.server.nodemanager.containermanager.TestNMProxy
Tests run: 1, Failures: 0, Errors: 0, Skipped: 0, Time elapsed: 3.608 sec - in org.apache.hadoop.yarn.server.nodemanager.containermanager.TestNMProxy
Running org.apache.hadoop.yarn.server.nodemanager.containermanager.logaggregation.TestLogAggregationService
Tests run: 16, Failures: 0, Errors: 0, Skipped: 0, Time elapsed: 36.851 sec - in org.apache.hadoop.yarn.server.nodemanager.containermanager.logaggregation.TestLogAggregationService
Running org.apache.hadoop.yarn.server.nodemanager.containermanager.TestContainerManager
Tests run: 10, Failures: 0, Errors: 0, Skipped: 0, Time elapsed: 25.13 sec - in org.apache.hadoop.yarn.server.nodemanager.containermanager.TestContainerManager
Running org.apache.hadoop.yarn.server.nodemanager.containermanager.monitor.TestContainerMetrics
Tests run: 2, Failures: 0, Errors: 0, Skipped: 0, Time elapsed: 0.945 sec - in org.apache.hadoop.yarn.server.nodemanager.containermanager.monitor.TestContainerMetrics
Running org.apache.hadoop.yarn.server.nodemanager.containermanager.monitor.TestContainersMonitor
Tests run: 3, Failures: 0, Errors: 0, Skipped: 0, Time elapsed: 7.535 sec - in org.apache.hadoop.yarn.server.nodemanager.containermanager.monitor.TestContainersMonitor
Running org.apache.hadoop.yarn.server.nodemanager.containermanager.loghandler.TestNonAggregatingLogHandler
Tests run: 6, Failures: 0, Errors: 0, Skipped: 0, Time elapsed: 1.625 sec - in org.apache.hadoop.yarn.server.nodemanager.containermanager.loghandler.TestNonAggregatingLogHandler
Running org.apache.hadoop.yarn.server.nodemanager.containermanager.TestAuxServices
Tests run: 6, Failures: 0, Errors: 0, Skipped: 0, Time elapsed: 1.047 sec - in org.apache.hadoop.yarn.server.nodemanager.containermanager.TestAuxServices
Running org.apache.hadoop.yarn.server.nodemanager.containermanager.TestContainerManagerRecovery
Tests run: 1, Failures: 0, Errors: 0, Skipped: 0, Time elapsed: 1.916 sec - in org.apache.hadoop.yarn.server.nodemanager.containermanager.TestContainerManagerRecovery
Running org.apache.hadoop.yarn.server.nodemanager.containermanager.launcher.TestContainerLaunch
Tests run: 16, Failures: 0, Errors: 0, Skipped: 4, Time elapsed: 20.44 sec - in org.apache.hadoop.yarn.server.nodemanager.containermanager.launcher.TestContainerLaunch
Running org.apache.hadoop.yarn.server.nodemanager.containermanager.localizer.TestLocalCacheDirectoryManager
Tests run: 5, Failures: 0, Errors: 0, Skipped: 0, Time elapsed: 1.607 sec - in org.apache.hadoop.yarn.server.nodemanager.containermanager.localizer.TestLocalCacheDirectoryManager
Running org.apache.hadoop.yarn.server.nodemanager.containermanager.localizer.TestContainerLocalizer
Tests run: 3, Failures: 0, Errors: 0, Skipped: 0, Time elapsed: 1.856 sec - in org.apache.hadoop.yarn.server.nodemanager.containermanager.localizer.TestContainerLocalizer
Running org.apache.hadoop.yarn.server.nodemanager.containermanager.localizer.TestLocalResourcesTrackerImpl
Tests run: 8, Failures: 0, Errors: 0, Skipped: 0, Time elapsed: 1.43 sec - in org.apache.hadoop.yarn.server.nodemanager.containermanager.localizer.TestLocalResourcesTrackerImpl
Running org.apache.hadoop.yarn.server.nodemanager.containermanager.localizer.sharedcache.TestSharedCacheUploadService
Tests run: 2, Failures: 0, Errors: 0, Skipped: 0, Time elapsed: 0.85 sec - in org.apache.hadoop.yarn.server.nodemanager.containermanager.localizer.sharedcache.TestSharedCacheUploadService
Running org.apache.hadoop.yarn.server.nodemanager.containermanager.localizer.sharedcache.TestSharedCacheUploader
Tests run: 6, Failures: 0, Errors: 0, Skipped: 0, Time elapsed: 1.15 sec - in org.apache.hadoop.yarn.server.nodemanager.containermanager.localizer.sharedcache.TestSharedCacheUploader
Running org.apache.hadoop.yarn.server.nodemanager.containermanager.localizer.TestLocalResource
Tests run: 2, Failures: 0, Errors: 0, Skipped: 0, Time elapsed: 0.417 sec - in org.apache.hadoop.yarn.server.nodemanager.containermanager.localizer.TestLocalResource
Running org.apache.hadoop.yarn.server.nodemanager.containermanager.localizer.TestResourceRetention
Tests run: 1, Failures: 0, Errors: 0, Skipped: 0, Time elapsed: 0.953 sec - in org.apache.hadoop.yarn.server.nodemanager.containermanager.localizer.TestResourceRetention
Running org.apache.hadoop.yarn.server.nodemanager.containermanager.localizer.TestLocalizedResource
Tests run: 1, Failures: 0, Errors: 0, Skipped: 0, Time elapsed: 0.67 sec - in org.apache.hadoop.yarn.server.nodemanager.containermanager.localizer.TestLocalizedResource
Running org.apache.hadoop.yarn.server.nodemanager.containermanager.localizer.TestResourceLocalizationService
Tests run: 13, Failures: 0, Errors: 1, Skipped: 0, Time elapsed: 6.288 sec <<< FAILURE!
- in org.apache.hadoop.yarn.server.nodemanager.containermanager.localizer.TestResourceLocalizationService
testPublicResourceInitializesLocalDir(org.apache.hadoop.yarn.server.nodemanager.containermanager.localizer.TestResourceLocalizationService)
 Time elapsed: 0.222 sec  <<< ERROR!
java.io.IOException: Unable to delete directory target/org.apache.hadoop.yarn.server.nodemanager.containermanager.localizer.TestResourceLocalizationService/1/filecache.
	at org.apache.commons.io.FileUtils.deleteDirectory(FileUtils.java:1541)
	at org.apache.commons.io.FileUtils.forceDelete(FileUtils.java:2270)
	at org.apache.commons.io.FileUtils.cleanDirectory(FileUtils.java:1653)
	at org.apache.commons.io.FileUtils.deleteDirectory(FileUtils.java:1535)
	at org.apache.commons.io.FileUtils.forceDelete(FileUtils.java:2270)
	at org.apache.commons.io.FileUtils.cleanDirectory(FileUtils.java:1653)
	at org.apache.commons.io.FileUtils.deleteDirectory(FileUtils.java:1535)
	at org.apache.hadoop.yarn.server.nodemanager.containermanager.localizer.TestResourceLocalizationService.cleanup(TestResourceLocalizationService.java:186)

Running org.apache.hadoop.yarn.server.nodemanager.containermanager.application.TestApplication
Tests run: 8, Failures: 0, Errors: 0, Skipped: 0, Time elapsed: 5.541 sec - in org.apache.hadoop.yarn.server.nodemanager.containermanager.application.TestApplication
Running org.apache.hadoop.yarn.server.nodemanager.TestDirectoryCollection
Tests run: 6, Failures: 0, Errors: 0, Skipped: 0, Time elapsed: 0.87 sec - in org.apache.hadoop.yarn.server.nodemanager.TestDirectoryCollection
Running org.apache.hadoop.yarn.server.nodemanager.TestNMAuditLogger
Tests run: 3, Failures: 0, Errors: 0, Skipped: 0, Time elapsed: 1.14 sec - in org.apache.hadoop.yarn.server.nodemanager.TestNMAuditLogger
Running org.apache.hadoop.yarn.server.nodemanager.TestDeletionService
Tests run: 6, Failures: 0, Errors: 0, Skipped: 0, Time elapsed: 23.164 sec - in org.apache.hadoop.yarn.server.nodemanager.TestDeletionService
Running org.apache.hadoop.yarn.server.nodemanager.TestDockerContainerExecutorWithMocks
Tests run: 4, Failures: 0, Errors: 0, Skipped: 0, Time elapsed: 1.274 sec - in org.apache.hadoop.yarn.server.nodemanager.TestDockerContainerExecutorWithMocks
Running org.apache.hadoop.yarn.server.nodemanager.TestEventFlow
Tests run: 1, Failures: 0, Errors: 0, Skipped: 0, Time elapsed: 5.778 sec - in org.apache.hadoop.yarn.server.nodemanager.TestEventFlow
Running org.apache.hadoop.yarn.server.nodemanager.webapp.TestNMWebServices
Tests run: 11, Failures: 0, Errors: 0, Skipped: 0, Time elapsed: 6.404 sec - in org.apache.hadoop.yarn.server.nodemanager.webapp.TestNMWebServices
Running org.apache.hadoop.yarn.server.nodemanager.webapp.TestNMWebServicesContainers
Tests run: 12, Failures: 0, Errors: 0, Skipped: 0, Time elapsed: 7.079 sec - in org.apache.hadoop.yarn.server.nodemanager.webapp.TestNMWebServicesContainers
Running org.apache.hadoop.yarn.server.nodemanager.webapp.TestContainerLogsPage
Tests run: 4, Failures: 0, Errors: 0, Skipped: 1, Time elapsed: 1.298 sec - in org.apache.hadoop.yarn.server.nodemanager.webapp.TestContainerLogsPage
Running org.apache.hadoop.yarn.server.nodemanager.webapp.TestNMWebServicesApps
Tests run: 19, Failures: 0, Errors: 0, Skipped: 0, Time elapsed: 8.558 sec - in org.apache.hadoop.yarn.server.nodemanager.webapp.TestNMWebServicesApps
Running org.apache.hadoop.yarn.server.nodemanager.webapp.TestNMWebServer
Tests run: 3, Failures: 0, Errors: 0, Skipped: 0, Time elapsed: 2.568 sec - in org.apache.hadoop.yarn.server.nodemanager.webapp.TestNMWebServer

Results :

Tests in error: 
  TestResourceLocalizationService.cleanup:186 ยป IO Unable to delete directory ta...

Tests run: 288, Failures: 0, Errors: 1, Skipped: 8

[INFO] ------------------------------------------------------------------------
[INFO] Reactor Summary:
[INFO] 
[INFO] hadoop-yarn ....................................... SUCCESS [  3.291 s]
[INFO] hadoop-yarn-api ................................... SUCCESS [03:14 min]
[INFO] hadoop-yarn-common ................................ SUCCESS [02:52 min]
[INFO] hadoop-yarn-server ................................ SUCCESS [  0.093 s]
[INFO] hadoop-yarn-server-common ......................... SUCCESS [ 42.267 s]
[INFO] hadoop-yarn-server-nodemanager .................... FAILURE [05:34 min]
[INFO] hadoop-yarn-server-web-proxy ...................... SKIPPED
[INFO] hadoop-yarn-server-applicationhistoryservice ...... SKIPPED
[INFO] hadoop-yarn-server-resourcemanager ................ SKIPPED
[INFO] hadoop-yarn-server-tests .......................... SKIPPED
[INFO] hadoop-yarn-client ................................ SKIPPED
[INFO] hadoop-yarn-server-sharedcachemanager ............. SKIPPED
[INFO] hadoop-yarn-applications .......................... SKIPPED
[INFO] hadoop-yarn-applications-distributedshell ......... SKIPPED
[INFO] hadoop-yarn-applications-unmanaged-am-launcher .... SKIPPED
[INFO] hadoop-yarn-site .................................. SKIPPED
[INFO] hadoop-yarn-registry .............................. SKIPPED
[INFO] hadoop-yarn-project ............................... SKIPPED
[INFO] ------------------------------------------------------------------------
[INFO] BUILD FAILURE
[INFO] ------------------------------------------------------------------------
[INFO] Total time: 12:29 min
[INFO] Finished at: 2015-03-16T10:44:44+00:00
[INFO] Final Memory: 75M/1151M
[INFO] ------------------------------------------------------------------------
[ERROR] Failed to execute goal org.apache.maven.plugins:maven-surefire-plugin:2.17:test (default-test)
on project hadoop-yarn-server-nodemanager: There are test failures.
[ERROR] 
[ERROR] Please refer to <https://builds.apache.org/job/Hadoop-Yarn-trunk/ws/hadoop-yarn-project/hadoop-yarn/hadoop-yarn-server/hadoop-yarn-server-nodemanager/target/surefire-reports>
for the individual test results.
[ERROR] -> [Help 1]
[ERROR] 
[ERROR] To see the full stack trace of the errors, re-run Maven with the -e switch.
[ERROR] Re-run Maven using the -X switch to enable full debug logging.
[ERROR] 
[ERROR] For more information about the errors and possible solutions, please read the following
articles:
[ERROR] [Help 1] http://cwiki.apache.org/confluence/display/MAVEN/MojoFailureException
[ERROR] 
[ERROR] After correcting the problems, you can resume the build with the command
[ERROR]   mvn <goals> -rf :hadoop-yarn-server-nodemanager
Build step 'Execute shell' marked build as failure
Archiving artifacts
Recording test results
Updating YARN-3171

Mime
View raw message