hadoop-yarn-dev mailing list archives

Site index · List index
Message view « Date » · « Thread »
Top « Date » · « Thread »
From Apache Jenkins Server <jenk...@builds.apache.org>
Subject Hadoop-Yarn-trunk - Build # 882 - Still Failing
Date Mon, 30 Mar 2015 11:38:28 GMT
See https://builds.apache.org/job/Hadoop-Yarn-trunk/882/

###################################################################################
########################## LAST 60 LINES OF THE CONSOLE ###########################
[...truncated 8770 lines...]
  TestMoveApplication.setUp:59 » WebApp Error starting http server
  TestMoveApplication.setUp:59 » WebApp Error starting http server
  TestMoveApplication.setUp:59 » WebApp Error starting http server
  TestRMWebappAuthentication.testSimpleAuth:147 » WebApp Error starting http ser...
  TestRMWebappAuthentication.testSimpleAuth:147 » WebApp Error starting http ser...

Tests run: 1033, Failures: 3, Errors: 13, Skipped: 1

[INFO] ------------------------------------------------------------------------
[INFO] Reactor Summary:
[INFO] 
[INFO] hadoop-yarn ....................................... SUCCESS [  3.076 s]
[INFO] hadoop-yarn-api ................................... SUCCESS [03:21 min]
[INFO] hadoop-yarn-common ................................ SUCCESS [02:51 min]
[INFO] hadoop-yarn-server ................................ SUCCESS [  0.095 s]
[INFO] hadoop-yarn-server-common ......................... SUCCESS [ 42.302 s]
[INFO] hadoop-yarn-server-nodemanager .................... SUCCESS [06:07 min]
[INFO] hadoop-yarn-server-web-proxy ...................... SUCCESS [ 24.176 s]
[INFO] hadoop-yarn-server-applicationhistoryservice ...... SUCCESS [02:54 min]
[INFO] hadoop-yarn-server-resourcemanager ................ FAILURE [50:02 min]
[INFO] hadoop-yarn-server-tests .......................... SKIPPED
[INFO] hadoop-yarn-client ................................ SKIPPED
[INFO] hadoop-yarn-server-sharedcachemanager ............. SKIPPED
[INFO] hadoop-yarn-applications .......................... SKIPPED
[INFO] hadoop-yarn-applications-distributedshell ......... SKIPPED
[INFO] hadoop-yarn-applications-unmanaged-am-launcher .... SKIPPED
[INFO] hadoop-yarn-site .................................. SKIPPED
[INFO] hadoop-yarn-registry .............................. SKIPPED
[INFO] hadoop-yarn-project ............................... SKIPPED
[INFO] ------------------------------------------------------------------------
[INFO] BUILD FAILURE
[INFO] ------------------------------------------------------------------------
[INFO] Total time: 01:06 h
[INFO] Finished at: 2015-03-30T11:38:17+00:00
[INFO] Final Memory: 61M/738M
[INFO] ------------------------------------------------------------------------
[ERROR] Failed to execute goal org.apache.maven.plugins:maven-surefire-plugin:2.17:test (default-test)
on project hadoop-yarn-server-resourcemanager: There are test failures.
[ERROR] 
[ERROR] Please refer to /home/jenkins/jenkins-slave/workspace/Hadoop-Yarn-trunk/hadoop-yarn-project/hadoop-yarn/hadoop-yarn-server/hadoop-yarn-server-resourcemanager/target/surefire-reports
for the individual test results.
[ERROR] -> [Help 1]
[ERROR] 
[ERROR] To see the full stack trace of the errors, re-run Maven with the -e switch.
[ERROR] Re-run Maven using the -X switch to enable full debug logging.
[ERROR] 
[ERROR] For more information about the errors and possible solutions, please read the following
articles:
[ERROR] [Help 1] http://cwiki.apache.org/confluence/display/MAVEN/MojoFailureException
[ERROR] 
[ERROR] After correcting the problems, you can resume the build with the command
[ERROR]   mvn <goals> -rf :hadoop-yarn-server-resourcemanager
Build step 'Execute shell' marked build as failure
Archiving artifacts
Recording test results
Updating HDFS-6408
Updating HDFS-6263
Updating HDFS-7890
Updating HDFS-4396
Sending e-mails to: yarn-dev@hadoop.apache.org
Email was triggered for: Failure
Sending email for trigger: Failure



###################################################################################
############################## FAILED TESTS (if any) ##############################
16 tests failed.
FAILED:  org.apache.hadoop.yarn.server.resourcemanager.TestMoveApplication.testMoveTooLate

Error Message:
Error starting http server

Stack Trace:
org.apache.hadoop.yarn.webapp.WebAppException: Error starting http server
	at org.apache.hadoop.http.HttpServer2.start(HttpServer2.java:785)
	at org.apache.hadoop.yarn.webapp.WebApps$Builder.start(WebApps.java:274)
	at org.apache.hadoop.yarn.server.resourcemanager.ResourceManager.startWepApp(ResourceManager.java:974)
	at org.apache.hadoop.yarn.server.resourcemanager.ResourceManager.serviceStart(ResourceManager.java:1074)
	at org.apache.hadoop.service.AbstractService.start(AbstractService.java:193)
	at org.apache.hadoop.yarn.server.resourcemanager.TestMoveApplication.setUp(TestMoveApplication.java:59)


FAILED:  org.apache.hadoop.yarn.server.resourcemanager.TestMoveApplication.testMoveRejectedByPermissions

Error Message:
Error starting http server

Stack Trace:
org.apache.hadoop.yarn.webapp.WebAppException: Error starting http server
	at sun.nio.ch.Net.bind0(Native Method)
	at sun.nio.ch.Net.bind(Net.java:444)
	at sun.nio.ch.Net.bind(Net.java:436)
	at sun.nio.ch.ServerSocketChannelImpl.bind(ServerSocketChannelImpl.java:214)
	at sun.nio.ch.ServerSocketAdaptor.bind(ServerSocketAdaptor.java:74)
	at org.mortbay.jetty.nio.SelectChannelConnector.open(SelectChannelConnector.java:216)
	at org.apache.hadoop.http.HttpServer2.openListeners(HttpServer2.java:830)
	at org.apache.hadoop.http.HttpServer2.start(HttpServer2.java:772)
	at org.apache.hadoop.yarn.webapp.WebApps$Builder.start(WebApps.java:274)
	at org.apache.hadoop.yarn.server.resourcemanager.ResourceManager.startWepApp(ResourceManager.java:974)
	at org.apache.hadoop.yarn.server.resourcemanager.ResourceManager.serviceStart(ResourceManager.java:1074)
	at org.apache.hadoop.service.AbstractService.start(AbstractService.java:193)
	at org.apache.hadoop.yarn.server.resourcemanager.TestMoveApplication.setUp(TestMoveApplication.java:59)


FAILED:  org.apache.hadoop.yarn.server.resourcemanager.TestMoveApplication.testMoveSuccessful

Error Message:
Error starting http server

Stack Trace:
org.apache.hadoop.yarn.webapp.WebAppException: Error starting http server
	at sun.nio.ch.Net.bind0(Native Method)
	at sun.nio.ch.Net.bind(Net.java:444)
	at sun.nio.ch.Net.bind(Net.java:436)
	at sun.nio.ch.ServerSocketChannelImpl.bind(ServerSocketChannelImpl.java:214)
	at sun.nio.ch.ServerSocketAdaptor.bind(ServerSocketAdaptor.java:74)
	at org.mortbay.jetty.nio.SelectChannelConnector.open(SelectChannelConnector.java:216)
	at org.apache.hadoop.http.HttpServer2.openListeners(HttpServer2.java:830)
	at org.apache.hadoop.http.HttpServer2.start(HttpServer2.java:772)
	at org.apache.hadoop.yarn.webapp.WebApps$Builder.start(WebApps.java:274)
	at org.apache.hadoop.yarn.server.resourcemanager.ResourceManager.startWepApp(ResourceManager.java:974)
	at org.apache.hadoop.yarn.server.resourcemanager.ResourceManager.serviceStart(ResourceManager.java:1074)
	at org.apache.hadoop.service.AbstractService.start(AbstractService.java:193)
	at org.apache.hadoop.yarn.server.resourcemanager.TestMoveApplication.setUp(TestMoveApplication.java:59)


FAILED:  org.apache.hadoop.yarn.server.resourcemanager.TestMoveApplication.testMoveRejectedByScheduler

Error Message:
Error starting http server

Stack Trace:
org.apache.hadoop.yarn.webapp.WebAppException: Error starting http server
	at sun.nio.ch.Net.bind0(Native Method)
	at sun.nio.ch.Net.bind(Net.java:444)
	at sun.nio.ch.Net.bind(Net.java:436)
	at sun.nio.ch.ServerSocketChannelImpl.bind(ServerSocketChannelImpl.java:214)
	at sun.nio.ch.ServerSocketAdaptor.bind(ServerSocketAdaptor.java:74)
	at org.mortbay.jetty.nio.SelectChannelConnector.open(SelectChannelConnector.java:216)
	at org.apache.hadoop.http.HttpServer2.openListeners(HttpServer2.java:830)
	at org.apache.hadoop.http.HttpServer2.start(HttpServer2.java:772)
	at org.apache.hadoop.yarn.webapp.WebApps$Builder.start(WebApps.java:274)
	at org.apache.hadoop.yarn.server.resourcemanager.ResourceManager.startWepApp(ResourceManager.java:974)
	at org.apache.hadoop.yarn.server.resourcemanager.ResourceManager.serviceStart(ResourceManager.java:1074)
	at org.apache.hadoop.service.AbstractService.start(AbstractService.java:193)
	at org.apache.hadoop.yarn.server.resourcemanager.TestMoveApplication.setUp(TestMoveApplication.java:59)


FAILED:  org.apache.hadoop.yarn.server.resourcemanager.TestRMAdminService.testServiceAclsRefreshWithLocalConfigurationProvider

Error Message:
Using localConfigurationProvider. Should not get any exception.

Stack Trace:
java.lang.AssertionError: Using localConfigurationProvider. Should not get any exception.
	at org.junit.Assert.fail(Assert.java:88)
	at org.apache.hadoop.yarn.server.resourcemanager.TestRMAdminService.testServiceAclsRefreshWithLocalConfigurationProvider(TestRMAdminService.java:219)


FAILED:  org.apache.hadoop.yarn.server.resourcemanager.TestRMAdminService.testServiceAclsRefreshWithFileSystemBasedConfigurationProvider

Error Message:
Should not get any exceptions

Stack Trace:
java.lang.AssertionError: Should not get any exceptions
	at org.junit.Assert.fail(Assert.java:88)
	at org.apache.hadoop.yarn.server.resourcemanager.TestRMAdminService.testServiceAclsRefreshWithFileSystemBasedConfigurationProvider(TestRMAdminService.java:248)


FAILED:  org.apache.hadoop.yarn.server.resourcemanager.TestRMAdminService.testRMInitialsWithFileSystemBasedConfigurationProvider

Error Message:
Should not get any exceptions

Stack Trace:
java.lang.AssertionError: Should not get any exceptions
	at org.junit.Assert.fail(Assert.java:88)
	at org.apache.hadoop.yarn.server.resourcemanager.TestRMAdminService.testRMInitialsWithFileSystemBasedConfigurationProvider(TestRMAdminService.java:674)


FAILED:  org.apache.hadoop.yarn.server.resourcemanager.TestRMHA.testRMDispatcherForHA

Error Message:
Error starting http server

Stack Trace:
org.apache.hadoop.yarn.webapp.WebAppException: Error starting http server
	at org.apache.hadoop.http.HttpServer2.start(HttpServer2.java:785)
	at org.apache.hadoop.yarn.webapp.WebApps$Builder.start(WebApps.java:274)
	at org.apache.hadoop.yarn.server.resourcemanager.ResourceManager.startWepApp(ResourceManager.java:974)
	at org.apache.hadoop.yarn.server.resourcemanager.MockRM.startWepApp(MockRM.java:635)
	at org.apache.hadoop.yarn.server.resourcemanager.ResourceManager.serviceStart(ResourceManager.java:1074)
	at org.apache.hadoop.service.AbstractService.start(AbstractService.java:193)
	at org.apache.hadoop.yarn.server.resourcemanager.TestRMHA.testRMDispatcherForHA(TestRMHA.java:330)


FAILED:  org.apache.hadoop.yarn.server.resourcemanager.TestRMHA.testFailoverClearsRMContext

Error Message:
Error starting http server

Stack Trace:
org.apache.hadoop.yarn.webapp.WebAppException: Error starting http server
	at org.apache.hadoop.http.HttpServer2.start(HttpServer2.java:785)
	at org.apache.hadoop.yarn.webapp.WebApps$Builder.start(WebApps.java:274)
	at org.apache.hadoop.yarn.server.resourcemanager.ResourceManager.startWepApp(ResourceManager.java:974)
	at org.apache.hadoop.yarn.server.resourcemanager.MockRM.startWepApp(MockRM.java:635)
	at org.apache.hadoop.yarn.server.resourcemanager.ResourceManager.serviceStart(ResourceManager.java:1074)
	at org.apache.hadoop.service.AbstractService.start(AbstractService.java:193)
	at org.apache.hadoop.yarn.server.resourcemanager.TestRMHA.testFailoverClearsRMContext(TestRMHA.java:530)


FAILED:  org.apache.hadoop.yarn.server.resourcemanager.TestRMHA.testTransitionedToStandbyShouldNotHang

Error Message:
Error starting http server

Stack Trace:
org.apache.hadoop.yarn.webapp.WebAppException: Error starting http server
	at org.apache.hadoop.http.HttpServer2.start(HttpServer2.java:785)
	at org.apache.hadoop.yarn.webapp.WebApps$Builder.start(WebApps.java:274)
	at org.apache.hadoop.yarn.server.resourcemanager.ResourceManager.startWepApp(ResourceManager.java:974)
	at org.apache.hadoop.yarn.server.resourcemanager.MockRM.startWepApp(MockRM.java:635)
	at org.apache.hadoop.yarn.server.resourcemanager.ResourceManager.serviceStart(ResourceManager.java:1074)
	at org.apache.hadoop.service.AbstractService.start(AbstractService.java:193)
	at org.apache.hadoop.yarn.server.resourcemanager.TestRMHA.testTransitionedToStandbyShouldNotHang(TestRMHA.java:487)


FAILED:  org.apache.hadoop.yarn.server.resourcemanager.TestRMHA.testTransitionsWhenAutomaticFailoverEnabled

Error Message:
Error starting http server

Stack Trace:
org.apache.hadoop.yarn.webapp.WebAppException: Error starting http server
	at org.apache.hadoop.http.HttpServer2.start(HttpServer2.java:785)
	at org.apache.hadoop.yarn.webapp.WebApps$Builder.start(WebApps.java:274)
	at org.apache.hadoop.yarn.server.resourcemanager.ResourceManager.startWepApp(ResourceManager.java:974)
	at org.apache.hadoop.yarn.server.resourcemanager.MockRM.startWepApp(MockRM.java:635)
	at org.apache.hadoop.yarn.server.resourcemanager.ResourceManager.serviceStart(ResourceManager.java:1074)
	at org.apache.hadoop.service.AbstractService.start(AbstractService.java:193)
	at org.apache.hadoop.yarn.server.resourcemanager.TestRMHA.testTransitionsWhenAutomaticFailoverEnabled(TestRMHA.java:254)


FAILED:  org.apache.hadoop.yarn.server.resourcemanager.TestRMHA.testFailoverWhenTransitionToActiveThrowException

Error Message:
Error starting http server

Stack Trace:
org.apache.hadoop.yarn.webapp.WebAppException: Error starting http server
	at org.apache.hadoop.http.HttpServer2.start(HttpServer2.java:785)
	at org.apache.hadoop.yarn.webapp.WebApps$Builder.start(WebApps.java:274)
	at org.apache.hadoop.yarn.server.resourcemanager.ResourceManager.startWepApp(ResourceManager.java:974)
	at org.apache.hadoop.yarn.server.resourcemanager.MockRM.startWepApp(MockRM.java:635)
	at org.apache.hadoop.yarn.server.resourcemanager.ResourceManager.serviceStart(ResourceManager.java:1074)
	at org.apache.hadoop.service.AbstractService.start(AbstractService.java:193)
	at org.apache.hadoop.yarn.server.resourcemanager.TestRMHA.testFailoverWhenTransitionToActiveThrowException(TestRMHA.java:437)


FAILED:  org.apache.hadoop.yarn.server.resourcemanager.TestRMHA.testFailoverAndTransitions

Error Message:
Error starting http server

Stack Trace:
org.apache.hadoop.yarn.webapp.WebAppException: Error starting http server
	at org.apache.hadoop.http.HttpServer2.start(HttpServer2.java:785)
	at org.apache.hadoop.yarn.webapp.WebApps$Builder.start(WebApps.java:274)
	at org.apache.hadoop.yarn.server.resourcemanager.ResourceManager.startWepApp(ResourceManager.java:974)
	at org.apache.hadoop.yarn.server.resourcemanager.MockRM.startWepApp(MockRM.java:635)
	at org.apache.hadoop.yarn.server.resourcemanager.ResourceManager.serviceStart(ResourceManager.java:1074)
	at org.apache.hadoop.service.AbstractService.start(AbstractService.java:193)
	at org.apache.hadoop.yarn.server.resourcemanager.TestRMHA.testFailoverAndTransitions(TestRMHA.java:198)


FAILED:  org.apache.hadoop.yarn.server.resourcemanager.recovery.TestZKRMStateStore.testFencing

Error Message:
Error starting http server

Stack Trace:
org.apache.hadoop.yarn.webapp.WebAppException: Error starting http server
	at org.apache.hadoop.http.HttpServer2.start(HttpServer2.java:785)
	at org.apache.hadoop.yarn.webapp.WebApps$Builder.start(WebApps.java:274)
	at org.apache.hadoop.yarn.server.resourcemanager.ResourceManager.startWepApp(ResourceManager.java:974)
	at org.apache.hadoop.yarn.server.resourcemanager.ResourceManager.serviceStart(ResourceManager.java:1074)
	at org.apache.hadoop.service.AbstractService.start(AbstractService.java:193)
	at org.apache.hadoop.yarn.server.resourcemanager.recovery.TestZKRMStateStore.testFencing(TestZKRMStateStore.java:229)


FAILED:  org.apache.hadoop.yarn.server.resourcemanager.webapp.TestRMWebappAuthentication.testSimpleAuth[0]

Error Message:
Error starting http server

Stack Trace:
org.apache.hadoop.yarn.webapp.WebAppException: Error starting http server
	at org.apache.hadoop.http.HttpServer2.start(HttpServer2.java:785)
	at org.apache.hadoop.yarn.webapp.WebApps$Builder.start(WebApps.java:274)
	at org.apache.hadoop.yarn.server.resourcemanager.ResourceManager.startWepApp(ResourceManager.java:974)
	at org.apache.hadoop.yarn.server.resourcemanager.MockRM.startWepApp(MockRM.java:635)
	at org.apache.hadoop.yarn.server.resourcemanager.ResourceManager.serviceStart(ResourceManager.java:1074)
	at org.apache.hadoop.service.AbstractService.start(AbstractService.java:193)
	at org.apache.hadoop.yarn.server.resourcemanager.webapp.TestRMWebappAuthentication.testSimpleAuth(TestRMWebappAuthentication.java:147)


FAILED:  org.apache.hadoop.yarn.server.resourcemanager.webapp.TestRMWebappAuthentication.testSimpleAuth[1]

Error Message:
Error starting http server

Stack Trace:
org.apache.hadoop.yarn.webapp.WebAppException: Error starting http server
	at sun.nio.ch.Net.bind0(Native Method)
	at sun.nio.ch.Net.bind(Net.java:444)
	at sun.nio.ch.Net.bind(Net.java:436)
	at sun.nio.ch.ServerSocketChannelImpl.bind(ServerSocketChannelImpl.java:214)
	at sun.nio.ch.ServerSocketAdaptor.bind(ServerSocketAdaptor.java:74)
	at org.mortbay.jetty.nio.SelectChannelConnector.open(SelectChannelConnector.java:216)
	at org.apache.hadoop.http.HttpServer2.openListeners(HttpServer2.java:830)
	at org.apache.hadoop.http.HttpServer2.start(HttpServer2.java:772)
	at org.apache.hadoop.yarn.webapp.WebApps$Builder.start(WebApps.java:274)
	at org.apache.hadoop.yarn.server.resourcemanager.ResourceManager.startWepApp(ResourceManager.java:974)
	at org.apache.hadoop.yarn.server.resourcemanager.MockRM.startWepApp(MockRM.java:635)
	at org.apache.hadoop.yarn.server.resourcemanager.ResourceManager.serviceStart(ResourceManager.java:1074)
	at org.apache.hadoop.service.AbstractService.start(AbstractService.java:193)
	at org.apache.hadoop.yarn.server.resourcemanager.webapp.TestRMWebappAuthentication.testSimpleAuth(TestRMWebappAuthentication.java:147)



Mime
  • Unnamed multipart/mixed (inline, None, 0 bytes)
View raw message