hadoop-yarn-dev mailing list archives

Site index · List index
Message view « Date » · « Thread »
Top « Date » · « Thread »
From Apache Jenkins Server <jenk...@builds.apache.org>
Subject Failed: YARN-3336 PreCommit Build #6935
Date Thu, 12 Mar 2015 09:46:14 GMT
Jira: https://issues.apache.org/jira/browse/YARN-3336
Build: https://builds.apache.org/job/PreCommit-YARN-Build/6935/

###################################################################################
########################## LAST 60 LINES OF THE CONSOLE ###########################
[...truncated 4218 lines...]
  against trunk revision ff83ae7.

    {color:green}+1 @author{color}.  The patch does not contain any @author tags.

    {color:red}-1 tests included{color}.  The patch doesn't appear to include any new or modified
tests.
                        Please justify why no new tests are needed for this patch.
                        Also please list what manual steps were performed to verify this patch.

    {color:green}+1 javac{color}.  The applied patch does not increase the total number of
javac compiler warnings.

    {color:green}+1 javadoc{color}.  There were no new javadoc warning messages.

    {color:green}+1 eclipse:eclipse{color}.  The patch built with eclipse:eclipse.

    {color:red}-1 findbugs{color}.  The patch appears to introduce 5 new Findbugs (version
2.0.3) warnings.

    {color:green}+1 release audit{color}.  The applied patch does not increase the total number
of release audit warnings.

    {color:red}-1 core tests{color}.  The patch failed these unit tests in hadoop-yarn-project/hadoop-yarn/hadoop-yarn-server/hadoop-yarn-server-resourcemanager:

                  org.apache.hadoop.yarn.server.resourcemanager.TestRM

Test results: https://builds.apache.org/job/PreCommit-YARN-Build/6935//testReport/
Findbugs warnings: https://builds.apache.org/job/PreCommit-YARN-Build/6935//artifact/patchprocess/newPatchFindbugsWarningshadoop-yarn-server-resourcemanager.html
Console output: https://builds.apache.org/job/PreCommit-YARN-Build/6935//console

This message is automatically generated.


======================================================================
======================================================================
    Adding comment to Jira.
======================================================================
======================================================================


Comment added.
500d8ede2bcff25c1470c4acf6f37b699ff0c3ad logged out


======================================================================
======================================================================
    Finished build.
======================================================================
======================================================================


Build step 'Execute shell' marked build as failure
Archiving artifacts
Sending artifact delta relative to PreCommit-YARN-Build #6921
Archived 15 artifacts
Archive block size is 32768
Received 220 blocks and 1922435 bytes
Compression is 78.9%
Took 1.1 sec
[description-setter] Could not determine description.
Recording test results
Email was triggered for: Failure
Sending email for trigger: Failure



###################################################################################
############################## FAILED TESTS (if any) ##############################
1 tests failed.
FAILED:  org.apache.hadoop.yarn.server.resourcemanager.TestRM.testAppOnMultiNode[1]

Error Message:
test timed out after 30000 milliseconds

Stack Trace:
java.lang.Exception: test timed out after 30000 milliseconds
	at java.lang.Thread.sleep(Native Method)
	at org.apache.hadoop.yarn.server.resourcemanager.MockAM.waitForState(MockAM.java:83)
	at org.apache.hadoop.yarn.server.resourcemanager.TestRM.testAppOnMultiNode(TestRM.java:198)



Mime
  • Unnamed multipart/mixed (inline, None, 0 bytes)
View raw message