hadoop-yarn-dev mailing list archives

Site index · List index
Message view « Date » · « Thread »
Top « Date » · « Thread »
From Apache Jenkins Server <jenk...@builds.apache.org>
Subject Failed: YARN-3136 PreCommit Build #6895
Date Mon, 09 Mar 2015 17:29:40 GMT
Jira: https://issues.apache.org/jira/browse/YARN-3136
Build: https://builds.apache.org/job/PreCommit-YARN-Build/6895/

###################################################################################
########################## LAST 60 LINES OF THE CONSOLE ###########################
[...truncated 5573 lines...]

    {color:green}+1 @author{color}.  The patch does not contain any @author tags.

    {color:red}-1 tests included{color}.  The patch doesn't appear to include any new or modified
tests.
                        Please justify why no new tests are needed for this patch.
                        Also please list what manual steps were performed to verify this patch.

    {color:green}+1 javac{color}.  The applied patch does not increase the total number of
javac compiler warnings.

    {color:green}+1 javadoc{color}.  There were no new javadoc warning messages.

    {color:green}+1 eclipse:eclipse{color}.  The patch built with eclipse:eclipse.

    {color:red}-1 findbugs{color}.  The patch appears to introduce 7 new Findbugs (version
2.0.3) warnings.

    {color:green}+1 release audit{color}.  The applied patch does not increase the total number
of release audit warnings.

    {color:red}-1 core tests{color}.  The patch failed these unit tests in hadoop-yarn-project/hadoop-yarn/hadoop-yarn-server/hadoop-yarn-server-resourcemanager:

                  org.apache.hadoop.yarn.server.resourcemanager.TestRM
                  org.apache.hadoop.yarn.server.resourcemanager.scheduler.capacity.TestContainerAllocation

Test results: https://builds.apache.org/job/PreCommit-YARN-Build/6895//testReport/
Findbugs warnings: https://builds.apache.org/job/PreCommit-YARN-Build/6895//artifact/patchprocess/newPatchFindbugsWarningshadoop-yarn-server-resourcemanager.html
Console output: https://builds.apache.org/job/PreCommit-YARN-Build/6895//console

This message is automatically generated.


======================================================================
======================================================================
    Adding comment to Jira.
======================================================================
======================================================================


Comment added.
d917ad898d070b1cd5a86ff304c7d6c10564bff2 logged out


======================================================================
======================================================================
    Finished build.
======================================================================
======================================================================


Build step 'Execute shell' marked build as failure
Archiving artifacts
Sending artifact delta relative to PreCommit-YARN-Build #6886
Archived 15 artifacts
Archive block size is 32768
Received 51 blocks and 7606859 bytes
Compression is 18.0%
Took 1.7 sec
[description-setter] Could not determine description.
Recording test results
Email was triggered for: Failure
Sending email for trigger: Failure



###################################################################################
############################## FAILED TESTS (if any) ##############################
4 tests failed.
REGRESSION:  org.apache.hadoop.yarn.server.resourcemanager.TestRM.testAppWithNoContainers[0]

Error Message:
test timed out after 30000 milliseconds

Stack Trace:
java.lang.Exception: test timed out after 30000 milliseconds
	at java.lang.Thread.sleep(Native Method)
	at org.apache.hadoop.yarn.server.resourcemanager.MockRM.waitForState(MockRM.java:131)
	at org.apache.hadoop.yarn.server.resourcemanager.MockRM.submitApp(MockRM.java:422)
	at org.apache.hadoop.yarn.server.resourcemanager.MockRM.submitApp(MockRM.java:314)
	at org.apache.hadoop.yarn.server.resourcemanager.MockRM.submitApp(MockRM.java:306)
	at org.apache.hadoop.yarn.server.resourcemanager.MockRM.submitApp(MockRM.java:297)
	at org.apache.hadoop.yarn.server.resourcemanager.MockRM.submitApp(MockRM.java:290)
	at org.apache.hadoop.yarn.server.resourcemanager.MockRM.submitApp(MockRM.java:259)
	at org.apache.hadoop.yarn.server.resourcemanager.MockRM.submitApp(MockRM.java:247)
	at org.apache.hadoop.yarn.server.resourcemanager.MockRM.submitApp(MockRM.java:242)
	at org.apache.hadoop.yarn.server.resourcemanager.TestRM.testAppWithNoContainers(TestRM.java:131)


REGRESSION:  org.apache.hadoop.yarn.server.resourcemanager.TestRM.testNMTokenSentForNormalContainer[1]

Error Message:
test timed out after 20000 milliseconds

Stack Trace:
java.lang.Exception: test timed out after 20000 milliseconds
	at java.net.Inet4AddressImpl.lookupAllHostAddr(Native Method)
	at java.net.InetAddress$1.lookupAllHostAddr(InetAddress.java:901)
	at java.net.InetAddress.getAddressesFromNameService(InetAddress.java:1293)
	at java.net.InetAddress.getAllByName0(InetAddress.java:1246)
	at java.net.InetAddress.getAllByName(InetAddress.java:1162)
	at java.net.InetAddress.getAllByName(InetAddress.java:1098)
	at java.net.InetAddress.getByName(InetAddress.java:1048)
	at org.apache.hadoop.net.NetUtils.normalizeHostName(NetUtils.java:563)
	at org.apache.hadoop.yarn.server.resourcemanager.NodesListManager.isValidNode(NodesListManager.java:147)
	at org.apache.hadoop.yarn.server.resourcemanager.ResourceTrackerService.nodeHeartbeat(ResourceTrackerService.java:367)
	at org.apache.hadoop.yarn.server.resourcemanager.MockNM.nodeHeartbeat(MockNM.java:178)
	at org.apache.hadoop.yarn.server.resourcemanager.MockNM.nodeHeartbeat(MockNM.java:136)
	at org.apache.hadoop.yarn.server.resourcemanager.TestRM.testNMTokenSentForNormalContainer(TestRM.java:244)


REGRESSION:  org.apache.hadoop.yarn.server.resourcemanager.TestRM.testAppOnMultiNode[1]

Error Message:
test timed out after 30000 milliseconds

Stack Trace:
java.lang.Exception: test timed out after 30000 milliseconds
	at java.lang.Thread.sleep(Native Method)
	at org.apache.hadoop.yarn.server.resourcemanager.MockAM.waitForState(MockAM.java:83)
	at org.apache.hadoop.yarn.server.resourcemanager.TestRM.testAppOnMultiNode(TestRM.java:198)


REGRESSION:  org.apache.hadoop.yarn.server.resourcemanager.scheduler.capacity.TestContainerAllocation.testContainerAllocateWithDefaultQueueLabels

Error Message:
test timed out after 120000 milliseconds

Stack Trace:
java.lang.Exception: test timed out after 120000 milliseconds
	at java.net.Inet4AddressImpl.lookupAllHostAddr(Native Method)
	at java.net.InetAddress$1.lookupAllHostAddr(InetAddress.java:901)
	at java.net.InetAddress.getAddressesFromNameService(InetAddress.java:1293)
	at java.net.InetAddress.getAllByName0(InetAddress.java:1246)
	at java.net.InetAddress.getAllByName(InetAddress.java:1162)
	at java.net.InetAddress.getAllByName(InetAddress.java:1098)
	at java.net.InetAddress.getByName(InetAddress.java:1048)
	at org.apache.hadoop.net.NetUtils.normalizeHostName(NetUtils.java:563)
	at org.apache.hadoop.yarn.server.resourcemanager.NodesListManager.isValidNode(NodesListManager.java:147)
	at org.apache.hadoop.yarn.server.resourcemanager.ResourceTrackerService.nodeHeartbeat(ResourceTrackerService.java:367)
	at org.apache.hadoop.yarn.server.resourcemanager.MockNM.nodeHeartbeat(MockNM.java:178)
	at org.apache.hadoop.yarn.server.resourcemanager.MockNM.nodeHeartbeat(MockNM.java:136)
	at org.apache.hadoop.yarn.server.resourcemanager.MockRM.waitForState(MockRM.java:206)
	at org.apache.hadoop.yarn.server.resourcemanager.scheduler.capacity.TestContainerAllocation.testContainerAllocateWithDefaultQueueLabels(TestContainerAllocation.java:762)



Mime
  • Unnamed multipart/mixed (inline, None, 0 bytes)
View raw message