hadoop-yarn-dev mailing list archives

Site index · List index
Message view « Date » · « Thread »
Top « Date » · « Thread »
From Apache Jenkins Server <jenk...@builds.apache.org>
Subject Build failed in Jenkins: Hadoop-Yarn-trunk-Java8 #148
Date Mon, 30 Mar 2015 11:34:18 GMT
See <https://builds.apache.org/job/Hadoop-Yarn-trunk-Java8/148/changes>

Changes:

[aajisaka] HDFS-6263. Remove DRFA.MaxBackupIndex config from log4j.properties. Contributed
by Abhiraj Butala.

[aajisaka] HDFS-6408. Remove redundant definitions in log4j.properties. Contributed by Abhiraj
Butala.

[vinayakumarb] HDFS-7890. Improve information on Top users for metrics in RollingWindowsManager
and lower log level (Contributed by J.Andreina)

[harsh] HDFS-4396. Add START_MSG/SHUTDOWN_MSG for ZKFC. Contributed by Liang Xie.

------------------------------------------
[...truncated 4952 lines...]
Tests run: 1, Failures: 0, Errors: 0, Skipped: 0, Time elapsed: 2.894 sec - in org.apache.hadoop.yarn.server.resourcemanager.resourcetracker.TestNMExpiry
Java HotSpot(TM) 64-Bit Server VM warning: ignoring option MaxPermSize=768m; support was removed
in 8.0
Running org.apache.hadoop.yarn.server.resourcemanager.resourcetracker.TestNMReconnect
Tests run: 1, Failures: 0, Errors: 0, Skipped: 0, Time elapsed: 1.333 sec - in org.apache.hadoop.yarn.server.resourcemanager.resourcetracker.TestNMReconnect
Java HotSpot(TM) 64-Bit Server VM warning: ignoring option MaxPermSize=768m; support was removed
in 8.0
Running org.apache.hadoop.yarn.server.resourcemanager.TestClientRMTokens
Tests run: 6, Failures: 0, Errors: 0, Skipped: 0, Time elapsed: 17.949 sec - in org.apache.hadoop.yarn.server.resourcemanager.TestClientRMTokens
Java HotSpot(TM) 64-Bit Server VM warning: ignoring option MaxPermSize=768m; support was removed
in 8.0
Running org.apache.hadoop.yarn.server.resourcemanager.ahs.TestRMApplicationHistoryWriter
Tests run: 7, Failures: 0, Errors: 0, Skipped: 0, Time elapsed: 162.924 sec - in org.apache.hadoop.yarn.server.resourcemanager.ahs.TestRMApplicationHistoryWriter
Java HotSpot(TM) 64-Bit Server VM warning: ignoring option MaxPermSize=768m; support was removed
in 8.0
Running org.apache.hadoop.yarn.server.resourcemanager.TestRMRestart
Tests run: 48, Failures: 0, Errors: 0, Skipped: 0, Time elapsed: 386.735 sec - in org.apache.hadoop.yarn.server.resourcemanager.TestRMRestart
Java HotSpot(TM) 64-Bit Server VM warning: ignoring option MaxPermSize=768m; support was removed
in 8.0
Running org.apache.hadoop.yarn.server.resourcemanager.TestClientRMService
Tests run: 24, Failures: 1, Errors: 1, Skipped: 0, Time elapsed: 9.846 sec <<< FAILURE!
- in org.apache.hadoop.yarn.server.resourcemanager.TestClientRMService
testGetLabelsToNodes(org.apache.hadoop.yarn.server.resourcemanager.TestClientRMService)  Time
elapsed: 0.265 sec  <<< FAILURE!
java.lang.AssertionError: null
	at org.junit.Assert.fail(Assert.java:86)
	at org.junit.Assert.assertTrue(Assert.java:41)
	at org.junit.Assert.assertTrue(Assert.java:52)
	at org.apache.hadoop.yarn.server.resourcemanager.TestClientRMService.testGetLabelsToNodes(TestClientRMService.java:1497)

testGetClusterNodes(org.apache.hadoop.yarn.server.resourcemanager.TestClientRMService)  Time
elapsed: 0.192 sec  <<< ERROR!
org.apache.hadoop.yarn.exceptions.YarnRuntimeException: java.net.BindException: Problem binding
to [0.0.0.0:8032] java.net.BindException: Address already in use; For more details see:  http://wiki.apache.org/hadoop/BindException
	at sun.nio.ch.Net.bind0(Native Method)
	at sun.nio.ch.Net.bind(Net.java:414)
	at sun.nio.ch.Net.bind(Net.java:406)
	at sun.nio.ch.ServerSocketChannelImpl.bind(ServerSocketChannelImpl.java:214)
	at sun.nio.ch.ServerSocketAdaptor.bind(ServerSocketAdaptor.java:74)
	at org.apache.hadoop.ipc.Server.bind(Server.java:413)
	at org.apache.hadoop.ipc.Server$Listener.<init>(Server.java:579)
	at org.apache.hadoop.ipc.Server.<init>(Server.java:2308)
	at org.apache.hadoop.ipc.RPC$Server.<init>(RPC.java:945)
	at org.apache.hadoop.ipc.ProtobufRpcEngine$Server.<init>(ProtobufRpcEngine.java:534)
	at org.apache.hadoop.ipc.ProtobufRpcEngine.getServer(ProtobufRpcEngine.java:509)
	at org.apache.hadoop.ipc.RPC$Builder.build(RPC.java:787)
	at org.apache.hadoop.yarn.factories.impl.pb.RpcServerFactoryPBImpl.createServer(RpcServerFactoryPBImpl.java:173)
	at org.apache.hadoop.yarn.factories.impl.pb.RpcServerFactoryPBImpl.getServer(RpcServerFactoryPBImpl.java:132)
	at org.apache.hadoop.yarn.ipc.HadoopYarnProtoRPC.getServer(HadoopYarnProtoRPC.java:65)
	at org.apache.hadoop.yarn.ipc.YarnRPC.getServer(YarnRPC.java:54)
	at org.apache.hadoop.yarn.server.resourcemanager.ClientRMService.serviceStart(ClientRMService.java:220)
	at org.apache.hadoop.service.AbstractService.start(AbstractService.java:193)
	at org.apache.hadoop.service.CompositeService.serviceStart(CompositeService.java:120)
	at org.apache.hadoop.yarn.server.resourcemanager.ResourceManager$RMActiveServices.serviceStart(ResourceManager.java:584)
	at org.apache.hadoop.service.AbstractService.start(AbstractService.java:193)
	at org.apache.hadoop.yarn.server.resourcemanager.ResourceManager.startActiveServices(ResourceManager.java:994)
	at org.apache.hadoop.yarn.server.resourcemanager.ResourceManager$1.run(ResourceManager.java:1035)
	at org.apache.hadoop.yarn.server.resourcemanager.ResourceManager$1.run(ResourceManager.java:1031)
	at java.security.AccessController.doPrivileged(Native Method)
	at javax.security.auth.Subject.doAs(Subject.java:422)
	at org.apache.hadoop.security.UserGroupInformation.doAs(UserGroupInformation.java:1669)
	at org.apache.hadoop.yarn.server.resourcemanager.ResourceManager.transitionToActive(ResourceManager.java:1031)
	at org.apache.hadoop.yarn.server.resourcemanager.ResourceManager.serviceStart(ResourceManager.java:1071)
	at org.apache.hadoop.service.AbstractService.start(AbstractService.java:193)
	at org.apache.hadoop.yarn.server.resourcemanager.TestClientRMService.testGetClusterNodes(TestClientRMService.java:201)

Java HotSpot(TM) 64-Bit Server VM warning: ignoring option MaxPermSize=768m; support was removed
in 8.0
Running org.apache.hadoop.yarn.server.resourcemanager.TestResourceTrackerService
Tests run: 14, Failures: 0, Errors: 0, Skipped: 0, Time elapsed: 8.539 sec - in org.apache.hadoop.yarn.server.resourcemanager.TestResourceTrackerService
Java HotSpot(TM) 64-Bit Server VM warning: ignoring option MaxPermSize=768m; support was removed
in 8.0
Running org.apache.hadoop.yarn.server.resourcemanager.TestWorkPreservingRMRestart
Tests run: 24, Failures: 0, Errors: 0, Skipped: 0, Time elapsed: 227.551 sec - in org.apache.hadoop.yarn.server.resourcemanager.TestWorkPreservingRMRestart
Java HotSpot(TM) 64-Bit Server VM warning: ignoring option MaxPermSize=768m; support was removed
in 8.0
Running org.apache.hadoop.yarn.server.resourcemanager.rmcontainer.TestRMContainerImpl
Tests run: 3, Failures: 0, Errors: 0, Skipped: 0, Time elapsed: 19.32 sec - in org.apache.hadoop.yarn.server.resourcemanager.rmcontainer.TestRMContainerImpl
Java HotSpot(TM) 64-Bit Server VM warning: ignoring option MaxPermSize=768m; support was removed
in 8.0
Running org.apache.hadoop.yarn.server.resourcemanager.applicationsmanager.TestAMRMRPCNodeUpdates
Tests run: 1, Failures: 0, Errors: 0, Skipped: 0, Time elapsed: 9.625 sec - in org.apache.hadoop.yarn.server.resourcemanager.applicationsmanager.TestAMRMRPCNodeUpdates
Java HotSpot(TM) 64-Bit Server VM warning: ignoring option MaxPermSize=768m; support was removed
in 8.0
Running org.apache.hadoop.yarn.server.resourcemanager.applicationsmanager.TestAMRMRPCResponseId
Tests run: 1, Failures: 0, Errors: 0, Skipped: 0, Time elapsed: 16.206 sec - in org.apache.hadoop.yarn.server.resourcemanager.applicationsmanager.TestAMRMRPCResponseId
Java HotSpot(TM) 64-Bit Server VM warning: ignoring option MaxPermSize=768m; support was removed
in 8.0
Running org.apache.hadoop.yarn.server.resourcemanager.applicationsmanager.TestAMRestart
Tests run: 6, Failures: 0, Errors: 0, Skipped: 0, Time elapsed: 113.562 sec - in org.apache.hadoop.yarn.server.resourcemanager.applicationsmanager.TestAMRestart
Java HotSpot(TM) 64-Bit Server VM warning: ignoring option MaxPermSize=768m; support was removed
in 8.0
Running org.apache.hadoop.yarn.server.resourcemanager.TestResourceManager
Tests run: 5, Failures: 0, Errors: 0, Skipped: 0, Time elapsed: 3.347 sec - in org.apache.hadoop.yarn.server.resourcemanager.TestResourceManager
Java HotSpot(TM) 64-Bit Server VM warning: ignoring option MaxPermSize=768m; support was removed
in 8.0
Running org.apache.hadoop.yarn.server.resourcemanager.webapp.TestRMWebServicesNodes
Tests run: 22, Failures: 0, Errors: 0, Skipped: 0, Time elapsed: 17.241 sec - in org.apache.hadoop.yarn.server.resourcemanager.webapp.TestRMWebServicesNodes
Java HotSpot(TM) 64-Bit Server VM warning: ignoring option MaxPermSize=768m; support was removed
in 8.0
Running org.apache.hadoop.yarn.server.resourcemanager.webapp.TestRMWebServicesCapacitySched
Tests run: 7, Failures: 0, Errors: 0, Skipped: 0, Time elapsed: 14.54 sec - in org.apache.hadoop.yarn.server.resourcemanager.webapp.TestRMWebServicesCapacitySched
Java HotSpot(TM) 64-Bit Server VM warning: ignoring option MaxPermSize=768m; support was removed
in 8.0
Running org.apache.hadoop.yarn.server.resourcemanager.webapp.TestRMWebServicesApps
Tests run: 40, Failures: 0, Errors: 0, Skipped: 0, Time elapsed: 165.483 sec - in org.apache.hadoop.yarn.server.resourcemanager.webapp.TestRMWebServicesApps
Java HotSpot(TM) 64-Bit Server VM warning: ignoring option MaxPermSize=768m; support was removed
in 8.0
Running org.apache.hadoop.yarn.server.resourcemanager.webapp.TestRMWebServicesDelegationTokens
Tests run: 6, Failures: 0, Errors: 0, Skipped: 0, Time elapsed: 43.585 sec - in org.apache.hadoop.yarn.server.resourcemanager.webapp.TestRMWebServicesDelegationTokens
Java HotSpot(TM) 64-Bit Server VM warning: ignoring option MaxPermSize=768m; support was removed
in 8.0
Running org.apache.hadoop.yarn.server.resourcemanager.webapp.TestRMWebServicesNodeLabels
Tests run: 1, Failures: 0, Errors: 0, Skipped: 0, Time elapsed: 3.636 sec - in org.apache.hadoop.yarn.server.resourcemanager.webapp.TestRMWebServicesNodeLabels
Java HotSpot(TM) 64-Bit Server VM warning: ignoring option MaxPermSize=768m; support was removed
in 8.0
Running org.apache.hadoop.yarn.server.resourcemanager.webapp.TestRMWebServicesDelegationTokenAuthentication
Tests run: 8, Failures: 0, Errors: 0, Skipped: 0, Time elapsed: 8.437 sec - in org.apache.hadoop.yarn.server.resourcemanager.webapp.TestRMWebServicesDelegationTokenAuthentication
Java HotSpot(TM) 64-Bit Server VM warning: ignoring option MaxPermSize=768m; support was removed
in 8.0
Running org.apache.hadoop.yarn.server.resourcemanager.webapp.TestRMWebAppFairScheduler
Tests run: 2, Failures: 0, Errors: 0, Skipped: 0, Time elapsed: 4.824 sec - in org.apache.hadoop.yarn.server.resourcemanager.webapp.TestRMWebAppFairScheduler
Java HotSpot(TM) 64-Bit Server VM warning: ignoring option MaxPermSize=768m; support was removed
in 8.0
Running org.apache.hadoop.yarn.server.resourcemanager.webapp.TestRMWebServices
Tests run: 19, Failures: 0, Errors: 0, Skipped: 0, Time elapsed: 9.818 sec - in org.apache.hadoop.yarn.server.resourcemanager.webapp.TestRMWebServices
Java HotSpot(TM) 64-Bit Server VM warning: ignoring option MaxPermSize=768m; support was removed
in 8.0
Running org.apache.hadoop.yarn.server.resourcemanager.webapp.TestRMWebappAuthentication
Tests run: 2, Failures: 0, Errors: 2, Skipped: 0, Time elapsed: 5.819 sec <<< FAILURE!
- in org.apache.hadoop.yarn.server.resourcemanager.webapp.TestRMWebappAuthentication
testSimpleAuth[0](org.apache.hadoop.yarn.server.resourcemanager.webapp.TestRMWebappAuthentication)
 Time elapsed: 0.519 sec  <<< ERROR!
org.apache.hadoop.yarn.webapp.WebAppException: Error starting http server
	at org.apache.hadoop.http.HttpServer2.start(HttpServer2.java:785)
	at org.apache.hadoop.yarn.webapp.WebApps$Builder.start(WebApps.java:274)
	at org.apache.hadoop.yarn.server.resourcemanager.ResourceManager.startWepApp(ResourceManager.java:974)
	at org.apache.hadoop.yarn.server.resourcemanager.MockRM.startWepApp(MockRM.java:635)
	at org.apache.hadoop.yarn.server.resourcemanager.ResourceManager.serviceStart(ResourceManager.java:1074)
	at org.apache.hadoop.service.AbstractService.start(AbstractService.java:193)
	at org.apache.hadoop.yarn.server.resourcemanager.webapp.TestRMWebappAuthentication.testSimpleAuth(TestRMWebappAuthentication.java:147)

testSimpleAuth[1](org.apache.hadoop.yarn.server.resourcemanager.webapp.TestRMWebappAuthentication)
 Time elapsed: 0.057 sec  <<< ERROR!
org.apache.hadoop.yarn.webapp.WebAppException: Error starting http server
	at sun.nio.ch.Net.bind0(Native Method)
	at sun.nio.ch.Net.bind(Net.java:414)
	at sun.nio.ch.Net.bind(Net.java:406)
	at sun.nio.ch.ServerSocketChannelImpl.bind(ServerSocketChannelImpl.java:214)
	at sun.nio.ch.ServerSocketAdaptor.bind(ServerSocketAdaptor.java:74)
	at org.mortbay.jetty.nio.SelectChannelConnector.open(SelectChannelConnector.java:216)
	at org.apache.hadoop.http.HttpServer2.openListeners(HttpServer2.java:830)
	at org.apache.hadoop.http.HttpServer2.start(HttpServer2.java:772)
	at org.apache.hadoop.yarn.webapp.WebApps$Builder.start(WebApps.java:274)
	at org.apache.hadoop.yarn.server.resourcemanager.ResourceManager.startWepApp(ResourceManager.java:974)
	at org.apache.hadoop.yarn.server.resourcemanager.MockRM.startWepApp(MockRM.java:635)
	at org.apache.hadoop.yarn.server.resourcemanager.ResourceManager.serviceStart(ResourceManager.java:1074)
	at org.apache.hadoop.service.AbstractService.start(AbstractService.java:193)
	at org.apache.hadoop.yarn.server.resourcemanager.webapp.TestRMWebappAuthentication.testSimpleAuth(TestRMWebappAuthentication.java:147)

Java HotSpot(TM) 64-Bit Server VM warning: ignoring option MaxPermSize=768m; support was removed
in 8.0
Running org.apache.hadoop.yarn.server.resourcemanager.webapp.TestRMWebServicesAppsModification
Tests run: 40, Failures: 0, Errors: 0, Skipped: 0, Time elapsed: 218.085 sec - in org.apache.hadoop.yarn.server.resourcemanager.webapp.TestRMWebServicesAppsModification
Java HotSpot(TM) 64-Bit Server VM warning: ignoring option MaxPermSize=768m; support was removed
in 8.0
Running org.apache.hadoop.yarn.server.resourcemanager.webapp.TestAppPage
Tests run: 1, Failures: 0, Errors: 0, Skipped: 0, Time elapsed: 1.838 sec - in org.apache.hadoop.yarn.server.resourcemanager.webapp.TestAppPage
Java HotSpot(TM) 64-Bit Server VM warning: ignoring option MaxPermSize=768m; support was removed
in 8.0
Running org.apache.hadoop.yarn.server.resourcemanager.webapp.TestNodesPage
Tests run: 5, Failures: 0, Errors: 0, Skipped: 0, Time elapsed: 5.577 sec - in org.apache.hadoop.yarn.server.resourcemanager.webapp.TestNodesPage
Java HotSpot(TM) 64-Bit Server VM warning: ignoring option MaxPermSize=768m; support was removed
in 8.0
Running org.apache.hadoop.yarn.server.resourcemanager.webapp.TestRMWebApp
Tests run: 3, Failures: 0, Errors: 0, Skipped: 0, Time elapsed: 9.595 sec - in org.apache.hadoop.yarn.server.resourcemanager.webapp.TestRMWebApp
Java HotSpot(TM) 64-Bit Server VM warning: ignoring option MaxPermSize=768m; support was removed
in 8.0
Running org.apache.hadoop.yarn.server.resourcemanager.webapp.TestRMWebServicesFairScheduler
Tests run: 2, Failures: 0, Errors: 0, Skipped: 0, Time elapsed: 3.917 sec - in org.apache.hadoop.yarn.server.resourcemanager.webapp.TestRMWebServicesFairScheduler
Java HotSpot(TM) 64-Bit Server VM warning: ignoring option MaxPermSize=768m; support was removed
in 8.0
Running org.apache.hadoop.yarn.server.resourcemanager.webapp.TestRMWebServicesHttpStaticUserPermissions
Tests run: 1, Failures: 0, Errors: 0, Skipped: 0, Time elapsed: 6.997 sec - in org.apache.hadoop.yarn.server.resourcemanager.webapp.TestRMWebServicesHttpStaticUserPermissions
Java HotSpot(TM) 64-Bit Server VM warning: ignoring option MaxPermSize=768m; support was removed
in 8.0
Running org.apache.hadoop.yarn.server.resourcemanager.TestAppManager
Tests run: 12, Failures: 0, Errors: 0, Skipped: 0, Time elapsed: 5.839 sec - in org.apache.hadoop.yarn.server.resourcemanager.TestAppManager
Java HotSpot(TM) 64-Bit Server VM warning: ignoring option MaxPermSize=768m; support was removed
in 8.0
Running org.apache.hadoop.yarn.server.resourcemanager.TestRMAdminService
Tests run: 15, Failures: 3, Errors: 0, Skipped: 0, Time elapsed: 7.309 sec <<< FAILURE!
- in org.apache.hadoop.yarn.server.resourcemanager.TestRMAdminService
testServiceAclsRefreshWithLocalConfigurationProvider(org.apache.hadoop.yarn.server.resourcemanager.TestRMAdminService)
 Time elapsed: 0.874 sec  <<< FAILURE!
java.lang.AssertionError: Using localConfigurationProvider. Should not get any exception.
	at org.junit.Assert.fail(Assert.java:88)
	at org.apache.hadoop.yarn.server.resourcemanager.TestRMAdminService.testServiceAclsRefreshWithLocalConfigurationProvider(TestRMAdminService.java:219)

testServiceAclsRefreshWithFileSystemBasedConfigurationProvider(org.apache.hadoop.yarn.server.resourcemanager.TestRMAdminService)
 Time elapsed: 0.699 sec  <<< FAILURE!
java.lang.AssertionError: Should not get any exceptions
	at org.junit.Assert.fail(Assert.java:88)
	at org.apache.hadoop.yarn.server.resourcemanager.TestRMAdminService.testServiceAclsRefreshWithFileSystemBasedConfigurationProvider(TestRMAdminService.java:248)

testRMInitialsWithFileSystemBasedConfigurationProvider(org.apache.hadoop.yarn.server.resourcemanager.TestRMAdminService)
 Time elapsed: 0.52 sec  <<< FAILURE!
java.lang.AssertionError: Should not get any exceptions
	at org.junit.Assert.fail(Assert.java:88)
	at org.apache.hadoop.yarn.server.resourcemanager.TestRMAdminService.testRMInitialsWithFileSystemBasedConfigurationProvider(TestRMAdminService.java:674)

Java HotSpot(TM) 64-Bit Server VM warning: ignoring option MaxPermSize=768m; support was removed
in 8.0
Running org.apache.hadoop.yarn.server.resourcemanager.TestRMAuditLogger
Tests run: 3, Failures: 0, Errors: 0, Skipped: 0, Time elapsed: 1.029 sec - in org.apache.hadoop.yarn.server.resourcemanager.TestRMAuditLogger

Results :

Failed tests: 
  TestClientRMService.testGetLabelsToNodes:1497 null
  TestRMAdminService.testServiceAclsRefreshWithLocalConfigurationProvider:219 Using localConfigurationProvider.
Should not get any exception.
  TestRMAdminService.testServiceAclsRefreshWithFileSystemBasedConfigurationProvider:248 Should
not get any exceptions
  TestRMAdminService.testRMInitialsWithFileSystemBasedConfigurationProvider:674 Should not
get any exceptions

Tests in error: 
  TestZKRMStateStore.testFencing:229 » WebApp Error starting http server
  TestRMHA.testRMDispatcherForHA:330 » WebApp Error starting http server
  TestRMHA.testFailoverClearsRMContext:530 » WebApp Error starting http server
  TestRMHA.testTransitionedToStandbyShouldNotHang:487 » WebApp Error starting ht...
  TestRMHA.testTransitionsWhenAutomaticFailoverEnabled:254 » WebApp Error starti...
  TestRMHA.testFailoverWhenTransitionToActiveThrowException:437 » WebApp Error s...
  TestRMHA.testFailoverAndTransitions:198 » WebApp Error starting http server
  TestMoveApplication.setUp:59 » WebApp Error starting http server
  TestMoveApplication.setUp:59 » WebApp Error starting http server
  TestMoveApplication.setUp:59 » WebApp Error starting http server
  TestMoveApplication.setUp:59 » WebApp Error starting http server
  TestClientRMService.testGetClusterNodes:201 » YarnRuntime java.net.BindExcepti...
  TestRMWebappAuthentication.testSimpleAuth:147 » WebApp Error starting http ser...
  TestRMWebappAuthentication.testSimpleAuth:147 » WebApp Error starting http ser...

Tests run: 1033, Failures: 4, Errors: 14, Skipped: 1

[INFO] ------------------------------------------------------------------------
[INFO] Reactor Summary:
[INFO] 
[INFO] hadoop-yarn ....................................... SUCCESS [  2.907 s]
[INFO] hadoop-yarn-api ................................... SUCCESS [ 56.903 s]
[INFO] hadoop-yarn-common ................................ SUCCESS [02:05 min]
[INFO] hadoop-yarn-server ................................ SUCCESS [  0.055 s]
[INFO] hadoop-yarn-server-common ......................... SUCCESS [ 33.382 s]
[INFO] hadoop-yarn-server-nodemanager .................... SUCCESS [05:48 min]
[INFO] hadoop-yarn-server-web-proxy ...................... SUCCESS [ 14.890 s]
[INFO] hadoop-yarn-server-applicationhistoryservice ...... SUCCESS [02:46 min]
[INFO] hadoop-yarn-server-resourcemanager ................ FAILURE [49:14 min]
[INFO] hadoop-yarn-server-tests .......................... SKIPPED
[INFO] hadoop-yarn-client ................................ SKIPPED
[INFO] hadoop-yarn-server-sharedcachemanager ............. SKIPPED
[INFO] hadoop-yarn-applications .......................... SKIPPED
[INFO] hadoop-yarn-applications-distributedshell ......... SKIPPED
[INFO] hadoop-yarn-applications-unmanaged-am-launcher .... SKIPPED
[INFO] hadoop-yarn-site .................................. SKIPPED
[INFO] hadoop-yarn-registry .............................. SKIPPED
[INFO] hadoop-yarn-project ............................... SKIPPED
[INFO] ------------------------------------------------------------------------
[INFO] BUILD FAILURE
[INFO] ------------------------------------------------------------------------
[INFO] Total time: 01:01 h
[INFO] Finished at: 2015-03-30T11:34:10+00:00
[INFO] Final Memory: 66M/856M
[INFO] ------------------------------------------------------------------------
[ERROR] Failed to execute goal org.apache.maven.plugins:maven-surefire-plugin:2.17:test (default-test)
on project hadoop-yarn-server-resourcemanager: There are test failures.
[ERROR] 
[ERROR] Please refer to <https://builds.apache.org/job/Hadoop-Yarn-trunk-Java8/ws/hadoop-yarn-project/hadoop-yarn/hadoop-yarn-server/hadoop-yarn-server-resourcemanager/target/surefire-reports>
for the individual test results.
[ERROR] -> [Help 1]
[ERROR] 
[ERROR] To see the full stack trace of the errors, re-run Maven with the -e switch.
[ERROR] Re-run Maven using the -X switch to enable full debug logging.
[ERROR] 
[ERROR] For more information about the errors and possible solutions, please read the following
articles:
[ERROR] [Help 1] http://cwiki.apache.org/confluence/display/MAVEN/MojoFailureException
[ERROR] 
[ERROR] After correcting the problems, you can resume the build with the command
[ERROR]   mvn <goals> -rf :hadoop-yarn-server-resourcemanager
Build step 'Execute shell' marked build as failure
Archiving artifacts
Recording test results
Updating HDFS-6408
Updating HDFS-6263
Updating HDFS-7890
Updating HDFS-4396

Mime
View raw message