hadoop-yarn-dev mailing list archives

Site index · List index
Message view « Date » · « Thread »
Top « Date » · « Thread »
From Apache Jenkins Server <jenk...@builds.apache.org>
Subject Failed: YARN-3273 PreCommit Build #6973
Date Mon, 16 Mar 2015 16:17:04 GMT
Jira: https://issues.apache.org/jira/browse/YARN-3273
Build: https://builds.apache.org/job/PreCommit-YARN-Build/6973/

###################################################################################
########################## LAST 60 LINES OF THE CONSOLE ###########################
[...truncated 3709 lines...]
  http://issues.apache.org/jira/secure/attachment/12704785/0002-YARN-3273.patch
  against trunk revision 3da9a97.

    {color:green}+1 @author{color}.  The patch does not contain any @author tags.

    {color:green}+1 tests included{color}.  The patch appears to include 6 new or modified
test files.

    {color:green}+1 javac{color}.  The applied patch does not increase the total number of
javac compiler warnings.

    {color:green}+1 javadoc{color}.  There were no new javadoc warning messages.

    {color:green}+1 eclipse:eclipse{color}.  The patch built with eclipse:eclipse.

    {color:red}-1 findbugs{color}.  The patch appears to introduce 5 new Findbugs (version
2.0.3) warnings.

    {color:green}+1 release audit{color}.  The applied patch does not increase the total number
of release audit warnings.

    {color:red}-1 core tests{color}.  The patch failed these unit tests in hadoop-yarn-project/hadoop-yarn/hadoop-yarn-server/hadoop-yarn-server-common
hadoop-yarn-project/hadoop-yarn/hadoop-yarn-server/hadoop-yarn-server-resourcemanager:

                  org.apache.hadoop.yarn.server.resourcemanager.TestFifoScheduler
                  org.apache.hadoop.yarn.server.resourcemanager.webapp.TestNodesPage

Test results: https://builds.apache.org/job/PreCommit-YARN-Build/6973//testReport/
Findbugs warnings: https://builds.apache.org/job/PreCommit-YARN-Build/6973//artifact/patchprocess/newPatchFindbugsWarningshadoop-yarn-server-resourcemanager.html
Console output: https://builds.apache.org/job/PreCommit-YARN-Build/6973//console

This message is automatically generated.


======================================================================
======================================================================
    Adding comment to Jira.
======================================================================
======================================================================


Comment added.
8f2db918e9b9a655a2d3a6d2e9a318a5df19f07f logged out


======================================================================
======================================================================
    Finished build.
======================================================================
======================================================================


Build step 'Execute shell' marked build as failure
Archiving artifacts
Sending artifact delta relative to PreCommit-YARN-Build #6957
Archived 20 artifacts
Archive block size is 32768
Received 43 blocks and 7798074 bytes
Compression is 15.3%
Took 2.3 sec
[description-setter] Could not determine description.
Recording test results
Email was triggered for: Failure
Sending email for trigger: Failure



###################################################################################
############################## FAILED TESTS (if any) ##############################
7 tests failed.
REGRESSION:  org.apache.hadoop.yarn.server.resourcemanager.TestFifoScheduler.testBlackListNodes

Error Message:
null

Stack Trace:
java.lang.NullPointerException: null
	at org.apache.hadoop.yarn.server.resourcemanager.scheduler.SchedulerApplicationAttempt.setApplicationHeadroomForMetrics(SchedulerApplicationAttempt.java:637)
	at org.apache.hadoop.yarn.server.resourcemanager.scheduler.fifo.FifoScheduler.allocate(FifoScheduler.java:347)
	at org.apache.hadoop.yarn.server.resourcemanager.TestFifoScheduler.testBlackListNodes(TestFifoScheduler.java:396)


REGRESSION:  org.apache.hadoop.yarn.server.resourcemanager.TestFifoScheduler.testHeadroom

Error Message:
null

Stack Trace:
java.lang.NullPointerException: null
	at org.apache.hadoop.yarn.server.resourcemanager.scheduler.SchedulerApplicationAttempt.setApplicationHeadroomForMetrics(SchedulerApplicationAttempt.java:637)
	at org.apache.hadoop.yarn.server.resourcemanager.scheduler.fifo.FifoScheduler.allocate(FifoScheduler.java:347)
	at org.apache.hadoop.yarn.server.resourcemanager.TestFifoScheduler.testHeadroom(TestFifoScheduler.java:497)


REGRESSION:  org.apache.hadoop.yarn.server.resourcemanager.webapp.TestNodesPage.testNodesBlockRenderForNodeLabelFilterWithEmptyLabel

Error Message:

printWriter.print("<td");
Wanted 146 times:
-> at org.apache.hadoop.yarn.server.resourcemanager.webapp.TestNodesPage.testNodesBlockRenderForNodeLabelFilterWithEmptyLabel(TestNodesPage.java:133)
But was 150 times. Undesired invocation:
-> at org.apache.hadoop.yarn.webapp.hamlet.HamletImpl.printStartTag(HamletImpl.java:273)


Stack Trace:
org.mockito.exceptions.verification.TooManyActualInvocations: 
printWriter.print("<td");
Wanted 146 times:
-> at org.apache.hadoop.yarn.server.resourcemanager.webapp.TestNodesPage.testNodesBlockRenderForNodeLabelFilterWithEmptyLabel(TestNodesPage.java:133)
But was 150 times. Undesired invocation:
-> at org.apache.hadoop.yarn.webapp.hamlet.HamletImpl.printStartTag(HamletImpl.java:273)

	at org.apache.hadoop.yarn.server.resourcemanager.webapp.TestNodesPage.testNodesBlockRenderForNodeLabelFilterWithEmptyLabel(TestNodesPage.java:133)


REGRESSION:  org.apache.hadoop.yarn.server.resourcemanager.webapp.TestNodesPage.testNodesBlockRenderForNodeLabelFilterWithNonEmptyLabel

Error Message:

printWriter.print("<td");
Wanted 42 times:
-> at org.apache.hadoop.yarn.server.resourcemanager.webapp.TestNodesPage.testNodesBlockRenderForNodeLabelFilterWithNonEmptyLabel(TestNodesPage.java:118)
But was 46 times. Undesired invocation:
-> at org.apache.hadoop.yarn.webapp.hamlet.HamletImpl.printStartTag(HamletImpl.java:273)


Stack Trace:
org.mockito.exceptions.verification.TooManyActualInvocations: 
printWriter.print("<td");
Wanted 42 times:
-> at org.apache.hadoop.yarn.server.resourcemanager.webapp.TestNodesPage.testNodesBlockRenderForNodeLabelFilterWithNonEmptyLabel(TestNodesPage.java:118)
But was 46 times. Undesired invocation:
-> at org.apache.hadoop.yarn.webapp.hamlet.HamletImpl.printStartTag(HamletImpl.java:273)

	at org.apache.hadoop.yarn.server.resourcemanager.webapp.TestNodesPage.testNodesBlockRenderForNodeLabelFilterWithNonEmptyLabel(TestNodesPage.java:118)


REGRESSION:  org.apache.hadoop.yarn.server.resourcemanager.webapp.TestNodesPage.testNodesBlockRender

Error Message:

printWriter.print("<th");
Wanted 29 times:
-> at org.apache.hadoop.yarn.server.resourcemanager.webapp.TestNodesPage.testNodesBlockRender(TestNodesPage.java:82)
But was 33 times. Undesired invocation:
-> at org.apache.hadoop.yarn.webapp.hamlet.HamletImpl.printStartTag(HamletImpl.java:273)


Stack Trace:
org.mockito.exceptions.verification.TooManyActualInvocations: 
printWriter.print("<th");
Wanted 29 times:
-> at org.apache.hadoop.yarn.server.resourcemanager.webapp.TestNodesPage.testNodesBlockRender(TestNodesPage.java:82)
But was 33 times. Undesired invocation:
-> at org.apache.hadoop.yarn.webapp.hamlet.HamletImpl.printStartTag(HamletImpl.java:273)

	at org.apache.hadoop.yarn.server.resourcemanager.webapp.TestNodesPage.testNodesBlockRender(TestNodesPage.java:82)


REGRESSION:  org.apache.hadoop.yarn.server.resourcemanager.webapp.TestNodesPage.testNodesBlockRenderForLostNodes

Error Message:

printWriter.print("<th");
Wanted 29 times:
-> at org.apache.hadoop.yarn.server.resourcemanager.webapp.TestNodesPage.testNodesBlockRenderForLostNodes(TestNodesPage.java:100)
But was 33 times. Undesired invocation:
-> at org.apache.hadoop.yarn.webapp.hamlet.HamletImpl.printStartTag(HamletImpl.java:273)


Stack Trace:
org.mockito.exceptions.verification.TooManyActualInvocations: 
printWriter.print("<th");
Wanted 29 times:
-> at org.apache.hadoop.yarn.server.resourcemanager.webapp.TestNodesPage.testNodesBlockRenderForLostNodes(TestNodesPage.java:100)
But was 33 times. Undesired invocation:
-> at org.apache.hadoop.yarn.webapp.hamlet.HamletImpl.printStartTag(HamletImpl.java:273)

	at org.apache.hadoop.yarn.server.resourcemanager.webapp.TestNodesPage.testNodesBlockRenderForLostNodes(TestNodesPage.java:100)


REGRESSION:  org.apache.hadoop.yarn.server.resourcemanager.webapp.TestNodesPage.testNodesBlockRenderForNodeLabelFilterWithAnyLabel

Error Message:

printWriter.print("<td");
Wanted 172 times:
-> at org.apache.hadoop.yarn.server.resourcemanager.webapp.TestNodesPage.testNodesBlockRenderForNodeLabelFilterWithAnyLabel(TestNodesPage.java:148)
But was 176 times. Undesired invocation:
-> at org.apache.hadoop.yarn.webapp.hamlet.HamletImpl.printStartTag(HamletImpl.java:273)


Stack Trace:
org.mockito.exceptions.verification.TooManyActualInvocations: 
printWriter.print("<td");
Wanted 172 times:
-> at org.apache.hadoop.yarn.server.resourcemanager.webapp.TestNodesPage.testNodesBlockRenderForNodeLabelFilterWithAnyLabel(TestNodesPage.java:148)
But was 176 times. Undesired invocation:
-> at org.apache.hadoop.yarn.webapp.hamlet.HamletImpl.printStartTag(HamletImpl.java:273)

	at org.apache.hadoop.yarn.server.resourcemanager.webapp.TestNodesPage.testNodesBlockRenderForNodeLabelFilterWithAnyLabel(TestNodesPage.java:148)



Mime
  • Unnamed multipart/mixed (inline, None, 0 bytes)
View raw message