hadoop-yarn-dev mailing list archives

Site index · List index
Message view « Date » · « Thread »
Top « Date » · « Thread »
From Apache Jenkins Server <jenk...@builds.apache.org>
Subject Failed: YARN-3039 PreCommit Build #6700
Date Mon, 23 Feb 2015 19:46:55 GMT
Jira: https://issues.apache.org/jira/browse/YARN-3039
Build: https://builds.apache.org/job/PreCommit-YARN-Build/6700/

###################################################################################
########################## LAST 60 LINES OF THE CONSOLE ###########################
[...truncated 3526 lines...]
                  org.apache.hadoop.yarn.server.resourcemanager.scheduler.capacity.TestCapacitySchedulerQueueACLs
                  org.apache.hadoop.yarn.server.resourcemanager.rmapp.TestRMAppTransitions
                  org.apache.hadoop.yarn.server.resourcemanager.applicationsmanager.TestAMRMRPCResponseId
                  org.apache.hadoop.yarn.server.resourcemanager.rmcontainer.TestRMContainerImpl
                  org.apache.hadoop.yarn.server.resourcemanager.ahs.TestRMApplicationHistoryWriter
                  org.apache.hadoop.yarn.server.resourcemanager.scheduler.capacity.TestCapacitySchedulerDynamicBehavior
                  org.apache.hadoop.yarn.server.resourcemanager.scheduler.capacity.TestContainerAllocation
                  org.apache.hadoop.yarn.server.resourcemanager.scheduler.capacity.TestQueueMappings
                  org.apache.hadoop.yarn.server.resourcemanager.security.TestDelegationTokenRenewer
                  org.apache.hadoop.yarn.server.resourcemanager.TestFifoScheduler
                  org.apache.hadoop.yarn.server.resourcemanager.scheduler.capacity.TestCapacityScheduler
                  org.apache.hadoop.yarn.server.resourcemanager.applicationsmanager.TestAMRMRPCNodeUpdates
                  org.apache.hadoop.yarn.server.resourcemanager.TestWorkPreservingRMRestart
                  org.apache.hadoop.yarn.server.resourcemanager.scheduler.fair.TestFairSchedulerQueueACLs
                  org.apache.hadoop.yarn.server.resourcemanager.applicationsmanager.TestAMRestart
                  org.apache.hadoop.yarn.server.resourcemanager.recovery.TestZKRMStateStore
                  org.apache.hadoop.yarn.server.resourcemanager.recovery.TestLeveldbRMStateStore
                  org.apache.hadoop.yarn.server.resourcemanager.scheduler.TestSchedulerUtils
                  org.apache.hadoop.yarn.server.resourcemanager.security.TestClientToAMTokens
                  org.apache.hadoop.yarn.server.resourcemanager.scheduler.capacity.TestCapacitySchedulerNodeLabelUpdate
                  org.apache.hadoop.yarn.server.resourcemanager.TestContainerResourceUsage
                  org.apache.hadoop.yarn.server.resourcemanager.resourcetracker.TestRMNMRPCResponseId
                  org.apache.hadoop.yarn.server.resourcemanager.TestSubmitApplicationWithRMHA
                  org.apache.hadoop.yarn.server.resourcemanager.recovery.TestFSRMStateStore
                  org.apache.hadoop.yarn.server.resourcemanager.TestRMHA
                  org.apache.hadoop.yarn.server.resourcemanager.TestAMAuthorization

Test results: https://builds.apache.org/job/PreCommit-YARN-Build/6700//testReport/
Findbugs warnings: https://builds.apache.org/job/PreCommit-YARN-Build/6700//artifact/patchprocess/newPatchFindbugsWarningshadoop-yarn-common.html
Findbugs warnings: https://builds.apache.org/job/PreCommit-YARN-Build/6700//artifact/patchprocess/newPatchFindbugsWarningshadoop-yarn-server-resourcemanager.html
Console output: https://builds.apache.org/job/PreCommit-YARN-Build/6700//console

This message is automatically generated.


======================================================================
======================================================================
    Adding comment to Jira.
======================================================================
======================================================================


Comment added.
a267f7b05ce0bcf15a999d88fbb1aa729f7ae8a3 logged out


======================================================================
======================================================================
    Finished build.
======================================================================
======================================================================


Build step 'Execute shell' marked build as failure
Archiving artifacts
[description-setter] Could not determine description.
Recording test results
Email was triggered for: Failure
Sending email for trigger: Failure



###################################################################################
############################## FAILED TESTS (if any) ##############################
139 tests failed.
FAILED:  org.apache.hadoop.yarn.server.resourcemanager.TestAMAuthorization.testAuthorizedAccess[0]

Error Message:
App state is not correct (timedout) expected:<ACCEPTED> but was:<NEW>

Stack Trace:
java.lang.AssertionError: App state is not correct (timedout) expected:<ACCEPTED> but was:<NEW>
	at org.junit.Assert.fail(Assert.java:88)
	at org.junit.Assert.failNotEquals(Assert.java:743)
	at org.junit.Assert.assertEquals(Assert.java:118)
	at org.apache.hadoop.yarn.server.resourcemanager.MockRM.waitForState(MockRM.java:134)
	at org.apache.hadoop.yarn.server.resourcemanager.MockRM.submitApp(MockRM.java:422)
	at org.apache.hadoop.yarn.server.resourcemanager.MockRM.submitApp(MockRM.java:314)
	at org.apache.hadoop.yarn.server.resourcemanager.MockRM.submitApp(MockRM.java:306)
	at org.apache.hadoop.yarn.server.resourcemanager.MockRM.submitApp(MockRM.java:297)
	at org.apache.hadoop.yarn.server.resourcemanager.MockRM.submitApp(MockRM.java:290)
	at org.apache.hadoop.yarn.server.resourcemanager.MockRM.submitApp(MockRM.java:266)
	at org.apache.hadoop.yarn.server.resourcemanager.TestAMAuthorization.testAuthorizedAccess(TestAMAuthorization.java:177)


FAILED:  org.apache.hadoop.yarn.server.resourcemanager.TestAMAuthorization.testUnauthorizedAccess[0]

Error Message:
App state is not correct (timedout) expected:<ACCEPTED> but was:<NEW>

Stack Trace:
java.lang.AssertionError: App state is not correct (timedout) expected:<ACCEPTED> but was:<NEW>
	at org.junit.Assert.fail(Assert.java:88)
	at org.junit.Assert.failNotEquals(Assert.java:743)
	at org.junit.Assert.assertEquals(Assert.java:118)
	at org.apache.hadoop.yarn.server.resourcemanager.MockRM.waitForState(MockRM.java:134)
	at org.apache.hadoop.yarn.server.resourcemanager.MockRM.submitApp(MockRM.java:422)
	at org.apache.hadoop.yarn.server.resourcemanager.MockRM.submitApp(MockRM.java:314)
	at org.apache.hadoop.yarn.server.resourcemanager.MockRM.submitApp(MockRM.java:306)
	at org.apache.hadoop.yarn.server.resourcemanager.MockRM.submitApp(MockRM.java:297)
	at org.apache.hadoop.yarn.server.resourcemanager.MockRM.submitApp(MockRM.java:290)
	at org.apache.hadoop.yarn.server.resourcemanager.MockRM.submitApp(MockRM.java:259)
	at org.apache.hadoop.yarn.server.resourcemanager.MockRM.submitApp(MockRM.java:247)
	at org.apache.hadoop.yarn.server.resourcemanager.MockRM.submitApp(MockRM.java:242)
	at org.apache.hadoop.yarn.server.resourcemanager.TestAMAuthorization.testUnauthorizedAccess(TestAMAuthorization.java:235)


FAILED:  org.apache.hadoop.yarn.server.resourcemanager.TestAMAuthorization.testAuthorizedAccess[1]

Error Message:
App state is not correct (timedout) expected:<ACCEPTED> but was:<NEW>

Stack Trace:
java.lang.AssertionError: App state is not correct (timedout) expected:<ACCEPTED> but was:<NEW>
	at org.junit.Assert.fail(Assert.java:88)
	at org.junit.Assert.failNotEquals(Assert.java:743)
	at org.junit.Assert.assertEquals(Assert.java:118)
	at org.apache.hadoop.yarn.server.resourcemanager.MockRM.waitForState(MockRM.java:134)
	at org.apache.hadoop.yarn.server.resourcemanager.MockRM.submitApp(MockRM.java:422)
	at org.apache.hadoop.yarn.server.resourcemanager.MockRM.submitApp(MockRM.java:314)
	at org.apache.hadoop.yarn.server.resourcemanager.MockRM.submitApp(MockRM.java:306)
	at org.apache.hadoop.yarn.server.resourcemanager.MockRM.submitApp(MockRM.java:297)
	at org.apache.hadoop.yarn.server.resourcemanager.MockRM.submitApp(MockRM.java:290)
	at org.apache.hadoop.yarn.server.resourcemanager.MockRM.submitApp(MockRM.java:266)
	at org.apache.hadoop.yarn.server.resourcemanager.TestAMAuthorization.testAuthorizedAccess(TestAMAuthorization.java:177)


FAILED:  org.apache.hadoop.yarn.server.resourcemanager.TestAMAuthorization.testUnauthorizedAccess[1]

Error Message:
App state is not correct (timedout) expected:<ACCEPTED> but was:<NEW>

Stack Trace:
java.lang.AssertionError: App state is not correct (timedout) expected:<ACCEPTED> but was:<NEW>
	at org.junit.Assert.fail(Assert.java:88)
	at org.junit.Assert.failNotEquals(Assert.java:743)
	at org.junit.Assert.assertEquals(Assert.java:118)
	at org.apache.hadoop.yarn.server.resourcemanager.MockRM.waitForState(MockRM.java:134)
	at org.apache.hadoop.yarn.server.resourcemanager.MockRM.submitApp(MockRM.java:422)
	at org.apache.hadoop.yarn.server.resourcemanager.MockRM.submitApp(MockRM.java:314)
	at org.apache.hadoop.yarn.server.resourcemanager.MockRM.submitApp(MockRM.java:306)
	at org.apache.hadoop.yarn.server.resourcemanager.MockRM.submitApp(MockRM.java:297)
	at org.apache.hadoop.yarn.server.resourcemanager.MockRM.submitApp(MockRM.java:290)
	at org.apache.hadoop.yarn.server.resourcemanager.MockRM.submitApp(MockRM.java:259)
	at org.apache.hadoop.yarn.server.resourcemanager.MockRM.submitApp(MockRM.java:247)
	at org.apache.hadoop.yarn.server.resourcemanager.MockRM.submitApp(MockRM.java:242)
	at org.apache.hadoop.yarn.server.resourcemanager.TestAMAuthorization.testUnauthorizedAccess(TestAMAuthorization.java:235)


FAILED:  org.apache.hadoop.yarn.server.resourcemanager.TestContainerResourceUsage.testUsageAfterAMRestartWithMultipleContainers

Error Message:
test timed out after 60000 milliseconds

Stack Trace:
java.lang.Exception: test timed out after 60000 milliseconds
	at java.lang.Thread.sleep(Native Method)
	at org.apache.hadoop.yarn.server.resourcemanager.MockRM.waitForState(MockRM.java:131)
	at org.apache.hadoop.yarn.server.resourcemanager.MockRM.launchAM(MockRM.java:656)
	at org.apache.hadoop.yarn.server.resourcemanager.MockRM.launchAndRegisterAM(MockRM.java:667)
	at org.apache.hadoop.yarn.server.resourcemanager.TestContainerResourceUsage.amRestartTests(TestContainerResourceUsage.java:273)
	at org.apache.hadoop.yarn.server.resourcemanager.TestContainerResourceUsage.testUsageAfterAMRestartWithMultipleContainers(TestContainerResourceUsage.java:252)


FAILED:  org.apache.hadoop.yarn.server.resourcemanager.TestContainerResourceUsage.testUsageWithMultipleContainersAndRMRestart

Error Message:
App state is not correct (timedout) expected:<ACCEPTED> but was:<NEW>

Stack Trace:
java.lang.AssertionError: App state is not correct (timedout) expected:<ACCEPTED> but was:<NEW>
	at org.junit.Assert.fail(Assert.java:88)
	at org.junit.Assert.failNotEquals(Assert.java:743)
	at org.junit.Assert.assertEquals(Assert.java:118)
	at org.apache.hadoop.yarn.server.resourcemanager.MockRM.waitForState(MockRM.java:134)
	at org.apache.hadoop.yarn.server.resourcemanager.MockRM.submitApp(MockRM.java:422)
	at org.apache.hadoop.yarn.server.resourcemanager.MockRM.submitApp(MockRM.java:314)
	at org.apache.hadoop.yarn.server.resourcemanager.MockRM.submitApp(MockRM.java:306)
	at org.apache.hadoop.yarn.server.resourcemanager.MockRM.submitApp(MockRM.java:297)
	at org.apache.hadoop.yarn.server.resourcemanager.MockRM.submitApp(MockRM.java:290)
	at org.apache.hadoop.yarn.server.resourcemanager.MockRM.submitApp(MockRM.java:259)
	at org.apache.hadoop.yarn.server.resourcemanager.MockRM.submitApp(MockRM.java:247)
	at org.apache.hadoop.yarn.server.resourcemanager.MockRM.submitApp(MockRM.java:242)
	at org.apache.hadoop.yarn.server.resourcemanager.TestContainerResourceUsage.testUsageWithMultipleContainersAndRMRestart(TestContainerResourceUsage.java:150)


FAILED:  org.apache.hadoop.yarn.server.resourcemanager.TestContainerResourceUsage.testUsageWithOneAttemptAndOneContainer

Error Message:
App state is not correct (timedout) expected:<ACCEPTED> but was:<NEW>

Stack Trace:
java.lang.AssertionError: App state is not correct (timedout) expected:<ACCEPTED> but was:<NEW>
	at org.junit.Assert.fail(Assert.java:88)
	at org.junit.Assert.failNotEquals(Assert.java:743)
	at org.junit.Assert.assertEquals(Assert.java:118)
	at org.apache.hadoop.yarn.server.resourcemanager.MockRM.waitForState(MockRM.java:134)
	at org.apache.hadoop.yarn.server.resourcemanager.MockRM.submitApp(MockRM.java:422)
	at org.apache.hadoop.yarn.server.resourcemanager.MockRM.submitApp(MockRM.java:314)
	at org.apache.hadoop.yarn.server.resourcemanager.MockRM.submitApp(MockRM.java:306)
	at org.apache.hadoop.yarn.server.resourcemanager.MockRM.submitApp(MockRM.java:297)
	at org.apache.hadoop.yarn.server.resourcemanager.MockRM.submitApp(MockRM.java:290)
	at org.apache.hadoop.yarn.server.resourcemanager.MockRM.submitApp(MockRM.java:259)
	at org.apache.hadoop.yarn.server.resourcemanager.MockRM.submitApp(MockRM.java:247)
	at org.apache.hadoop.yarn.server.resourcemanager.MockRM.submitApp(MockRM.java:242)
	at org.apache.hadoop.yarn.server.resourcemanager.TestContainerResourceUsage.testUsageWithOneAttemptAndOneContainer(TestContainerResourceUsage.java:81)


FAILED:  org.apache.hadoop.yarn.server.resourcemanager.TestContainerResourceUsage.testUsageAfterAMRestartKeepContainers

Error Message:
test timed out after 60000 milliseconds

Stack Trace:
java.lang.Exception: test timed out after 60000 milliseconds
	at java.lang.Thread.sleep(Native Method)
	at org.apache.hadoop.yarn.server.resourcemanager.MockRM.waitForState(MockRM.java:131)
	at org.apache.hadoop.yarn.server.resourcemanager.MockRM.launchAM(MockRM.java:656)
	at org.apache.hadoop.yarn.server.resourcemanager.MockRM.launchAndRegisterAM(MockRM.java:667)
	at org.apache.hadoop.yarn.server.resourcemanager.TestContainerResourceUsage.amRestartTests(TestContainerResourceUsage.java:273)
	at org.apache.hadoop.yarn.server.resourcemanager.TestContainerResourceUsage.testUsageAfterAMRestartKeepContainers(TestContainerResourceUsage.java:257)


FAILED:  org.apache.hadoop.yarn.server.resourcemanager.TestFifoScheduler.testAllocateContainerOnNodeWithoutOffSwitchSpecified

Error Message:
App state is not correct (timedout) expected:<ACCEPTED> but was:<NEW>

Stack Trace:
java.lang.AssertionError: App state is not correct (timedout) expected:<ACCEPTED> but was:<NEW>
	at org.junit.Assert.fail(Assert.java:88)
	at org.junit.Assert.failNotEquals(Assert.java:743)
	at org.junit.Assert.assertEquals(Assert.java:118)
	at org.apache.hadoop.yarn.server.resourcemanager.MockRM.waitForState(MockRM.java:134)
	at org.apache.hadoop.yarn.server.resourcemanager.MockRM.submitApp(MockRM.java:422)
	at org.apache.hadoop.yarn.server.resourcemanager.MockRM.submitApp(MockRM.java:314)
	at org.apache.hadoop.yarn.server.resourcemanager.MockRM.submitApp(MockRM.java:306)
	at org.apache.hadoop.yarn.server.resourcemanager.MockRM.submitApp(MockRM.java:297)
	at org.apache.hadoop.yarn.server.resourcemanager.MockRM.submitApp(MockRM.java:290)
	at org.apache.hadoop.yarn.server.resourcemanager.MockRM.submitApp(MockRM.java:259)
	at org.apache.hadoop.yarn.server.resourcemanager.MockRM.submitApp(MockRM.java:247)
	at org.apache.hadoop.yarn.server.resourcemanager.MockRM.submitApp(MockRM.java:242)
	at org.apache.hadoop.yarn.server.resourcemanager.TestFifoScheduler.testAllocateContainerOnNodeWithoutOffSwitchSpecified(TestFifoScheduler.java:113)


FAILED:  org.apache.hadoop.yarn.server.resourcemanager.TestFifoScheduler.test

Error Message:
App state is not correct (timedout) expected:<ACCEPTED> but was:<NEW>

Stack Trace:
java.lang.AssertionError: App state is not correct (timedout) expected:<ACCEPTED> but was:<NEW>
	at org.junit.Assert.fail(Assert.java:88)
	at org.junit.Assert.failNotEquals(Assert.java:743)
	at org.junit.Assert.assertEquals(Assert.java:118)
	at org.apache.hadoop.yarn.server.resourcemanager.MockRM.waitForState(MockRM.java:134)
	at org.apache.hadoop.yarn.server.resourcemanager.MockRM.submitApp(MockRM.java:422)
	at org.apache.hadoop.yarn.server.resourcemanager.MockRM.submitApp(MockRM.java:314)
	at org.apache.hadoop.yarn.server.resourcemanager.MockRM.submitApp(MockRM.java:306)
	at org.apache.hadoop.yarn.server.resourcemanager.MockRM.submitApp(MockRM.java:297)
	at org.apache.hadoop.yarn.server.resourcemanager.MockRM.submitApp(MockRM.java:290)
	at org.apache.hadoop.yarn.server.resourcemanager.MockRM.submitApp(MockRM.java:259)
	at org.apache.hadoop.yarn.server.resourcemanager.MockRM.submitApp(MockRM.java:247)
	at org.apache.hadoop.yarn.server.resourcemanager.MockRM.submitApp(MockRM.java:242)
	at org.apache.hadoop.yarn.server.resourcemanager.TestFifoScheduler.test(TestFifoScheduler.java:145)


FAILED:  org.apache.hadoop.yarn.server.resourcemanager.TestFifoScheduler.testResourceOverCommit

Error Message:
App state is not correct (timedout) expected:<ACCEPTED> but was:<NEW>

Stack Trace:
java.lang.AssertionError: App state is not correct (timedout) expected:<ACCEPTED> but was:<NEW>
	at org.junit.Assert.fail(Assert.java:88)
	at org.junit.Assert.failNotEquals(Assert.java:743)
	at org.junit.Assert.assertEquals(Assert.java:118)
	at org.apache.hadoop.yarn.server.resourcemanager.MockRM.waitForState(MockRM.java:134)
	at org.apache.hadoop.yarn.server.resourcemanager.MockRM.submitApp(MockRM.java:422)
	at org.apache.hadoop.yarn.server.resourcemanager.MockRM.submitApp(MockRM.java:314)
	at org.apache.hadoop.yarn.server.resourcemanager.MockRM.submitApp(MockRM.java:306)
	at org.apache.hadoop.yarn.server.resourcemanager.MockRM.submitApp(MockRM.java:297)
	at org.apache.hadoop.yarn.server.resourcemanager.MockRM.submitApp(MockRM.java:290)
	at org.apache.hadoop.yarn.server.resourcemanager.MockRM.submitApp(MockRM.java:259)
	at org.apache.hadoop.yarn.server.resourcemanager.MockRM.submitApp(MockRM.java:247)
	at org.apache.hadoop.yarn.server.resourcemanager.MockRM.submitApp(MockRM.java:242)
	at org.apache.hadoop.yarn.server.resourcemanager.TestFifoScheduler.testResourceOverCommit(TestFifoScheduler.java:527)


FAILED:  org.apache.hadoop.yarn.server.resourcemanager.TestFifoScheduler.testDefaultMinimumAllocation

Error Message:
App state is not correct (timedout) expected:<ACCEPTED> but was:<NEW>

Stack Trace:
java.lang.AssertionError: App state is not correct (timedout) expected:<ACCEPTED> but was:<NEW>
	at org.junit.Assert.fail(Assert.java:88)
	at org.junit.Assert.failNotEquals(Assert.java:743)
	at org.junit.Assert.assertEquals(Assert.java:118)
	at org.apache.hadoop.yarn.server.resourcemanager.MockRM.waitForState(MockRM.java:134)
	at org.apache.hadoop.yarn.server.resourcemanager.MockRM.submitApp(MockRM.java:422)
	at org.apache.hadoop.yarn.server.resourcemanager.MockRM.submitApp(MockRM.java:314)
	at org.apache.hadoop.yarn.server.resourcemanager.MockRM.submitApp(MockRM.java:306)
	at org.apache.hadoop.yarn.server.resourcemanager.MockRM.submitApp(MockRM.java:297)
	at org.apache.hadoop.yarn.server.resourcemanager.MockRM.submitApp(MockRM.java:290)
	at org.apache.hadoop.yarn.server.resourcemanager.MockRM.submitApp(MockRM.java:259)
	at org.apache.hadoop.yarn.server.resourcemanager.MockRM.submitApp(MockRM.java:247)
	at org.apache.hadoop.yarn.server.resourcemanager.MockRM.submitApp(MockRM.java:242)
	at org.apache.hadoop.yarn.server.resourcemanager.TestFifoScheduler.testMinimumAllocation(TestFifoScheduler.java:263)
	at org.apache.hadoop.yarn.server.resourcemanager.TestFifoScheduler.testDefaultMinimumAllocation(TestFifoScheduler.java:284)


FAILED:  org.apache.hadoop.yarn.server.resourcemanager.TestFifoScheduler.testNonDefaultMinimumAllocation

Error Message:
App state is not correct (timedout) expected:<ACCEPTED> but was:<NEW>

Stack Trace:
java.lang.AssertionError: App state is not correct (timedout) expected:<ACCEPTED> but was:<NEW>
	at org.junit.Assert.fail(Assert.java:88)
	at org.junit.Assert.failNotEquals(Assert.java:743)
	at org.junit.Assert.assertEquals(Assert.java:118)
	at org.apache.hadoop.yarn.server.resourcemanager.MockRM.waitForState(MockRM.java:134)
	at org.apache.hadoop.yarn.server.resourcemanager.MockRM.submitApp(MockRM.java:422)
	at org.apache.hadoop.yarn.server.resourcemanager.MockRM.submitApp(MockRM.java:314)
	at org.apache.hadoop.yarn.server.resourcemanager.MockRM.submitApp(MockRM.java:306)
	at org.apache.hadoop.yarn.server.resourcemanager.MockRM.submitApp(MockRM.java:297)
	at org.apache.hadoop.yarn.server.resourcemanager.MockRM.submitApp(MockRM.java:290)
	at org.apache.hadoop.yarn.server.resourcemanager.MockRM.submitApp(MockRM.java:259)
	at org.apache.hadoop.yarn.server.resourcemanager.MockRM.submitApp(MockRM.java:247)
	at org.apache.hadoop.yarn.server.resourcemanager.MockRM.submitApp(MockRM.java:242)
	at org.apache.hadoop.yarn.server.resourcemanager.TestFifoScheduler.testMinimumAllocation(TestFifoScheduler.java:263)
	at org.apache.hadoop.yarn.server.resourcemanager.TestFifoScheduler.testNonDefaultMinimumAllocation(TestFifoScheduler.java:298)


FAILED:  org.apache.hadoop.yarn.server.resourcemanager.TestRMHA.testFailoverClearsRMContext

Error Message:
App state is not correct (timedout) expected:<ACCEPTED> but was:<NEW>

Stack Trace:
java.lang.AssertionError: App state is not correct (timedout) expected:<ACCEPTED> but was:<NEW>
	at org.junit.Assert.fail(Assert.java:88)
	at org.junit.Assert.failNotEquals(Assert.java:743)
	at org.junit.Assert.assertEquals(Assert.java:118)
	at org.apache.hadoop.yarn.server.resourcemanager.MockRM.waitForState(MockRM.java:134)
	at org.apache.hadoop.yarn.server.resourcemanager.MockRM.submitApp(MockRM.java:422)
	at org.apache.hadoop.yarn.server.resourcemanager.MockRM.submitApp(MockRM.java:314)
	at org.apache.hadoop.yarn.server.resourcemanager.MockRM.submitApp(MockRM.java:306)
	at org.apache.hadoop.yarn.server.resourcemanager.MockRM.submitApp(MockRM.java:297)
	at org.apache.hadoop.yarn.server.resourcemanager.MockRM.submitApp(MockRM.java:290)
	at org.apache.hadoop.yarn.server.resourcemanager.MockRM.submitApp(MockRM.java:259)
	at org.apache.hadoop.yarn.server.resourcemanager.MockRM.submitApp(MockRM.java:247)
	at org.apache.hadoop.yarn.server.resourcemanager.MockRM.submitApp(MockRM.java:242)
	at org.apache.hadoop.yarn.server.resourcemanager.TestRMHA.checkActiveRMFunctionality(TestRMHA.java:135)
	at org.apache.hadoop.yarn.server.resourcemanager.TestRMHA.testFailoverClearsRMContext(TestRMHA.java:541)


FAILED:  org.apache.hadoop.yarn.server.resourcemanager.TestRMHA.testTransitionsWhenAutomaticFailoverEnabled

Error Message:
App state is not correct (timedout) expected:<ACCEPTED> but was:<NEW>

Stack Trace:
java.lang.AssertionError: App state is not correct (timedout) expected:<ACCEPTED> but was:<NEW>
	at org.junit.Assert.fail(Assert.java:88)
	at org.junit.Assert.failNotEquals(Assert.java:743)
	at org.junit.Assert.assertEquals(Assert.java:118)
	at org.apache.hadoop.yarn.server.resourcemanager.MockRM.waitForState(MockRM.java:134)
	at org.apache.hadoop.yarn.server.resourcemanager.MockRM.submitApp(MockRM.java:422)
	at org.apache.hadoop.yarn.server.resourcemanager.MockRM.submitApp(MockRM.java:314)
	at org.apache.hadoop.yarn.server.resourcemanager.MockRM.submitApp(MockRM.java:306)
	at org.apache.hadoop.yarn.server.resourcemanager.MockRM.submitApp(MockRM.java:297)
	at org.apache.hadoop.yarn.server.resourcemanager.MockRM.submitApp(MockRM.java:290)
	at org.apache.hadoop.yarn.server.resourcemanager.MockRM.submitApp(MockRM.java:259)
	at org.apache.hadoop.yarn.server.resourcemanager.MockRM.submitApp(MockRM.java:247)
	at org.apache.hadoop.yarn.server.resourcemanager.MockRM.submitApp(MockRM.java:242)
	at org.apache.hadoop.yarn.server.resourcemanager.TestRMHA.checkActiveRMFunctionality(TestRMHA.java:135)
	at org.apache.hadoop.yarn.server.resourcemanager.TestRMHA.testTransitionsWhenAutomaticFailoverEnabled(TestRMHA.java:300)


FAILED:  org.apache.hadoop.yarn.server.resourcemanager.TestRMHA.testFailoverWhenTransitionToActiveThrowException

Error Message:
test timed out after 30000 milliseconds

Stack Trace:
java.lang.Exception: test timed out after 30000 milliseconds
	at java.lang.Thread.sleep(Native Method)
	at org.apache.hadoop.yarn.server.resourcemanager.MockRM.waitForState(MockRM.java:131)
	at org.apache.hadoop.yarn.server.resourcemanager.MockRM.submitApp(MockRM.java:422)
	at org.apache.hadoop.yarn.server.resourcemanager.MockRM.submitApp(MockRM.java:314)
	at org.apache.hadoop.yarn.server.resourcemanager.MockRM.submitApp(MockRM.java:306)
	at org.apache.hadoop.yarn.server.resourcemanager.MockRM.submitApp(MockRM.java:297)
	at org.apache.hadoop.yarn.server.resourcemanager.MockRM.submitApp(MockRM.java:290)
	at org.apache.hadoop.yarn.server.resourcemanager.MockRM.submitApp(MockRM.java:259)
	at org.apache.hadoop.yarn.server.resourcemanager.MockRM.submitApp(MockRM.java:247)
	at org.apache.hadoop.yarn.server.resourcemanager.MockRM.submitApp(MockRM.java:242)
	at org.apache.hadoop.yarn.server.resourcemanager.TestRMHA.checkActiveRMFunctionality(TestRMHA.java:135)
	at org.apache.hadoop.yarn.server.resourcemanager.TestRMHA.testFailoverWhenTransitionToActiveThrowException(TestRMHA.java:453)


FAILED:  org.apache.hadoop.yarn.server.resourcemanager.TestRMHA.testFailoverAndTransitions

Error Message:
test timed out after 30000 milliseconds

Stack Trace:
java.lang.Exception: test timed out after 30000 milliseconds
	at java.lang.Thread.sleep(Native Method)
	at org.apache.hadoop.yarn.server.resourcemanager.MockRM.waitForState(MockRM.java:131)
	at org.apache.hadoop.yarn.server.resourcemanager.MockRM.submitApp(MockRM.java:422)
	at org.apache.hadoop.yarn.server.resourcemanager.MockRM.submitApp(MockRM.java:314)
	at org.apache.hadoop.yarn.server.resourcemanager.MockRM.submitApp(MockRM.java:306)
	at org.apache.hadoop.yarn.server.resourcemanager.MockRM.submitApp(MockRM.java:297)
	at org.apache.hadoop.yarn.server.resourcemanager.MockRM.submitApp(MockRM.java:290)
	at org.apache.hadoop.yarn.server.resourcemanager.MockRM.submitApp(MockRM.java:259)
	at org.apache.hadoop.yarn.server.resourcemanager.MockRM.submitApp(MockRM.java:247)
	at org.apache.hadoop.yarn.server.resourcemanager.MockRM.submitApp(MockRM.java:242)
	at org.apache.hadoop.yarn.server.resourcemanager.TestRMHA.checkActiveRMFunctionality(TestRMHA.java:135)
	at org.apache.hadoop.yarn.server.resourcemanager.TestRMHA.testFailoverAndTransitions(TestRMHA.java:212)


FAILED:  org.apache.hadoop.yarn.server.resourcemanager.TestSubmitApplicationWithRMHA.testHandleRMHAafterSubmitApplicationCallWithSavedApplicationState

Error Message:
App state is not correct (timedout) expected:<ACCEPTED> but was:<NEW>

Stack Trace:
java.lang.AssertionError: App state is not correct (timedout) expected:<ACCEPTED> but was:<NEW>
	at org.junit.Assert.fail(Assert.java:88)
	at org.junit.Assert.failNotEquals(Assert.java:743)
	at org.junit.Assert.assertEquals(Assert.java:118)
	at org.apache.hadoop.yarn.server.resourcemanager.MockRM.waitForState(MockRM.java:134)
	at org.apache.hadoop.yarn.server.resourcemanager.MockRM.submitApp(MockRM.java:422)
	at org.apache.hadoop.yarn.server.resourcemanager.MockRM.submitApp(MockRM.java:314)
	at org.apache.hadoop.yarn.server.resourcemanager.MockRM.submitApp(MockRM.java:306)
	at org.apache.hadoop.yarn.server.resourcemanager.MockRM.submitApp(MockRM.java:297)
	at org.apache.hadoop.yarn.server.resourcemanager.MockRM.submitApp(MockRM.java:290)
	at org.apache.hadoop.yarn.server.resourcemanager.MockRM.submitApp(MockRM.java:259)
	at org.apache.hadoop.yarn.server.resourcemanager.MockRM.submitApp(MockRM.java:247)
	at org.apache.hadoop.yarn.server.resourcemanager.MockRM.submitApp(MockRM.java:242)
	at org.apache.hadoop.yarn.server.resourcemanager.TestSubmitApplicationWithRMHA.testHandleRMHAafterSubmitApplicationCallWithSavedApplicationState(TestSubmitApplicationWithRMHA.java:109)


FAILED:  org.apache.hadoop.yarn.server.resourcemanager.TestSubmitApplicationWithRMHA.testHandleRMHADuringSubmitApplicationCallWithSavedApplicationState

Error Message:
test timed out after 5000 milliseconds

Stack Trace:
java.lang.Exception: test timed out after 5000 milliseconds
	at java.lang.Thread.sleep(Native Method)
	at org.apache.hadoop.yarn.server.resourcemanager.MockRM.waitForState(MockRM.java:131)
	at org.apache.hadoop.yarn.server.resourcemanager.MockRM.submitApp(MockRM.java:422)
	at org.apache.hadoop.yarn.server.resourcemanager.MockRM.submitApp(MockRM.java:314)
	at org.apache.hadoop.yarn.server.resourcemanager.MockRM.submitApp(MockRM.java:306)
	at org.apache.hadoop.yarn.server.resourcemanager.MockRM.submitApp(MockRM.java:297)
	at org.apache.hadoop.yarn.server.resourcemanager.MockRM.submitApp(MockRM.java:290)
	at org.apache.hadoop.yarn.server.resourcemanager.MockRM.submitApp(MockRM.java:259)
	at org.apache.hadoop.yarn.server.resourcemanager.MockRM.submitApp(MockRM.java:247)
	at org.apache.hadoop.yarn.server.resourcemanager.MockRM.submitApp(MockRM.java:242)
	at org.apache.hadoop.yarn.server.resourcemanager.TestSubmitApplicationWithRMHA.testHandleRMHADuringSubmitApplicationCallWithSavedApplicationState(TestSubmitApplicationWithRMHA.java:238)


FAILED:  org.apache.hadoop.yarn.server.resourcemanager.TestSubmitApplicationWithRMHA.testHandleRMHAafterSubmitApplicationCallWithoutSavedApplicationState

Error Message:
null

Stack Trace:
java.lang.AssertionError: null
	at org.junit.Assert.fail(Assert.java:86)
	at org.junit.Assert.assertTrue(Assert.java:41)
	at org.junit.Assert.assertTrue(Assert.java:52)
	at org.apache.hadoop.yarn.server.resourcemanager.TestSubmitApplicationWithRMHA.verifySubmitApp(TestSubmitApplicationWithRMHA.java:88)
	at org.apache.hadoop.yarn.server.resourcemanager.TestSubmitApplicationWithRMHA.testHandleRMHAafterSubmitApplicationCallWithoutSavedApplicationState(TestSubmitApplicationWithRMHA.java:172)


FAILED:  org.apache.hadoop.yarn.server.resourcemanager.TestSubmitApplicationWithRMHA.testHandleRMHABeforeSubmitApplicationCallWithSavedApplicationState

Error Message:
null

Stack Trace:
java.lang.AssertionError: null
	at org.junit.Assert.fail(Assert.java:86)
	at org.junit.Assert.assertTrue(Assert.java:41)
	at org.junit.Assert.assertTrue(Assert.java:52)
	at org.apache.hadoop.yarn.server.resourcemanager.TestSubmitApplicationWithRMHA.verifySubmitApp(TestSubmitApplicationWithRMHA.java:88)
	at org.apache.hadoop.yarn.server.resourcemanager.TestSubmitApplicationWithRMHA.testHandleRMHABeforeSubmitApplicationCallWithSavedApplicationState(TestSubmitApplicationWithRMHA.java:63)


FAILED:  org.apache.hadoop.yarn.server.resourcemanager.TestSubmitApplicationWithRMHA.testHandleRMHADuringSubmitApplicationCallWithoutSavedApplicationState

Error Message:
null

Stack Trace:
java.lang.AssertionError: null
	at org.junit.Assert.fail(Assert.java:86)
	at org.junit.Assert.assertTrue(Assert.java:41)
	at org.junit.Assert.assertTrue(Assert.java:52)
	at org.apache.hadoop.yarn.server.resourcemanager.TestSubmitApplicationWithRMHA.verifySubmitApp(TestSubmitApplicationWithRMHA.java:88)
	at org.apache.hadoop.yarn.server.resourcemanager.TestSubmitApplicationWithRMHA.testHandleRMHADuringSubmitApplicationCallWithoutSavedApplicationState(TestSubmitApplicationWithRMHA.java:303)


FAILED:  org.apache.hadoop.yarn.server.resourcemanager.TestSubmitApplicationWithRMHA.testGetApplicationReportIdempotent

Error Message:
App state is not correct (timedout) expected:<ACCEPTED> but was:<NEW>

Stack Trace:
java.lang.AssertionError: App state is not correct (timedout) expected:<ACCEPTED> but was:<NEW>
	at org.junit.Assert.fail(Assert.java:88)
	at org.junit.Assert.failNotEquals(Assert.java:743)
	at org.junit.Assert.assertEquals(Assert.java:118)
	at org.apache.hadoop.yarn.server.resourcemanager.MockRM.waitForState(MockRM.java:134)
	at org.apache.hadoop.yarn.server.resourcemanager.MockRM.submitApp(MockRM.java:422)
	at org.apache.hadoop.yarn.server.resourcemanager.MockRM.submitApp(MockRM.java:314)
	at org.apache.hadoop.yarn.server.resourcemanager.MockRM.submitApp(MockRM.java:306)
	at org.apache.hadoop.yarn.server.resourcemanager.MockRM.submitApp(MockRM.java:297)
	at org.apache.hadoop.yarn.server.resourcemanager.MockRM.submitApp(MockRM.java:290)
	at org.apache.hadoop.yarn.server.resourcemanager.MockRM.submitApp(MockRM.java:259)
	at org.apache.hadoop.yarn.server.resourcemanager.MockRM.submitApp(MockRM.java:247)
	at org.apache.hadoop.yarn.server.resourcemanager.MockRM.submitApp(MockRM.java:242)
	at org.apache.hadoop.yarn.server.resourcemanager.TestSubmitApplicationWithRMHA.testGetApplicationReportIdempotent(TestSubmitApplicationWithRMHA.java:186)


FAILED:  org.apache.hadoop.yarn.server.resourcemanager.TestWorkPreservingRMRestart.testCapacitySchedulerRecovery[0]

Error Message:
test timed out after 30000 milliseconds

Stack Trace:
java.lang.Exception: test timed out after 30000 milliseconds
	at java.lang.Thread.sleep(Native Method)
	at org.apache.hadoop.yarn.server.resourcemanager.MockRM.waitForState(MockRM.java:131)
	at org.apache.hadoop.yarn.server.resourcemanager.MockRM.submitApp(MockRM.java:422)
	at org.apache.hadoop.yarn.server.resourcemanager.MockRM.submitApp(MockRM.java:314)
	at org.apache.hadoop.yarn.server.resourcemanager.MockRM.submitApp(MockRM.java:306)
	at org.apache.hadoop.yarn.server.resourcemanager.MockRM.submitApp(MockRM.java:297)
	at org.apache.hadoop.yarn.server.resourcemanager.MockRM.submitApp(MockRM.java:290)
	at org.apache.hadoop.yarn.server.resourcemanager.MockRM.submitApp(MockRM.java:273)
	at org.apache.hadoop.yarn.server.resourcemanager.TestWorkPreservingRMRestart.testCapacitySchedulerRecovery(TestWorkPreservingRMRestart.java:431)


FAILED:  org.apache.hadoop.yarn.server.resourcemanager.TestWorkPreservingRMRestart.testAppReregisterOnRMWorkPreservingRestart[0]

Error Message:
App state is not correct (timedout) expected:<ACCEPTED> but was:<NEW>

Stack Trace:
java.lang.AssertionError: App state is not correct (timedout) expected:<ACCEPTED> but was:<NEW>
	at org.junit.Assert.fail(Assert.java:88)
	at org.junit.Assert.failNotEquals(Assert.java:743)
	at org.junit.Assert.assertEquals(Assert.java:118)
	at org.apache.hadoop.yarn.server.resourcemanager.MockRM.waitForState(MockRM.java:134)
	at org.apache.hadoop.yarn.server.resourcemanager.MockRM.submitApp(MockRM.java:422)
	at org.apache.hadoop.yarn.server.resourcemanager.MockRM.submitApp(MockRM.java:314)
	at org.apache.hadoop.yarn.server.resourcemanager.MockRM.submitApp(MockRM.java:306)
	at org.apache.hadoop.yarn.server.resourcemanager.MockRM.submitApp(MockRM.java:297)
	at org.apache.hadoop.yarn.server.resourcemanager.MockRM.submitApp(MockRM.java:290)
	at org.apache.hadoop.yarn.server.resourcemanager.MockRM.submitApp(MockRM.java:259)
	at org.apache.hadoop.yarn.server.resourcemanager.MockRM.submitApp(MockRM.java:247)
	at org.apache.hadoop.yarn.server.resourcemanager.MockRM.submitApp(MockRM.java:242)
	at org.apache.hadoop.yarn.server.resourcemanager.TestWorkPreservingRMRestart.testAppReregisterOnRMWorkPreservingRestart(TestWorkPreservingRMRestart.java:693)


FAILED:  org.apache.hadoop.yarn.server.resourcemanager.TestWorkPreservingRMRestart.testCapacitySchedulerQueueRemovedRecovery[0]

Error Message:
test timed out after 30000 milliseconds

Stack Trace:
java.lang.Exception: test timed out after 30000 milliseconds
	at java.lang.Thread.sleep(Native Method)
	at org.apache.hadoop.yarn.server.resourcemanager.MockRM.waitForState(MockRM.java:131)
	at org.apache.hadoop.yarn.server.resourcemanager.MockRM.submitApp(MockRM.java:422)
	at org.apache.hadoop.yarn.server.resourcemanager.MockRM.submitApp(MockRM.java:314)
	at org.apache.hadoop.yarn.server.resourcemanager.MockRM.submitApp(MockRM.java:306)
	at org.apache.hadoop.yarn.server.resourcemanager.MockRM.submitApp(MockRM.java:297)
	at org.apache.hadoop.yarn.server.resourcemanager.MockRM.submitApp(MockRM.java:290)
	at org.apache.hadoop.yarn.server.resourcemanager.MockRM.submitApp(MockRM.java:273)
	at org.apache.hadoop.yarn.server.resourcemanager.TestWorkPreservingRMRestart.testCapacitySchedulerQueueRemovedRecovery(TestWorkPreservingRMRestart.java:550)


FAILED:  org.apache.hadoop.yarn.server.resourcemanager.TestWorkPreservingRMRestart.testAMfailedBetweenRMRestart[0]

Error Message:
test timed out after 20000 milliseconds

Stack Trace:
java.lang.Exception: test timed out after 20000 milliseconds
	at java.lang.Thread.sleep(Native Method)
	at org.apache.hadoop.yarn.server.resourcemanager.MockRM.waitForState(MockRM.java:131)
	at org.apache.hadoop.yarn.server.resourcemanager.MockRM.submitApp(MockRM.java:422)
	at org.apache.hadoop.yarn.server.resourcemanager.MockRM.submitApp(MockRM.java:314)
	at org.apache.hadoop.yarn.server.resourcemanager.MockRM.submitApp(MockRM.java:306)
	at org.apache.hadoop.yarn.server.resourcemanager.MockRM.submitApp(MockRM.java:297)
	at org.apache.hadoop.yarn.server.resourcemanager.MockRM.submitApp(MockRM.java:290)
	at org.apache.hadoop.yarn.server.resourcemanager.MockRM.submitApp(MockRM.java:259)
	at org.apache.hadoop.yarn.server.resourcemanager.MockRM.submitApp(MockRM.java:247)
	at org.apache.hadoop.yarn.server.resourcemanager.MockRM.submitApp(MockRM.java:242)
	at org.apache.hadoop.yarn.server.resourcemanager.TestWorkPreservingRMRestart.testAMfailedBetweenRMRestart(TestWorkPreservingRMRestart.java:596)


FAILED:  org.apache.hadoop.yarn.server.resourcemanager.TestWorkPreservingRMRestart.testRetriedFinishApplicationMasterRequest[0]

Error Message:
test timed out after 20000 milliseconds

Stack Trace:
java.lang.Exception: test timed out after 20000 milliseconds
	at java.lang.Thread.sleep(Native Method)
	at org.apache.hadoop.yarn.server.resourcemanager.MockRM.waitForState(MockRM.java:131)
	at org.apache.hadoop.yarn.server.resourcemanager.MockRM.submitApp(MockRM.java:422)
	at org.apache.hadoop.yarn.server.resourcemanager.MockRM.submitApp(MockRM.java:314)
	at org.apache.hadoop.yarn.server.resourcemanager.MockRM.submitApp(MockRM.java:306)
	at org.apache.hadoop.yarn.server.resourcemanager.MockRM.submitApp(MockRM.java:297)
	at org.apache.hadoop.yarn.server.resourcemanager.MockRM.submitApp(MockRM.java:290)
	at org.apache.hadoop.yarn.server.resourcemanager.MockRM.submitApp(MockRM.java:259)
	at org.apache.hadoop.yarn.server.resourcemanager.MockRM.submitApp(MockRM.java:247)
	at org.apache.hadoop.yarn.server.resourcemanager.MockRM.submitApp(MockRM.java:242)
	at org.apache.hadoop.yarn.server.resourcemanager.TestWorkPreservingRMRestart.testRetriedFinishApplicationMasterRequest(TestWorkPreservingRMRestart.java:948)


FAILED:  org.apache.hadoop.yarn.server.resourcemanager.TestWorkPreservingRMRestart.testContainersNotRecoveredForCompletedApps[0]

Error Message:
test timed out after 20000 milliseconds

Stack Trace:
java.lang.Exception: test timed out after 20000 milliseconds
	at java.lang.Thread.sleep(Native Method)
	at org.apache.hadoop.yarn.server.resourcemanager.MockRM.waitForState(MockRM.java:131)
	at org.apache.hadoop.yarn.server.resourcemanager.MockRM.submitApp(MockRM.java:422)
	at org.apache.hadoop.yarn.server.resourcemanager.MockRM.submitApp(MockRM.java:314)
	at org.apache.hadoop.yarn.server.resourcemanager.MockRM.submitApp(MockRM.java:306)
	at org.apache.hadoop.yarn.server.resourcemanager.MockRM.submitApp(MockRM.java:297)
	at org.apache.hadoop.yarn.server.resourcemanager.MockRM.submitApp(MockRM.java:290)
	at org.apache.hadoop.yarn.server.resourcemanager.MockRM.submitApp(MockRM.java:259)
	at org.apache.hadoop.yarn.server.resourcemanager.MockRM.submitApp(MockRM.java:247)
	at org.apache.hadoop.yarn.server.resourcemanager.MockRM.submitApp(MockRM.java:242)
	at org.apache.hadoop.yarn.server.resourcemanager.TestWorkPreservingRMRestart.testContainersNotRecoveredForCompletedApps(TestWorkPreservingRMRestart.java:650)


FAILED:  org.apache.hadoop.yarn.server.resourcemanager.TestWorkPreservingRMRestart.testRecoverSchedulerAppAndAttemptSynchronously[0]

Error Message:
test timed out after 20000 milliseconds

Stack Trace:
java.lang.Exception: test timed out after 20000 milliseconds
	at java.lang.Thread.sleep(Native Method)
	at org.apache.hadoop.yarn.server.resourcemanager.MockRM.waitForState(MockRM.java:131)
	at org.apache.hadoop.yarn.server.resourcemanager.MockRM.submitApp(MockRM.java:422)
	at org.apache.hadoop.yarn.server.resourcemanager.MockRM.submitApp(MockRM.java:314)
	at org.apache.hadoop.yarn.server.resourcemanager.MockRM.submitApp(MockRM.java:306)
	at org.apache.hadoop.yarn.server.resourcemanager.MockRM.submitApp(MockRM.java:297)
	at org.apache.hadoop.yarn.server.resourcemanager.MockRM.submitApp(MockRM.java:290)
	at org.apache.hadoop.yarn.server.resourcemanager.MockRM.submitApp(MockRM.java:259)
	at org.apache.hadoop.yarn.server.resourcemanager.MockRM.submitApp(MockRM.java:247)
	at org.apache.hadoop.yarn.server.resourcemanager.MockRM.submitApp(MockRM.java:242)
	at org.apache.hadoop.yarn.server.resourcemanager.TestWorkPreservingRMRestart.testRecoverSchedulerAppAndAttemptSynchronously(TestWorkPreservingRMRestart.java:761)


FAILED:  org.apache.hadoop.yarn.server.resourcemanager.TestWorkPreservingRMRestart.testReleasedContainerNotRecovered[0]

Error Message:
test timed out after 50000 milliseconds

Stack Trace:
java.lang.Exception: test timed out after 50000 milliseconds
	at java.lang.Thread.sleep(Native Method)
	at org.apache.hadoop.yarn.server.resourcemanager.MockRM.waitForState(MockRM.java:131)
	at org.apache.hadoop.yarn.server.resourcemanager.MockRM.submitApp(MockRM.java:422)
	at org.apache.hadoop.yarn.server.resourcemanager.MockRM.submitApp(MockRM.java:314)
	at org.apache.hadoop.yarn.server.resourcemanager.MockRM.submitApp(MockRM.java:306)
	at org.apache.hadoop.yarn.server.resourcemanager.MockRM.submitApp(MockRM.java:297)
	at org.apache.hadoop.yarn.server.resourcemanager.MockRM.submitApp(MockRM.java:290)
	at org.apache.hadoop.yarn.server.resourcemanager.MockRM.submitApp(MockRM.java:259)
	at org.apache.hadoop.yarn.server.resourcemanager.MockRM.submitApp(MockRM.java:247)
	at org.apache.hadoop.yarn.server.resourcemanager.MockRM.submitApp(MockRM.java:242)
	at org.apache.hadoop.yarn.server.resourcemanager.TestWorkPreservingRMRestart.testReleasedContainerNotRecovered(TestWorkPreservingRMRestart.java:792)


FAILED:  org.apache.hadoop.yarn.server.resourcemanager.TestWorkPreservingRMRestart.testAppFailedToRenewTokenOnRecovery[0]

Error Message:
test timed out after 30000 milliseconds

Stack Trace:
java.lang.Exception: test timed out after 30000 milliseconds
	at java.lang.Thread.sleep(Native Method)
	at org.apache.hadoop.yarn.server.resourcemanager.MockRM.waitForState(MockRM.java:131)
	at org.apache.hadoop.yarn.server.resourcemanager.MockRM.submitApp(MockRM.java:422)
	at org.apache.hadoop.yarn.server.resourcemanager.MockRM.submitApp(MockRM.java:314)
	at org.apache.hadoop.yarn.server.resourcemanager.MockRM.submitApp(MockRM.java:306)
	at org.apache.hadoop.yarn.server.resourcemanager.MockRM.submitApp(MockRM.java:297)
	at org.apache.hadoop.yarn.server.resourcemanager.MockRM.submitApp(MockRM.java:290)
	at org.apache.hadoop.yarn.server.resourcemanager.MockRM.submitApp(MockRM.java:259)
	at org.apache.hadoop.yarn.server.resourcemanager.MockRM.submitApp(MockRM.java:247)
	at org.apache.hadoop.yarn.server.resourcemanager.MockRM.submitApp(MockRM.java:242)
	at org.apache.hadoop.yarn.server.resourcemanager.TestWorkPreservingRMRestart.testAppFailedToRenewTokenOnRecovery(TestWorkPreservingRMRestart.java:981)


FAILED:  org.apache.hadoop.yarn.server.resourcemanager.TestWorkPreservingRMRestart.testNewContainersNotAllocatedDuringSchedulerRecovery[0]

Error Message:
test timed out after 20000 milliseconds

Stack Trace:
java.lang.Exception: test timed out after 20000 milliseconds
	at java.lang.Thread.sleep(Native Method)
	at org.apache.hadoop.yarn.server.resourcemanager.MockRM.waitForState(MockRM.java:131)
	at org.apache.hadoop.yarn.server.resourcemanager.MockRM.submitApp(MockRM.java:422)
	at org.apache.hadoop.yarn.server.resourcemanager.MockRM.submitApp(MockRM.java:314)
	at org.apache.hadoop.yarn.server.resourcemanager.MockRM.submitApp(MockRM.java:306)
	at org.apache.hadoop.yarn.server.resourcemanager.MockRM.submitApp(MockRM.java:297)
	at org.apache.hadoop.yarn.server.resourcemanager.MockRM.submitApp(MockRM.java:290)
	at org.apache.hadoop.yarn.server.resourcemanager.MockRM.submitApp(MockRM.java:259)
	at org.apache.hadoop.yarn.server.resourcemanager.MockRM.submitApp(MockRM.java:247)
	at org.apache.hadoop.yarn.server.resourcemanager.MockRM.submitApp(MockRM.java:242)
	at org.apache.hadoop.yarn.server.resourcemanager.TestWorkPreservingRMRestart.testNewContainersNotAllocatedDuringSchedulerRecovery(TestWorkPreservingRMRestart.java:890)


FAILED:  org.apache.hadoop.yarn.server.resourcemanager.TestWorkPreservingRMRestart.testSchedulerRecovery[0]

Error Message:
test timed out after 20000 milliseconds

Stack Trace:
java.lang.Exception: test timed out after 20000 milliseconds
	at java.lang.Thread.sleep(Native Method)
	at org.apache.hadoop.yarn.server.resourcemanager.MockRM.waitForState(MockRM.java:131)
	at org.apache.hadoop.yarn.server.resourcemanager.MockRM.submitApp(MockRM.java:422)
	at org.apache.hadoop.yarn.server.resourcemanager.MockRM.submitApp(MockRM.java:314)
	at org.apache.hadoop.yarn.server.resourcemanager.MockRM.submitApp(MockRM.java:306)
	at org.apache.hadoop.yarn.server.resourcemanager.MockRM.submitApp(MockRM.java:297)
	at org.apache.hadoop.yarn.server.resourcemanager.MockRM.submitApp(MockRM.java:290)
	at org.apache.hadoop.yarn.server.resourcemanager.MockRM.submitApp(MockRM.java:259)
	at org.apache.hadoop.yarn.server.resourcemanager.MockRM.submitApp(MockRM.java:247)
	at org.apache.hadoop.yarn.server.resourcemanager.MockRM.submitApp(MockRM.java:242)
	at org.apache.hadoop.yarn.server.resourcemanager.TestWorkPreservingRMRestart.testSchedulerRecovery(TestWorkPreservingRMRestart.java:157)


FAILED:  org.apache.hadoop.yarn.server.resourcemanager.TestWorkPreservingRMRestart.testAMContainerStatusWithRMRestart[0]

Error Message:
test timed out after 30000 milliseconds

Stack Trace:
java.lang.Exception: test timed out after 30000 milliseconds
	at java.lang.Thread.sleep(Native Method)
	at org.apache.hadoop.yarn.server.resourcemanager.MockRM.waitForState(MockRM.java:131)
	at org.apache.hadoop.yarn.server.resourcemanager.MockRM.submitApp(MockRM.java:422)
	at org.apache.hadoop.yarn.server.resourcemanager.MockRM.submitApp(MockRM.java:314)
	at org.apache.hadoop.yarn.server.resourcemanager.MockRM.submitApp(MockRM.java:306)
	at org.apache.hadoop.yarn.server.resourcemanager.MockRM.submitApp(MockRM.java:297)
	at org.apache.hadoop.yarn.server.resourcemanager.MockRM.submitApp(MockRM.java:290)
	at org.apache.hadoop.yarn.server.resourcemanager.MockRM.submitApp(MockRM.java:259)
	at org.apache.hadoop.yarn.server.resourcemanager.MockRM.submitApp(MockRM.java:247)
	at org.apache.hadoop.yarn.server.resourcemanager.MockRM.submitApp(MockRM.java:242)
	at org.apache.hadoop.yarn.server.resourcemanager.TestWorkPreservingRMRestart.testAMContainerStatusWithRMRestart(TestWorkPreservingRMRestart.java:722)


FAILED:  org.apache.hadoop.yarn.server.resourcemanager.TestWorkPreservingRMRestart.testAppReregisterOnRMWorkPreservingRestart[1]

Error Message:
App state is not correct (timedout) expected:<ACCEPTED> but was:<NEW>

Stack Trace:
java.lang.AssertionError: App state is not correct (timedout) expected:<ACCEPTED> but was:<NEW>
	at org.junit.Assert.fail(Assert.java:88)
	at org.junit.Assert.failNotEquals(Assert.java:743)
	at org.junit.Assert.assertEquals(Assert.java:118)
	at org.apache.hadoop.yarn.server.resourcemanager.MockRM.waitForState(MockRM.java:134)
	at org.apache.hadoop.yarn.server.resourcemanager.MockRM.submitApp(MockRM.java:422)
	at org.apache.hadoop.yarn.server.resourcemanager.MockRM.submitApp(MockRM.java:314)
	at org.apache.hadoop.yarn.server.resourcemanager.MockRM.submitApp(MockRM.java:306)
	at org.apache.hadoop.yarn.server.resourcemanager.MockRM.submitApp(MockRM.java:297)
	at org.apache.hadoop.yarn.server.resourcemanager.MockRM.submitApp(MockRM.java:290)
	at org.apache.hadoop.yarn.server.resourcemanager.MockRM.submitApp(MockRM.java:259)
	at org.apache.hadoop.yarn.server.resourcemanager.MockRM.submitApp(MockRM.java:247)
	at org.apache.hadoop.yarn.server.resourcemanager.MockRM.submitApp(MockRM.java:242)
	at org.apache.hadoop.yarn.server.resourcemanager.TestWorkPreservingRMRestart.testAppReregisterOnRMWorkPreservingRestart(TestWorkPreservingRMRestart.java:693)


FAILED:  org.apache.hadoop.yarn.server.resourcemanager.TestWorkPreservingRMRestart.testAMfailedBetweenRMRestart[1]

Error Message:
test timed out after 20000 milliseconds

Stack Trace:
java.lang.Exception: test timed out after 20000 milliseconds
	at java.lang.Thread.sleep(Native Method)
	at org.apache.hadoop.yarn.server.resourcemanager.MockRM.waitForState(MockRM.java:131)
	at org.apache.hadoop.yarn.server.resourcemanager.MockRM.submitApp(MockRM.java:422)
	at org.apache.hadoop.yarn.server.resourcemanager.MockRM.submitApp(MockRM.java:314)
	at org.apache.hadoop.yarn.server.resourcemanager.MockRM.submitApp(MockRM.java:306)
	at org.apache.hadoop.yarn.server.resourcemanager.MockRM.submitApp(MockRM.java:297)
	at org.apache.hadoop.yarn.server.resourcemanager.MockRM.submitApp(MockRM.java:290)
	at org.apache.hadoop.yarn.server.resourcemanager.MockRM.submitApp(MockRM.java:259)
	at org.apache.hadoop.yarn.server.resourcemanager.MockRM.submitApp(MockRM.java:247)
	at org.apache.hadoop.yarn.server.resourcemanager.MockRM.submitApp(MockRM.java:242)
	at org.apache.hadoop.yarn.server.resourcemanager.TestWorkPreservingRMRestart.testAMfailedBetweenRMRestart(TestWorkPreservingRMRestart.java:596)


FAILED:  org.apache.hadoop.yarn.server.resourcemanager.TestWorkPreservingRMRestart.testRetriedFinishApplicationMasterRequest[1]

Error Message:
test timed out after 20000 milliseconds

Stack Trace:
java.lang.Exception: test timed out after 20000 milliseconds
	at java.lang.Thread.sleep(Native Method)
	at org.apache.hadoop.yarn.server.resourcemanager.MockRM.waitForState(MockRM.java:131)
	at org.apache.hadoop.yarn.server.resourcemanager.MockRM.submitApp(MockRM.java:422)
	at org.apache.hadoop.yarn.server.resourcemanager.MockRM.submitApp(MockRM.java:314)
	at org.apache.hadoop.yarn.server.resourcemanager.MockRM.submitApp(MockRM.java:306)
	at org.apache.hadoop.yarn.server.resourcemanager.MockRM.submitApp(MockRM.java:297)
	at org.apache.hadoop.yarn.server.resourcemanager.MockRM.submitApp(MockRM.java:290)
	at org.apache.hadoop.yarn.server.resourcemanager.MockRM.submitApp(MockRM.java:259)
	at org.apache.hadoop.yarn.server.resourcemanager.MockRM.submitApp(MockRM.java:247)
	at org.apache.hadoop.yarn.server.resourcemanager.MockRM.submitApp(MockRM.java:242)
	at org.apache.hadoop.yarn.server.resourcemanager.TestWorkPreservingRMRestart.testRetriedFinishApplicationMasterRequest(TestWorkPreservingRMRestart.java:948)


FAILED:  org.apache.hadoop.yarn.server.resourcemanager.TestWorkPreservingRMRestart.testContainersNotRecoveredForCompletedApps[1]

Error Message:
test timed out after 20000 milliseconds

Stack Trace:
java.lang.Exception: test timed out after 20000 milliseconds
	at java.lang.Thread.sleep(Native Method)
	at org.apache.hadoop.yarn.server.resourcemanager.MockRM.waitForState(MockRM.java:131)
	at org.apache.hadoop.yarn.server.resourcemanager.MockRM.submitApp(MockRM.java:422)
	at org.apache.hadoop.yarn.server.resourcemanager.MockRM.submitApp(MockRM.java:314)
	at org.apache.hadoop.yarn.server.resourcemanager.MockRM.submitApp(MockRM.java:306)
	at org.apache.hadoop.yarn.server.resourcemanager.MockRM.submitApp(MockRM.java:297)
	at org.apache.hadoop.yarn.server.resourcemanager.MockRM.submitApp(MockRM.java:290)
	at org.apache.hadoop.yarn.server.resourcemanager.MockRM.submitApp(MockRM.java:259)
	at org.apache.hadoop.yarn.server.resourcemanager.MockRM.submitApp(MockRM.java:247)
	at org.apache.hadoop.yarn.server.resourcemanager.MockRM.submitApp(MockRM.java:242)
	at org.apache.hadoop.yarn.server.resourcemanager.TestWorkPreservingRMRestart.testContainersNotRecoveredForCompletedApps(TestWorkPreservingRMRestart.java:650)


FAILED:  org.apache.hadoop.yarn.server.resourcemanager.TestWorkPreservingRMRestart.testRecoverSchedulerAppAndAttemptSynchronously[1]

Error Message:
test timed out after 20000 milliseconds

Stack Trace:
java.lang.Exception: test timed out after 20000 milliseconds
	at java.lang.Thread.sleep(Native Method)
	at org.apache.hadoop.yarn.server.resourcemanager.MockRM.waitForState(MockRM.java:131)
	at org.apache.hadoop.yarn.server.resourcemanager.MockRM.submitApp(MockRM.java:422)
	at org.apache.hadoop.yarn.server.resourcemanager.MockRM.submitApp(MockRM.java:314)
	at org.apache.hadoop.yarn.server.resourcemanager.MockRM.submitApp(MockRM.java:306)
	at org.apache.hadoop.yarn.server.resourcemanager.MockRM.submitApp(MockRM.java:297)
	at org.apache.hadoop.yarn.server.resourcemanager.MockRM.submitApp(MockRM.java:290)
	at org.apache.hadoop.yarn.server.resourcemanager.MockRM.submitApp(MockRM.java:259)
	at org.apache.hadoop.yarn.server.resourcemanager.MockRM.submitApp(MockRM.java:247)
	at org.apache.hadoop.yarn.server.resourcemanager.MockRM.submitApp(MockRM.java:242)
	at org.apache.hadoop.yarn.server.resourcemanager.TestWorkPreservingRMRestart.testRecoverSchedulerAppAndAttemptSynchronously(TestWorkPreservingRMRestart.java:761)


FAILED:  org.apache.hadoop.yarn.server.resourcemanager.TestWorkPreservingRMRestart.testReleasedContainerNotRecovered[1]

Error Message:
test timed out after 50000 milliseconds

Stack Trace:
java.lang.Exception: test timed out after 50000 milliseconds
	at java.lang.Thread.sleep(Native Method)
	at org.apache.hadoop.yarn.server.resourcemanager.MockRM.waitForState(MockRM.java:131)
	at org.apache.hadoop.yarn.server.resourcemanager.MockRM.submitApp(MockRM.java:422)
	at org.apache.hadoop.yarn.server.resourcemanager.MockRM.submitApp(MockRM.java:314)
	at org.apache.hadoop.yarn.server.resourcemanager.MockRM.submitApp(MockRM.java:306)
	at org.apache.hadoop.yarn.server.resourcemanager.MockRM.submitApp(MockRM.java:297)
	at org.apache.hadoop.yarn.server.resourcemanager.MockRM.submitApp(MockRM.java:290)
	at org.apache.hadoop.yarn.server.resourcemanager.MockRM.submitApp(MockRM.java:259)
	at org.apache.hadoop.yarn.server.resourcemanager.MockRM.submitApp(MockRM.java:247)
	at org.apache.hadoop.yarn.server.resourcemanager.MockRM.submitApp(MockRM.java:242)
	at org.apache.hadoop.yarn.server.resourcemanager.TestWorkPreservingRMRestart.testReleasedContainerNotRecovered(TestWorkPreservingRMRestart.java:792)


FAILED:  org.apache.hadoop.yarn.server.resourcemanager.TestWorkPreservingRMRestart.testAppFailedToRenewTokenOnRecovery[1]

Error Message:
test timed out after 30000 milliseconds

Stack Trace:
java.lang.Exception: test timed out after 30000 milliseconds
	at java.lang.Thread.sleep(Native Method)
	at org.apache.hadoop.yarn.server.resourcemanager.MockRM.waitForState(MockRM.java:131)
	at org.apache.hadoop.yarn.server.resourcemanager.MockRM.submitApp(MockRM.java:422)
	at org.apache.hadoop.yarn.server.resourcemanager.MockRM.submitApp(MockRM.java:314)
	at org.apache.hadoop.yarn.server.resourcemanager.MockRM.submitApp(MockRM.java:306)
	at org.apache.hadoop.yarn.server.resourcemanager.MockRM.submitApp(MockRM.java:297)
	at org.apache.hadoop.yarn.server.resourcemanager.MockRM.submitApp(MockRM.java:290)
	at org.apache.hadoop.yarn.server.resourcemanager.MockRM.submitApp(MockRM.java:259)
	at org.apache.hadoop.yarn.server.resourcemanager.MockRM.submitApp(MockRM.java:247)
	at org.apache.hadoop.yarn.server.resourcemanager.MockRM.submitApp(MockRM.java:242)
	at org.apache.hadoop.yarn.server.resourcemanager.TestWorkPreservingRMRestart.testAppFailedToRenewTokenOnRecovery(TestWorkPreservingRMRestart.java:981)


FAILED:  org.apache.hadoop.yarn.server.resourcemanager.TestWorkPreservingRMRestart.testNewContainersNotAllocatedDuringSchedulerRecovery[1]

Error Message:
test timed out after 20000 milliseconds

Stack Trace:
java.lang.Exception: test timed out after 20000 milliseconds
	at java.lang.Thread.sleep(Native Method)
	at org.apache.hadoop.yarn.server.resourcemanager.MockRM.waitForState(MockRM.java:131)
	at org.apache.hadoop.yarn.server.resourcemanager.MockRM.submitApp(MockRM.java:422)
	at org.apache.hadoop.yarn.server.resourcemanager.MockRM.submitApp(MockRM.java:314)
	at org.apache.hadoop.yarn.server.resourcemanager.MockRM.submitApp(MockRM.java:306)
	at org.apache.hadoop.yarn.server.resourcemanager.MockRM.submitApp(MockRM.java:297)
	at org.apache.hadoop.yarn.server.resourcemanager.MockRM.submitApp(MockRM.java:290)
	at org.apache.hadoop.yarn.server.resourcemanager.MockRM.submitApp(MockRM.java:259)
	at org.apache.hadoop.yarn.server.resourcemanager.MockRM.submitApp(MockRM.java:247)
	at org.apache.hadoop.yarn.server.resourcemanager.MockRM.submitApp(MockRM.java:242)
	at org.apache.hadoop.yarn.server.resourcemanager.TestWorkPreservingRMRestart.testNewContainersNotAllocatedDuringSchedulerRecovery(TestWorkPreservingRMRestart.java:890)


FAILED:  org.apache.hadoop.yarn.server.resourcemanager.TestWorkPreservingRMRestart.testSchedulerRecovery[1]

Error Message:
test timed out after 20000 milliseconds

Stack Trace:
java.lang.Exception: test timed out after 20000 milliseconds
	at java.lang.Thread.sleep(Native Method)
	at org.apache.hadoop.yarn.server.resourcemanager.MockRM.waitForState(MockRM.java:131)
	at org.apache.hadoop.yarn.server.resourcemanager.MockRM.submitApp(MockRM.java:422)
	at org.apache.hadoop.yarn.server.resourcemanager.MockRM.submitApp(MockRM.java:314)
	at org.apache.hadoop.yarn.server.resourcemanager.MockRM.submitApp(MockRM.java:306)
	at org.apache.hadoop.yarn.server.resourcemanager.MockRM.submitApp(MockRM.java:297)
	at org.apache.hadoop.yarn.server.resourcemanager.MockRM.submitApp(MockRM.java:290)
	at org.apache.hadoop.yarn.server.resourcemanager.MockRM.submitApp(MockRM.java:259)
	at org.apache.hadoop.yarn.server.resourcemanager.MockRM.submitApp(MockRM.java:247)
	at org.apache.hadoop.yarn.server.resourcemanager.MockRM.submitApp(MockRM.java:242)
	at org.apache.hadoop.yarn.server.resourcemanager.TestWorkPreservingRMRestart.testSchedulerRecovery(TestWorkPreservingRMRestart.java:157)


FAILED:  org.apache.hadoop.yarn.server.resourcemanager.TestWorkPreservingRMRestart.testAMContainerStatusWithRMRestart[1]

Error Message:
test timed out after 30000 milliseconds

Stack Trace:
java.lang.Exception: test timed out after 30000 milliseconds
	at java.lang.Thread.sleep(Native Method)
	at org.apache.hadoop.yarn.server.resourcemanager.MockRM.waitForState(MockRM.java:131)
	at org.apache.hadoop.yarn.server.resourcemanager.MockRM.submitApp(MockRM.java:422)
	at org.apache.hadoop.yarn.server.resourcemanager.MockRM.submitApp(MockRM.java:314)
	at org.apache.hadoop.yarn.server.resourcemanager.MockRM.submitApp(MockRM.java:306)
	at org.apache.hadoop.yarn.server.resourcemanager.MockRM.submitApp(MockRM.java:297)
	at org.apache.hadoop.yarn.server.resourcemanager.MockRM.submitApp(MockRM.java:290)
	at org.apache.hadoop.yarn.server.resourcemanager.MockRM.submitApp(MockRM.java:259)
	at org.apache.hadoop.yarn.server.resourcemanager.MockRM.submitApp(MockRM.java:247)
	at org.apache.hadoop.yarn.server.resourcemanager.MockRM.submitApp(MockRM.java:242)
	at org.apache.hadoop.yarn.server.resourcemanager.TestWorkPreservingRMRestart.testAMContainerStatusWithRMRestart(TestWorkPreservingRMRestart.java:722)


FAILED:  org.apache.hadoop.yarn.server.resourcemanager.ahs.TestRMApplicationHistoryWriter.testRMWritingMassiveHistoryForFairSche

Error Message:
App state is not correct (timedout) expected:<ACCEPTED> but was:<NEW>

Stack Trace:
java.lang.AssertionError: App state is not correct (timedout) expected:<ACCEPTED> but was:<NEW>
	at org.junit.Assert.fail(Assert.java:88)
	at org.junit.Assert.failNotEquals(Assert.java:743)
	at org.junit.Assert.assertEquals(Assert.java:118)
	at org.apache.hadoop.yarn.server.resourcemanager.MockRM.waitForState(MockRM.java:134)
	at org.apache.hadoop.yarn.server.resourcemanager.MockRM.submitApp(MockRM.java:422)
	at org.apache.hadoop.yarn.server.resourcemanager.MockRM.submitApp(MockRM.java:314)
	at org.apache.hadoop.yarn.server.resourcemanager.MockRM.submitApp(MockRM.java:306)
	at org.apache.hadoop.yarn.server.resourcemanager.MockRM.submitApp(MockRM.java:297)
	at org.apache.hadoop.yarn.server.resourcemanager.MockRM.submitApp(MockRM.java:290)
	at org.apache.hadoop.yarn.server.resourcemanager.MockRM.submitApp(MockRM.java:259)
	at org.apache.hadoop.yarn.server.resourcemanager.MockRM.submitApp(MockRM.java:247)
	at org.apache.hadoop.yarn.server.resourcemanager.MockRM.submitApp(MockRM.java:242)
	at org.apache.hadoop.yarn.server.resourcemanager.ahs.TestRMApplicationHistoryWriter.testRMWritingMassiveHistory(TestRMApplicationHistoryWriter.java:448)
	at org.apache.hadoop.yarn.server.resourcemanager.ahs.TestRMApplicationHistoryWriter.testRMWritingMassiveHistory(TestRMApplicationHistoryWriter.java:431)
	at org.apache.hadoop.yarn.server.resourcemanager.ahs.TestRMApplicationHistoryWriter.testRMWritingMassiveHistoryForFairSche(TestRMApplicationHistoryWriter.java:377)


FAILED:  org.apache.hadoop.yarn.server.resourcemanager.ahs.TestRMApplicationHistoryWriter.testRMWritingMassiveHistoryForCapacitySche

Error Message:
App state is not correct (timedout) expected:<ACCEPTED> but was:<NEW>

Stack Trace:
java.lang.AssertionError: App state is not correct (timedout) expected:<ACCEPTED> but was:<NEW>
	at org.junit.Assert.fail(Assert.java:88)
	at org.junit.Assert.failNotEquals(Assert.java:743)
	at org.junit.Assert.assertEquals(Assert.java:118)
	at org.apache.hadoop.yarn.server.resourcemanager.MockRM.waitForState(MockRM.java:134)
	at org.apache.hadoop.yarn.server.resourcemanager.MockRM.submitApp(MockRM.java:422)
	at org.apache.hadoop.yarn.server.resourcemanager.MockRM.submitApp(MockRM.java:314)
	at org.apache.hadoop.yarn.server.resourcemanager.MockRM.submitApp(MockRM.java:306)
	at org.apache.hadoop.yarn.server.resourcemanager.MockRM.submitApp(MockRM.java:297)
	at org.apache.hadoop.yarn.server.resourcemanager.MockRM.submitApp(MockRM.java:290)
	at org.apache.hadoop.yarn.server.resourcemanager.MockRM.submitApp(MockRM.java:259)
	at org.apache.hadoop.yarn.server.resourcemanager.MockRM.submitApp(MockRM.java:247)
	at org.apache.hadoop.yarn.server.resourcemanager.MockRM.submitApp(MockRM.java:242)
	at org.apache.hadoop.yarn.server.resourcemanager.ahs.TestRMApplicationHistoryWriter.testRMWritingMassiveHistory(TestRMApplicationHistoryWriter.java:448)
	at org.apache.hadoop.yarn.server.resourcemanager.ahs.TestRMApplicationHistoryWriter.testRMWritingMassiveHistory(TestRMApplicationHistoryWriter.java:431)
	at org.apache.hadoop.yarn.server.resourcemanager.ahs.TestRMApplicationHistoryWriter.testRMWritingMassiveHistoryForCapacitySche(TestRMApplicationHistoryWriter.java:383)


FAILED:  org.apache.hadoop.yarn.server.resourcemanager.applicationsmanager.TestAMRMRPCNodeUpdates.testAMRMUnusableNodes

Error Message:
App state is not correct (timedout) expected:<ACCEPTED> but was:<NEW>

Stack Trace:
java.lang.AssertionError: App state is not correct (timedout) expected:<ACCEPTED> but was:<NEW>
	at org.junit.Assert.fail(Assert.java:88)
	at org.junit.Assert.failNotEquals(Assert.java:743)
	at org.junit.Assert.assertEquals(Assert.java:118)
	at org.apache.hadoop.yarn.server.resourcemanager.MockRM.waitForState(MockRM.java:134)
	at org.apache.hadoop.yarn.server.resourcemanager.MockRM.submitApp(MockRM.java:422)
	at org.apache.hadoop.yarn.server.resourcemanager.MockRM.submitApp(MockRM.java:314)
	at org.apache.hadoop.yarn.server.resourcemanager.MockRM.submitApp(MockRM.java:306)
	at org.apache.hadoop.yarn.server.resourcemanager.MockRM.submitApp(MockRM.java:297)
	at org.apache.hadoop.yarn.server.resourcemanager.MockRM.submitApp(MockRM.java:290)
	at org.apache.hadoop.yarn.server.resourcemanager.MockRM.submitApp(MockRM.java:259)
	at org.apache.hadoop.yarn.server.resourcemanager.MockRM.submitApp(MockRM.java:247)
	at org.apache.hadoop.yarn.server.resourcemanager.MockRM.submitApp(MockRM.java:242)
	at org.apache.hadoop.yarn.server.resourcemanager.applicationsmanager.TestAMRMRPCNodeUpdates.testAMRMUnusableNodes(TestAMRMRPCNodeUpdates.java:129)


FAILED:  org.apache.hadoop.yarn.server.resourcemanager.applicationsmanager.TestAMRMRPCResponseId.testARRMResponseId

Error Message:
App state is not correct (timedout) expected:<ACCEPTED> but was:<NEW>

Stack Trace:
java.lang.AssertionError: App state is not correct (timedout) expected:<ACCEPTED> but was:<NEW>
	at org.junit.Assert.fail(Assert.java:88)
	at org.junit.Assert.failNotEquals(Assert.java:743)
	at org.junit.Assert.assertEquals(Assert.java:118)
	at org.apache.hadoop.yarn.server.resourcemanager.MockRM.waitForState(MockRM.java:134)
	at org.apache.hadoop.yarn.server.resourcemanager.MockRM.submitApp(MockRM.java:422)
	at org.apache.hadoop.yarn.server.resourcemanager.MockRM.submitApp(MockRM.java:314)
	at org.apache.hadoop.yarn.server.resourcemanager.MockRM.submitApp(MockRM.java:306)
	at org.apache.hadoop.yarn.server.resourcemanager.MockRM.submitApp(MockRM.java:297)
	at org.apache.hadoop.yarn.server.resourcemanager.MockRM.submitApp(MockRM.java:290)
	at org.apache.hadoop.yarn.server.resourcemanager.MockRM.submitApp(MockRM.java:259)
	at org.apache.hadoop.yarn.server.resourcemanager.MockRM.submitApp(MockRM.java:247)
	at org.apache.hadoop.yarn.server.resourcemanager.MockRM.submitApp(MockRM.java:242)
	at org.apache.hadoop.yarn.server.resourcemanager.applicationsmanager.TestAMRMRPCResponseId.testARRMResponseId(TestAMRMRPCResponseId.java:80)


FAILED:  org.apache.hadoop.yarn.server.resourcemanager.applicationsmanager.TestAMRestart.testRMAppAttemptFailuresValidityInterval

Error Message:
test timed out after 50000 milliseconds

Stack Trace:
java.lang.Exception: test timed out after 50000 milliseconds
	at java.lang.Thread.sleep(Native Method)
	at org.apache.hadoop.yarn.server.resourcemanager.MockRM.waitForState(MockRM.java:131)
	at org.apache.hadoop.yarn.server.resourcemanager.MockRM.submitApp(MockRM.java:422)
	at org.apache.hadoop.yarn.server.resourcemanager.MockRM.submitApp(MockRM.java:321)
	at org.apache.hadoop.yarn.server.resourcemanager.applicationsmanager.TestAMRestart.testRMAppAttemptFailuresValidityInterval(TestAMRestart.java:618)


FAILED:  org.apache.hadoop.yarn.server.resourcemanager.applicationsmanager.TestAMRestart.testShouldNotCountFailureToMaxAttemptRetry

Error Message:
App state is not correct (timedout) expected:<ACCEPTED> but was:<NEW>

Stack Trace:
java.lang.AssertionError: App state is not correct (timedout) expected:<ACCEPTED> but was:<NEW>
	at org.junit.Assert.fail(Assert.java:88)
	at org.junit.Assert.failNotEquals(Assert.java:743)
	at org.junit.Assert.assertEquals(Assert.java:118)
	at org.apache.hadoop.yarn.server.resourcemanager.MockRM.waitForState(MockRM.java:134)
	at org.apache.hadoop.yarn.server.resourcemanager.MockRM.submitApp(MockRM.java:422)
	at org.apache.hadoop.yarn.server.resourcemanager.MockRM.submitApp(MockRM.java:314)
	at org.apache.hadoop.yarn.server.resourcemanager.MockRM.submitApp(MockRM.java:306)
	at org.apache.hadoop.yarn.server.resourcemanager.MockRM.submitApp(MockRM.java:297)
	at org.apache.hadoop.yarn.server.resourcemanager.MockRM.submitApp(MockRM.java:290)
	at org.apache.hadoop.yarn.server.resourcemanager.MockRM.submitApp(MockRM.java:259)
	at org.apache.hadoop.yarn.server.resourcemanager.MockRM.submitApp(MockRM.java:247)
	at org.apache.hadoop.yarn.server.resourcemanager.MockRM.submitApp(MockRM.java:242)
	at org.apache.hadoop.yarn.server.resourcemanager.applicationsmanager.TestAMRestart.testShouldNotCountFailureToMaxAttemptRetry(TestAMRestart.java:376)


FAILED:  org.apache.hadoop.yarn.server.resourcemanager.applicationsmanager.TestAMRestart.testRMRestartOrFailoverNotCountedForAMFailures

Error Message:
test timed out after 50000 milliseconds

Stack Trace:
java.lang.Exception: test timed out after 50000 milliseconds
	at java.lang.Thread.sleep(Native Method)
	at org.apache.hadoop.yarn.server.resourcemanager.MockRM.waitForState(MockRM.java:131)
	at org.apache.hadoop.yarn.server.resourcemanager.MockRM.submitApp(MockRM.java:422)
	at org.apache.hadoop.yarn.server.resourcemanager.MockRM.submitApp(MockRM.java:314)
	at org.apache.hadoop.yarn.server.resourcemanager.MockRM.submitApp(MockRM.java:306)
	at org.apache.hadoop.yarn.server.resourcemanager.MockRM.submitApp(MockRM.java:297)
	at org.apache.hadoop.yarn.server.resourcemanager.MockRM.submitApp(MockRM.java:290)
	at org.apache.hadoop.yarn.server.resourcemanager.MockRM.submitApp(MockRM.java:259)
	at org.apache.hadoop.yarn.server.resourcemanager.MockRM.submitApp(MockRM.java:247)
	at org.apache.hadoop.yarn.server.resourcemanager.MockRM.submitApp(MockRM.java:242)
	at org.apache.hadoop.yarn.server.resourcemanager.applicationsmanager.TestAMRestart.testRMRestartOrFailoverNotCountedForAMFailures(TestAMRestart.java:553)


FAILED:  org.apache.hadoop.yarn.server.resourcemanager.applicationsmanager.TestAMRestart.testPreemptedAMRestartOnRMRestart

Error Message:
test timed out after 20000 milliseconds

Stack Trace:
java.lang.Exception: test timed out after 20000 milliseconds
	at java.lang.Thread.sleep(Native Method)
	at org.apache.hadoop.yarn.server.resourcemanager.MockRM.waitForState(MockRM.java:131)
	at org.apache.hadoop.yarn.server.resourcemanager.MockRM.submitApp(MockRM.java:422)
	at org.apache.hadoop.yarn.server.resourcemanager.MockRM.submitApp(MockRM.java:314)
	at org.apache.hadoop.yarn.server.resourcemanager.MockRM.submitApp(MockRM.java:306)
	at org.apache.hadoop.yarn.server.resourcemanager.MockRM.submitApp(MockRM.java:297)
	at org.apache.hadoop.yarn.server.resourcemanager.MockRM.submitApp(MockRM.java:290)
	at org.apache.hadoop.yarn.server.resourcemanager.MockRM.submitApp(MockRM.java:259)
	at org.apache.hadoop.yarn.server.resourcemanager.MockRM.submitApp(MockRM.java:247)
	at org.apache.hadoop.yarn.server.resourcemanager.MockRM.submitApp(MockRM.java:242)
	at org.apache.hadoop.yarn.server.resourcemanager.applicationsmanager.TestAMRestart.testPreemptedAMRestartOnRMRestart(TestAMRestart.java:486)


FAILED:  org.apache.hadoop.yarn.server.resourcemanager.applicationsmanager.TestAMRestart.testAMRestartWithExistingContainers

Error Message:
test timed out after 30000 milliseconds

Stack Trace:
java.lang.Exception: test timed out after 30000 milliseconds
	at java.lang.Thread.sleep(Native Method)
	at org.apache.hadoop.yarn.server.resourcemanager.MockRM.waitForState(MockRM.java:131)
	at org.apache.hadoop.yarn.server.resourcemanager.MockRM.launchAM(MockRM.java:656)
	at org.apache.hadoop.yarn.server.resourcemanager.MockRM.launchAndRegisterAM(MockRM.java:667)
	at org.apache.hadoop.yarn.server.resourcemanager.applicationsmanager.TestAMRestart.testAMRestartWithExistingContainers(TestAMRestart.java:83)


FAILED:  org.apache.hadoop.yarn.server.resourcemanager.applicationsmanager.TestAMRestart.testNMTokensRebindOnAMRestart

Error Message:
test timed out after 30000 milliseconds

Stack Trace:
java.lang.Exception: test timed out after 30000 milliseconds
	at java.lang.Thread.sleep(Native Method)
	at org.apache.hadoop.yarn.server.resourcemanager.MockRM.waitForState(MockRM.java:131)
	at org.apache.hadoop.yarn.server.resourcemanager.MockRM.launchAM(MockRM.java:656)
	at org.apache.hadoop.yarn.server.resourcemanager.MockRM.launchAndRegisterAM(MockRM.java:667)
	at org.apache.hadoop.yarn.server.resourcemanager.applicationsmanager.TestAMRestart.testNMTokensRebindOnAMRestart(TestAMRestart.java:274)


FAILED:  org.apache.hadoop.yarn.server.resourcemanager.recovery.TestFSRMStateStore.testFSRMStateStore

Error Message:
null

Stack Trace:
java.lang.NullPointerException: null
	at org.apache.hadoop.yarn.proto.YarnServerResourceManagerRecoveryProtos$ApplicationStateDataProto$Builder.setAggregatorAddr(YarnServerResourceManagerRecoveryProtos.java:1729)
	at org.apache.hadoop.yarn.server.resourcemanager.recovery.records.impl.pb.ApplicationStateDataPBImpl.setAggregatorAddr(ApplicationStateDataPBImpl.java:117)
	at org.apache.hadoop.yarn.server.resourcemanager.recovery.records.ApplicationStateData.newInstance(ApplicationStateData.java:65)
	at org.apache.hadoop.yarn.server.resourcemanager.recovery.records.ApplicationStateData.newInstance(ApplicationStateData.java:48)
	at org.apache.hadoop.yarn.server.resourcemanager.recovery.records.ApplicationStateData.newInstance(ApplicationStateData.java:71)
	at org.apache.hadoop.yarn.server.resourcemanager.recovery.RMStateStore.storeNewApplication(RMStateStore.java:598)
	at org.apache.hadoop.yarn.server.resourcemanager.recovery.RMStateStoreTestBase.storeApp(RMStateStoreTestBase.java:153)
	at org.apache.hadoop.yarn.server.resourcemanager.recovery.RMStateStoreTestBase.testRMAppStateStore(RMStateStoreTestBase.java:207)
	at org.apache.hadoop.yarn.server.resourcemanager.recovery.TestFSRMStateStore.testFSRMStateStore(TestFSRMStateStore.java:156)


FAILED:  org.apache.hadoop.yarn.server.resourcemanager.recovery.TestLeveldbRMStateStore.testDeleteStore

Error Message:
null

Stack Trace:
java.lang.NullPointerException: null
	at org.apache.hadoop.yarn.proto.YarnServerResourceManagerRecoveryProtos$ApplicationStateDataProto$Builder.setAggregatorAddr(YarnServerResourceManagerRecoveryProtos.java:1729)
	at org.apache.hadoop.yarn.server.resourcemanager.recovery.records.impl.pb.ApplicationStateDataPBImpl.setAggregatorAddr(ApplicationStateDataPBImpl.java:117)
	at org.apache.hadoop.yarn.server.resourcemanager.recovery.records.ApplicationStateData.newInstance(ApplicationStateData.java:65)
	at org.apache.hadoop.yarn.server.resourcemanager.recovery.records.ApplicationStateData.newInstance(ApplicationStateData.java:48)
	at org.apache.hadoop.yarn.server.resourcemanager.recovery.records.ApplicationStateData.newInstance(ApplicationStateData.java:71)
	at org.apache.hadoop.yarn.server.resourcemanager.recovery.RMStateStore.storeNewApplication(RMStateStore.java:598)
	at org.apache.hadoop.yarn.server.resourcemanager.recovery.RMStateStoreTestBase.storeApp(RMStateStoreTestBase.java:153)
	at org.apache.hadoop.yarn.server.resourcemanager.recovery.RMStateStoreTestBase.createAndStoreApps(RMStateStoreTestBase.java:565)
	at org.apache.hadoop.yarn.server.resourcemanager.recovery.RMStateStoreTestBase.testDeleteStore(RMStateStoreTestBase.java:586)
	at org.apache.hadoop.yarn.server.resourcemanager.recovery.TestLeveldbRMStateStore.testDeleteStore(TestLeveldbRMStateStore.java:90)


FAILED:  org.apache.hadoop.yarn.server.resourcemanager.recovery.TestLeveldbRMStateStore.testApps

Error Message:
null

Stack Trace:
java.lang.NullPointerException: null
	at org.apache.hadoop.yarn.proto.YarnServerResourceManagerRecoveryProtos$ApplicationStateDataProto$Builder.setAggregatorAddr(YarnServerResourceManagerRecoveryProtos.java:1729)
	at org.apache.hadoop.yarn.server.resourcemanager.recovery.records.impl.pb.ApplicationStateDataPBImpl.setAggregatorAddr(ApplicationStateDataPBImpl.java:117)
	at org.apache.hadoop.yarn.server.resourcemanager.recovery.records.ApplicationStateData.newInstance(ApplicationStateData.java:65)
	at org.apache.hadoop.yarn.server.resourcemanager.recovery.records.ApplicationStateData.newInstance(ApplicationStateData.java:48)
	at org.apache.hadoop.yarn.server.resourcemanager.recovery.records.ApplicationStateData.newInstance(ApplicationStateData.java:71)
	at org.apache.hadoop.yarn.server.resourcemanager.recovery.RMStateStore.storeNewApplication(RMStateStore.java:598)
	at org.apache.hadoop.yarn.server.resourcemanager.recovery.RMStateStoreTestBase.storeApp(RMStateStoreTestBase.java:153)
	at org.apache.hadoop.yarn.server.resourcemanager.recovery.RMStateStoreTestBase.testRMAppStateStore(RMStateStoreTestBase.java:207)
	at org.apache.hadoop.yarn.server.resourcemanager.recovery.TestLeveldbRMStateStore.testApps(TestLeveldbRMStateStore.java:60)


FAILED:  org.apache.hadoop.yarn.server.resourcemanager.recovery.TestLeveldbRMStateStore.testAppDeletion

Error Message:
null

Stack Trace:
java.lang.NullPointerException: null
	at org.apache.hadoop.yarn.proto.YarnServerResourceManagerRecoveryProtos$ApplicationStateDataProto$Builder.setAggregatorAddr(YarnServerResourceManagerRecoveryProtos.java:1729)
	at org.apache.hadoop.yarn.server.resourcemanager.recovery.records.impl.pb.ApplicationStateDataPBImpl.setAggregatorAddr(ApplicationStateDataPBImpl.java:117)
	at org.apache.hadoop.yarn.server.resourcemanager.recovery.records.ApplicationStateData.newInstance(ApplicationStateData.java:65)
	at org.apache.hadoop.yarn.server.resourcemanager.recovery.records.ApplicationStateData.newInstance(ApplicationStateData.java:48)
	at org.apache.hadoop.yarn.server.resourcemanager.recovery.records.ApplicationStateData.newInstance(ApplicationStateData.java:71)
	at org.apache.hadoop.yarn.server.resourcemanager.recovery.RMStateStore.storeNewApplication(RMStateStore.java:598)
	at org.apache.hadoop.yarn.server.resourcemanager.recovery.RMStateStoreTestBase.storeApp(RMStateStoreTestBase.java:153)
	at org.apache.hadoop.yarn.server.resourcemanager.recovery.RMStateStoreTestBase.createAndStoreApps(RMStateStoreTestBase.java:565)
	at org.apache.hadoop.yarn.server.resourcemanager.recovery.RMStateStoreTestBase.testAppDeletion(RMStateStoreTestBase.java:543)
	at org.apache.hadoop.yarn.server.resourcemanager.recovery.TestLeveldbRMStateStore.testAppDeletion(TestLeveldbRMStateStore.java:84)


FAILED:  org.apache.hadoop.yarn.server.resourcemanager.recovery.TestZKRMStateStore.testFencedState

Error Message:
null

Stack Trace:
java.lang.NullPointerException: null
	at org.apache.hadoop.yarn.proto.YarnServerResourceManagerRecoveryProtos$ApplicationStateDataProto$Builder.setAggregatorAddr(YarnServerResourceManagerRecoveryProtos.java:1729)
	at org.apache.hadoop.yarn.server.resourcemanager.recovery.records.impl.pb.ApplicationStateDataPBImpl.setAggregatorAddr(ApplicationStateDataPBImpl.java:117)
	at org.apache.hadoop.yarn.server.resourcemanager.recovery.records.ApplicationStateData.newInstance(ApplicationStateData.java:65)
	at org.apache.hadoop.yarn.server.resourcemanager.recovery.records.ApplicationStateData.newInstance(ApplicationStateData.java:48)
	at org.apache.hadoop.yarn.server.resourcemanager.recovery.records.ApplicationStateData.newInstance(ApplicationStateData.java:71)
	at org.apache.hadoop.yarn.server.resourcemanager.recovery.RMStateStore.storeNewApplication(RMStateStore.java:598)
	at org.apache.hadoop.yarn.server.resourcemanager.recovery.TestZKRMStateStore.testFencedState(TestZKRMStateStore.java:284)


FAILED:  org.apache.hadoop.yarn.server.resourcemanager.recovery.TestZKRMStateStore.testZKRMStateStoreRealZK

Error Message:
null

Stack Trace:
java.lang.NullPointerException: null
	at org.apache.hadoop.yarn.proto.YarnServerResourceManagerRecoveryProtos$ApplicationStateDataProto$Builder.setAggregatorAddr(YarnServerResourceManagerRecoveryProtos.java:1729)
	at org.apache.hadoop.yarn.server.resourcemanager.recovery.records.impl.pb.ApplicationStateDataPBImpl.setAggregatorAddr(ApplicationStateDataPBImpl.java:117)
	at org.apache.hadoop.yarn.server.resourcemanager.recovery.records.ApplicationStateData.newInstance(ApplicationStateData.java:65)
	at org.apache.hadoop.yarn.server.resourcemanager.recovery.records.ApplicationStateData.newInstance(ApplicationStateData.java:48)
	at org.apache.hadoop.yarn.server.resourcemanager.recovery.records.ApplicationStateData.newInstance(ApplicationStateData.java:71)
	at org.apache.hadoop.yarn.server.resourcemanager.recovery.RMStateStore.storeNewApplication(RMStateStore.java:598)
	at org.apache.hadoop.yarn.server.resourcemanager.recovery.RMStateStoreTestBase.storeApp(RMStateStoreTestBase.java:153)
	at org.apache.hadoop.yarn.server.resourcemanager.recovery.RMStateStoreTestBase.testRMAppStateStore(RMStateStoreTestBase.java:207)
	at org.apache.hadoop.yarn.server.resourcemanager.recovery.TestZKRMStateStore.testZKRMStateStoreRealZK(TestZKRMStateStore.java:142)


FAILED:  org.apache.hadoop.yarn.server.resourcemanager.resourcetracker.TestRMNMRPCResponseId.testRPCResponseId

Error Message:
org.apache.hadoop.yarn.server.api.protocolrecords.NodeHeartbeatResponse.setAppAggregatorsMap(Ljava/util/Map;)V

Stack Trace:
java.lang.NoSuchMethodError: org.apache.hadoop.yarn.server.api.protocolrecords.NodeHeartbeatResponse.setAppAggregatorsMap(Ljava/util/Map;)V
	at org.apache.hadoop.yarn.server.resourcemanager.ResourceTrackerService.nodeHeartbeat(ResourceTrackerService.java:443)
	at org.apache.hadoop.yarn.server.resourcemanager.resourcetracker.TestRMNMRPCResponseId.testRPCResponseId(TestRMNMRPCResponseId.java:122)


FAILED:  org.apache.hadoop.yarn.server.resourcemanager.rmapp.TestRMAppTransitions.testAppAcceptedFailed[0]

Error Message:
null

Stack Trace:
java.lang.NullPointerException: null
	at org.apache.hadoop.yarn.proto.YarnServerResourceManagerRecoveryProtos$ApplicationStateDataProto$Builder.setAggregatorAddr(YarnServerResourceManagerRecoveryProtos.java:1729)
	at org.apache.hadoop.yarn.server.resourcemanager.recovery.records.impl.pb.ApplicationStateDataPBImpl.setAggregatorAddr(ApplicationStateDataPBImpl.java:117)
	at org.apache.hadoop.yarn.server.resourcemanager.recovery.records.ApplicationStateData.newInstance(ApplicationStateData.java:65)
	at org.apache.hadoop.yarn.server.resourcemanager.recovery.records.ApplicationStateData.newInstance(ApplicationStateData.java:48)
	at org.apache.hadoop.yarn.server.resourcemanager.rmapp.RMAppImpl.rememberTargetTransitionsAndStoreState(RMAppImpl.java:1071)
	at org.apache.hadoop.yarn.server.resourcemanager.rmapp.RMAppImpl.access$3400(RMAppImpl.java:101)
	at org.apache.hadoop.yarn.server.resourcemanager.rmapp.RMAppImpl$AttemptFailedTransition.transition(RMAppImpl.java:1292)
	at org.apache.hadoop.yarn.server.resourcemanager.rmapp.RMAppImpl$AttemptFailedTransition.transition(RMAppImpl.java:1245)
	at org.apache.hadoop.yarn.state.StateMachineFactory$MultipleInternalArc.doTransition(StateMachineFactory.java:385)
	at org.apache.hadoop.yarn.state.StateMachineFactory.doTransition(StateMachineFactory.java:302)
	at org.apache.hadoop.yarn.state.StateMachineFactory.access$300(StateMachineFactory.java:46)
	at org.apache.hadoop.yarn.state.StateMachineFactory$InternalStateMachine.doTransition(StateMachineFactory.java:448)
	at org.apache.hadoop.yarn.server.resourcemanager.rmapp.RMAppImpl.handle(RMAppImpl.java:741)
	at org.apache.hadoop.yarn.server.resourcemanager.rmapp.RMAppImpl.handle(RMAppImpl.java:100)
	at org.apache.hadoop.yarn.server.resourcemanager.rmapp.TestRMAppTransitions.testAppAcceptedFailed(TestRMAppTransitions.java:691)


FAILED:  org.apache.hadoop.yarn.server.resourcemanager.rmapp.TestRMAppTransitions.testAppRecoverPath[0]

Error Message:
null

Stack Trace:
java.lang.NullPointerException: null
	at org.apache.hadoop.yarn.proto.YarnServerResourceManagerRecoveryProtos$ApplicationStateDataProto$Builder.setAggregatorAddr(YarnServerResourceManagerRecoveryProtos.java:1729)
	at org.apache.hadoop.yarn.server.resourcemanager.recovery.records.impl.pb.ApplicationStateDataPBImpl.setAggregatorAddr(ApplicationStateDataPBImpl.java:117)
	at org.apache.hadoop.yarn.server.resourcemanager.recovery.records.ApplicationStateData.newInstance(ApplicationStateData.java:65)
	at org.apache.hadoop.yarn.server.resourcemanager.recovery.records.ApplicationStateData.newInstance(ApplicationStateData.java:48)
	at org.apache.hadoop.yarn.server.resourcemanager.recovery.records.ApplicationStateData.newInstance(ApplicationStateData.java:71)
	at org.apache.hadoop.yarn.server.resourcemanager.rmapp.TestRMAppTransitions.testCreateAppSubmittedRecovery(TestRMAppTransitions.java:400)
	at org.apache.hadoop.yarn.server.resourcemanager.rmapp.TestRMAppTransitions.testAppRecoverPath(TestRMAppTransitions.java:543)


FAILED:  org.apache.hadoop.yarn.server.resourcemanager.rmapp.TestRMAppTransitions.testAppFailedFailed[0]

Error Message:
null

Stack Trace:
java.lang.NullPointerException: null
	at org.apache.hadoop.yarn.proto.YarnServerResourceManagerRecoveryProtos$ApplicationStateDataProto$Builder.setAggregatorAddr(YarnServerResourceManagerRecoveryProtos.java:1729)
	at org.apache.hadoop.yarn.server.resourcemanager.recovery.records.impl.pb.ApplicationStateDataPBImpl.setAggregatorAddr(ApplicationStateDataPBImpl.java:117)
	at org.apache.hadoop.yarn.server.resourcemanager.recovery.records.ApplicationStateData.newInstance(ApplicationStateData.java:65)
	at org.apache.hadoop.yarn.server.resourcemanager.recovery.records.ApplicationStateData.newInstance(ApplicationStateData.java:48)
	at org.apache.hadoop.yarn.server.resourcemanager.rmapp.RMAppImpl.rememberTargetTransitionsAndStoreState(RMAppImpl.java:1071)
	at org.apache.hadoop.yarn.server.resourcemanager.rmapp.RMAppImpl.access$3400(RMAppImpl.java:101)
	at org.apache.hadoop.yarn.server.resourcemanager.rmapp.RMAppImpl$FinalSavingTransition.transition(RMAppImpl.java:1097)
	at org.apache.hadoop.yarn.server.resourcemanager.rmapp.RMAppImpl$FinalSavingTransition.transition(RMAppImpl.java:1078)
	at org.apache.hadoop.yarn.state.StateMachineFactory$SingleInternalArc.doTransition(StateMachineFactory.java:362)
	at org.apache.hadoop.yarn.state.StateMachineFactory.doTransition(StateMachineFactory.java:302)
	at org.apache.hadoop.yarn.state.StateMachineFactory.access$300(StateMachineFactory.java:46)
	at org.apache.hadoop.yarn.state.StateMachineFactory$InternalStateMachine.doTransition(StateMachineFactory.java:448)
	at org.apache.hadoop.yarn.server.resourcemanager.rmapp.RMAppImpl.handle(RMAppImpl.java:741)
	at org.apache.hadoop.yarn.server.resourcemanager.rmapp.RMAppImpl.handle(RMAppImpl.java:100)
	at org.apache.hadoop.yarn.server.resourcemanager.rmapp.TestRMAppTransitions.testAppFailedFailed(TestRMAppTransitions.java:885)


FAILED:  org.apache.hadoop.yarn.server.resourcemanager.rmapp.TestRMAppTransitions.testAppFinalSavingToFinished[0]

Error Message:
null

Stack Trace:
java.lang.NullPointerException: null
	at org.apache.hadoop.yarn.proto.YarnServerResourceManagerRecoveryProtos$ApplicationStateDataProto$Builder.setAggregatorAddr(YarnServerResourceManagerRecoveryProtos.java:1729)
	at org.apache.hadoop.yarn.server.resourcemanager.recovery.records.impl.pb.ApplicationStateDataPBImpl.setAggregatorAddr(ApplicationStateDataPBImpl.java:117)
	at org.apache.hadoop.yarn.server.resourcemanager.recovery.records.ApplicationStateData.newInstance(ApplicationStateData.java:65)
	at org.apache.hadoop.yarn.server.resourcemanager.recovery.records.ApplicationStateData.newInstance(ApplicationStateData.java:48)
	at org.apache.hadoop.yarn.server.resourcemanager.rmapp.RMAppImpl.rememberTargetTransitionsAndStoreState(RMAppImpl.java:1071)
	at org.apache.hadoop.yarn.server.resourcemanager.rmapp.RMAppImpl.access$3400(RMAppImpl.java:101)
	at org.apache.hadoop.yarn.server.resourcemanager.rmapp.RMAppImpl$FinalSavingTransition.transition(RMAppImpl.java:1097)
	at org.apache.hadoop.yarn.server.resourcemanager.rmapp.RMAppImpl$FinalSavingTransition.transition(RMAppImpl.java:1078)
	at org.apache.hadoop.yarn.state.StateMachineFactory$SingleInternalArc.doTransition(StateMachineFactory.java:362)
	at org.apache.hadoop.yarn.state.StateMachineFactory.doTransition(StateMachineFactory.java:302)
	at org.apache.hadoop.yarn.state.StateMachineFactory.access$300(StateMachineFactory.java:46)
	at org.apache.hadoop.yarn.state.StateMachineFactory$InternalStateMachine.doTransition(StateMachineFactory.java:448)
	at org.apache.hadoop.yarn.server.resourcemanager.rmapp.RMAppImpl.handle(RMAppImpl.java:741)
	at org.apache.hadoop.yarn.server.resourcemanager.rmapp.RMAppImpl.handle(RMAppImpl.java:100)
	at org.apache.hadoop.yarn.server.resourcemanager.rmapp.TestRMAppTransitions.testCreateAppFinalSaving(TestRMAppTransitions.java:446)
	at org.apache.hadoop.yarn.server.resourcemanager.rmapp.TestRMAppTransitions.testAppFinalSavingToFinished(TestRMAppTransitions.java:839)


FAILED:  org.apache.hadoop.yarn.server.resourcemanager.rmapp.TestRMAppTransitions.testAppSubmittedKill[0]

Error Message:
null

Stack Trace:
java.lang.NullPointerException: null
	at org.apache.hadoop.yarn.proto.YarnServerResourceManagerRecoveryProtos$ApplicationStateDataProto$Builder.setAggregatorAddr(YarnServerResourceManagerRecoveryProtos.java:1729)
	at org.apache.hadoop.yarn.server.resourcemanager.recovery.records.impl.pb.ApplicationStateDataPBImpl.setAggregatorAddr(ApplicationStateDataPBImpl.java:117)
	at org.apache.hadoop.yarn.server.resourcemanager.recovery.records.ApplicationStateData.newInstance(ApplicationStateData.java:65)
	at org.apache.hadoop.yarn.server.resourcemanager.recovery.records.ApplicationStateData.newInstance(ApplicationStateData.java:48)
	at org.apache.hadoop.yarn.server.resourcemanager.rmapp.RMAppImpl.rememberTargetTransitionsAndStoreState(RMAppImpl.java:1071)
	at org.apache.hadoop.yarn.server.resourcemanager.rmapp.RMAppImpl.access$3400(RMAppImpl.java:101)
	at org.apache.hadoop.yarn.server.resourcemanager.rmapp.RMAppImpl$FinalSavingTransition.transition(RMAppImpl.java:1097)
	at org.apache.hadoop.yarn.server.resourcemanager.rmapp.RMAppImpl$FinalSavingTransition.transition(RMAppImpl.java:1078)
	at org.apache.hadoop.yarn.state.StateMachineFactory$SingleInternalArc.doTransition(StateMachineFactory.java:362)
	at org.apache.hadoop.yarn.state.StateMachineFactory.doTransition(StateMachineFactory.java:302)
	at org.apache.hadoop.yarn.state.StateMachineFactory.access$300(StateMachineFactory.java:46)
	at org.apache.hadoop.yarn.state.StateMachineFactory$InternalStateMachine.doTransition(StateMachineFactory.java:448)
	at org.apache.hadoop.yarn.server.resourcemanager.rmapp.RMAppImpl.handle(RMAppImpl.java:741)
	at org.apache.hadoop.yarn.server.resourcemanager.rmapp.RMAppImpl.handle(RMAppImpl.java:100)
	at org.apache.hadoop.yarn.server.resourcemanager.rmapp.TestRMAppTransitions.testAppSubmittedKill(TestRMAppTransitions.java:655)


FAILED:  org.apache.hadoop.yarn.server.resourcemanager.rmapp.TestRMAppTransitions.testAppAcceptedAttemptKilled[0]

Error Message:
null

Stack Trace:
java.lang.NullPointerException: null
	at org.apache.hadoop.yarn.proto.YarnServerResourceManagerRecoveryProtos$ApplicationStateDataProto$Builder.setAggregatorAddr(YarnServerResourceManagerRecoveryProtos.java:1729)
	at org.apache.hadoop.yarn.server.resourcemanager.recovery.records.impl.pb.ApplicationStateDataPBImpl.setAggregatorAddr(ApplicationStateDataPBImpl.java:117)
	at org.apache.hadoop.yarn.server.resourcemanager.recovery.records.ApplicationStateData.newInstance(ApplicationStateData.java:65)
	at org.apache.hadoop.yarn.server.resourcemanager.recovery.records.ApplicationStateData.newInstance(ApplicationStateData.java:48)
	at org.apache.hadoop.yarn.server.resourcemanager.rmapp.RMAppImpl.rememberTargetTransitionsAndStoreState(RMAppImpl.java:1071)
	at org.apache.hadoop.yarn.server.resourcemanager.rmapp.RMAppImpl.access$3400(RMAppImpl.java:101)
	at org.apache.hadoop.yarn.server.resourcemanager.rmapp.RMAppImpl$FinalSavingTransition.transition(RMAppImpl.java:1097)
	at org.apache.hadoop.yarn.server.resourcemanager.rmapp.RMAppImpl$FinalSavingTransition.transition(RMAppImpl.java:1078)
	at org.apache.hadoop.yarn.state.StateMachineFactory$SingleInternalArc.doTransition(StateMachineFactory.java:362)
	at org.apache.hadoop.yarn.state.StateMachineFactory.doTransition(StateMachineFactory.java:302)
	at org.apache.hadoop.yarn.state.StateMachineFactory.access$300(StateMachineFactory.java:46)
	at org.apache.hadoop.yarn.state.StateMachineFactory$InternalStateMachine.doTransition(StateMachineFactory.java:448)
	at org.apache.hadoop.yarn.server.resourcemanager.rmapp.RMAppImpl.handle(RMAppImpl.java:741)
	at org.apache.hadoop.yarn.server.resourcemanager.rmapp.RMAppImpl.handle(RMAppImpl.java:100)
	at org.apache.hadoop.yarn.server.resourcemanager.rmapp.TestRMAppTransitions.testAppAcceptedAttemptKilled(TestRMAppTransitions.java:734)


FAILED:  org.apache.hadoop.yarn.server.resourcemanager.rmapp.TestRMAppTransitions.testAppAcceptedKill[0]

Error Message:
null

Stack Trace:
java.lang.NullPointerException: null
	at org.apache.hadoop.yarn.proto.YarnServerResourceManagerRecoveryProtos$ApplicationStateDataProto$Builder.setAggregatorAddr(YarnServerResourceManagerRecoveryProtos.java:1729)
	at org.apache.hadoop.yarn.server.resourcemanager.recovery.records.impl.pb.ApplicationStateDataPBImpl.setAggregatorAddr(ApplicationStateDataPBImpl.java:117)
	at org.apache.hadoop.yarn.server.resourcemanager.recovery.records.ApplicationStateData.newInstance(ApplicationStateData.java:65)
	at org.apache.hadoop.yarn.server.resourcemanager.recovery.records.ApplicationStateData.newInstance(ApplicationStateData.java:48)
	at org.apache.hadoop.yarn.server.resourcemanager.rmapp.RMAppImpl.rememberTargetTransitionsAndStoreState(RMAppImpl.java:1071)
	at org.apache.hadoop.yarn.server.resourcemanager.rmapp.RMAppImpl.access$3400(RMAppImpl.java:101)
	at org.apache.hadoop.yarn.server.resourcemanager.rmapp.RMAppImpl$FinalSavingTransition.transition(RMAppImpl.java:1097)
	at org.apache.hadoop.yarn.server.resourcemanager.rmapp.RMAppImpl$FinalSavingTransition.transition(RMAppImpl.java:1078)
	at org.apache.hadoop.yarn.state.StateMachineFactory$SingleInternalArc.doTransition(StateMachineFactory.java:362)
	at org.apache.hadoop.yarn.state.StateMachineFactory.doTransition(StateMachineFactory.java:302)
	at org.apache.hadoop.yarn.state.StateMachineFactory.access$300(StateMachineFactory.java:46)
	at org.apache.hadoop.yarn.state.StateMachineFactory$InternalStateMachine.doTransition(StateMachineFactory.java:448)
	at org.apache.hadoop.yarn.server.resourcemanager.rmapp.RMAppImpl.handle(RMAppImpl.java:741)
	at org.apache.hadoop.yarn.server.resourcemanager.rmapp.RMAppImpl.handle(RMAppImpl.java:100)
	at org.apache.hadoop.yarn.server.resourcemanager.rmapp.TestRMAppTransitions.testAppAcceptedKill(TestRMAppTransitions.java:713)


FAILED:  org.apache.hadoop.yarn.server.resourcemanager.rmapp.TestRMAppTransitions.testAppAtFinishingIgnoreKill[0]

Error Message:
null

Stack Trace:
java.lang.NullPointerException: null
	at org.apache.hadoop.yarn.proto.YarnServerResourceManagerRecoveryProtos$ApplicationStateDataProto$Builder.setAggregatorAddr(YarnServerResourceManagerRecoveryProtos.java:1729)
	at org.apache.hadoop.yarn.server.resourcemanager.recovery.records.impl.pb.ApplicationStateDataPBImpl.setAggregatorAddr(ApplicationStateDataPBImpl.java:117)
	at org.apache.hadoop.yarn.server.resourcemanager.recovery.records.ApplicationStateData.newInstance(ApplicationStateData.java:65)
	at org.apache.hadoop.yarn.server.resourcemanager.recovery.records.ApplicationStateData.newInstance(ApplicationStateData.java:48)
	at org.apache.hadoop.yarn.server.resourcemanager.rmapp.RMAppImpl.rememberTargetTransitionsAndStoreState(RMAppImpl.java:1071)
	at org.apache.hadoop.yarn.server.resourcemanager.rmapp.RMAppImpl.access$3400(RMAppImpl.java:101)
	at org.apache.hadoop.yarn.server.resourcemanager.rmapp.RMAppImpl$FinalSavingTransition.transition(RMAppImpl.java:1097)
	at org.apache.hadoop.yarn.server.resourcemanager.rmapp.RMAppImpl$FinalSavingTransition.transition(RMAppImpl.java:1078)
	at org.apache.hadoop.yarn.state.StateMachineFactory$SingleInternalArc.doTransition(StateMachineFactory.java:362)
	at org.apache.hadoop.yarn.state.StateMachineFactory.doTransition(StateMachineFactory.java:302)
	at org.apache.hadoop.yarn.state.StateMachineFactory.access$300(StateMachineFactory.java:46)
	at org.apache.hadoop.yarn.state.StateMachineFactory$InternalStateMachine.doTransition(StateMachineFactory.java:448)
	at org.apache.hadoop.yarn.server.resourcemanager.rmapp.RMAppImpl.handle(RMAppImpl.java:741)
	at org.apache.hadoop.yarn.server.resourcemanager.rmapp.RMAppImpl.handle(RMAppImpl.java:100)
	at org.apache.hadoop.yarn.server.resourcemanager.rmapp.TestRMAppTransitions.testCreateAppFinalSaving(TestRMAppTransitions.java:446)
	at org.apache.hadoop.yarn.server.resourcemanager.rmapp.TestRMAppTransitions.testCreateAppFinishing(TestRMAppTransitions.java:456)
	at org.apache.hadoop.yarn.server.resourcemanager.rmapp.TestRMAppTransitions.testAppAtFinishingIgnoreKill(TestRMAppTransitions.java:822)


FAILED:  org.apache.hadoop.yarn.server.resourcemanager.rmapp.TestRMAppTransitions.testAppNewRejectAddToStore[0]

Error Message:
null

Stack Trace:
java.lang.NullPointerException: null
	at org.apache.hadoop.yarn.proto.YarnServerResourceManagerRecoveryProtos$ApplicationStateDataProto$Builder.setAggregatorAddr(YarnServerResourceManagerRecoveryProtos.java:1729)
	at org.apache.hadoop.yarn.server.resourcemanager.recovery.records.impl.pb.ApplicationStateDataPBImpl.setAggregatorAddr(ApplicationStateDataPBImpl.java:117)
	at org.apache.hadoop.yarn.server.resourcemanager.recovery.records.ApplicationStateData.newInstance(ApplicationStateData.java:65)
	at org.apache.hadoop.yarn.server.resourcemanager.recovery.records.ApplicationStateData.newInstance(ApplicationStateData.java:48)
	at org.apache.hadoop.yarn.server.resourcemanager.rmapp.RMAppImpl.rememberTargetTransitionsAndStoreState(RMAppImpl.java:1071)
	at org.apache.hadoop.yarn.server.resourcemanager.rmapp.RMAppImpl.access$3400(RMAppImpl.java:101)
	at org.apache.hadoop.yarn.server.resourcemanager.rmapp.RMAppImpl$FinalSavingTransition.transition(RMAppImpl.java:1097)
	at org.apache.hadoop.yarn.server.resourcemanager.rmapp.RMAppImpl$FinalSavingTransition.transition(RMAppImpl.java:1078)
	at org.apache.hadoop.yarn.state.StateMachineFactory$SingleInternalArc.doTransition(StateMachineFactory.java:362)
	at org.apache.hadoop.yarn.state.StateMachineFactory.doTransition(StateMachineFactory.java:302)
	at org.apache.hadoop.yarn.state.StateMachineFactory.access$300(StateMachineFactory.java:46)
	at org.apache.hadoop.yarn.state.StateMachineFactory$InternalStateMachine.doTransition(StateMachineFactory.java:448)
	at org.apache.hadoop.yarn.server.resourcemanager.rmapp.RMAppImpl.handle(RMAppImpl.java:741)
	at org.apache.hadoop.yarn.server.resourcemanager.rmapp.RMAppImpl.handle(RMAppImpl.java:100)
	at org.apache.hadoop.yarn.server.resourcemanager.rmapp.TestRMAppTransitions.testAppNewRejectAddToStore(TestRMAppTransitions.java:589)


FAILED:  org.apache.hadoop.yarn.server.resourcemanager.rmapp.TestRMAppTransitions.testAppNewSavingKill[0]

Error Message:
null

Stack Trace:
java.lang.NullPointerException: null
	at org.apache.hadoop.yarn.proto.YarnServerResourceManagerRecoveryProtos$ApplicationStateDataProto$Builder.setAggregatorAddr(YarnServerResourceManagerRecoveryProtos.java:1729)
	at org.apache.hadoop.yarn.server.resourcemanager.recovery.records.impl.pb.ApplicationStateDataPBImpl.setAggregatorAddr(ApplicationStateDataPBImpl.java:117)
	at org.apache.hadoop.yarn.server.resourcemanager.recovery.records.ApplicationStateData.newInstance(ApplicationStateData.java:65)
	at org.apache.hadoop.yarn.server.resourcemanager.recovery.records.ApplicationStateData.newInstance(ApplicationStateData.java:48)
	at org.apache.hadoop.yarn.server.resourcemanager.rmapp.RMAppImpl.rememberTargetTransitionsAndStoreState(RMAppImpl.java:1071)
	at org.apache.hadoop.yarn.server.resourcemanager.rmapp.RMAppImpl.access$3400(RMAppImpl.java:101)
	at org.apache.hadoop.yarn.server.resourcemanager.rmapp.RMAppImpl$FinalSavingTransition.transition(RMAppImpl.java:1097)
	at org.apache.hadoop.yarn.server.resourcemanager.rmapp.RMAppImpl$FinalSavingTransition.transition(RMAppImpl.java:1078)
	at org.apache.hadoop.yarn.state.StateMachineFactory$SingleInternalArc.doTransition(StateMachineFactory.java:362)
	at org.apache.hadoop.yarn.state.StateMachineFactory.doTransition(StateMachineFactory.java:302)
	at org.apache.hadoop.yarn.state.StateMachineFactory.access$300(StateMachineFactory.java:46)
	at org.apache.hadoop.yarn.state.StateMachineFactory$InternalStateMachine.doTransition(StateMachineFactory.java:448)
	at org.apache.hadoop.yarn.server.resourcemanager.rmapp.RMAppImpl.handle(RMAppImpl.java:741)
	at org.apache.hadoop.yarn.server.resourcemanager.rmapp.RMAppImpl.handle(RMAppImpl.java:100)
	at org.apache.hadoop.yarn.server.resourcemanager.rmapp.TestRMAppTransitions.testAppNewSavingKill(TestRMAppTransitions.java:606)


FAILED:  org.apache.hadoop.yarn.server.resourcemanager.rmapp.TestRMAppTransitions.testAppSuccessPath[0]

Error Message:
null

Stack Trace:
java.lang.NullPointerException: null
	at org.apache.hadoop.yarn.proto.YarnServerResourceManagerRecoveryProtos$ApplicationStateDataProto$Builder.setAggregatorAddr(YarnServerResourceManagerRecoveryProtos.java:1729)
	at org.apache.hadoop.yarn.server.resourcemanager.recovery.records.impl.pb.ApplicationStateDataPBImpl.setAggregatorAddr(ApplicationStateDataPBImpl.java:117)
	at org.apache.hadoop.yarn.server.resourcemanager.recovery.records.ApplicationStateData.newInstance(ApplicationStateData.java:65)
	at org.apache.hadoop.yarn.server.resourcemanager.recovery.records.ApplicationStateData.newInstance(ApplicationStateData.java:48)
	at org.apache.hadoop.yarn.server.resourcemanager.rmapp.RMAppImpl.rememberTargetTransitionsAndStoreState(RMAppImpl.java:1071)
	at org.apache.hadoop.yarn.server.resourcemanager.rmapp.RMAppImpl.access$3400(RMAppImpl.java:101)
	at org.apache.hadoop.yarn.server.resourcemanager.rmapp.RMAppImpl$FinalSavingTransition.transition(RMAppImpl.java:1097)
	at org.apache.hadoop.yarn.server.resourcemanager.rmapp.RMAppImpl$FinalSavingTransition.transition(RMAppImpl.java:1078)
	at org.apache.hadoop.yarn.state.StateMachineFactory$SingleInternalArc.doTransition(StateMachineFactory.java:362)
	at org.apache.hadoop.yarn.state.StateMachineFactory.doTransition(StateMachineFactory.java:302)
	at org.apache.hadoop.yarn.state.StateMachineFactory.access$300(StateMachineFactory.java:46)
	at org.apache.hadoop.yarn.state.StateMachineFactory$InternalStateMachine.doTransition(StateMachineFactory.java:448)
	at org.apache.hadoop.yarn.server.resourcemanager.rmapp.RMAppImpl.handle(RMAppImpl.java:741)
	at org.apache.hadoop.yarn.server.resourcemanager.rmapp.RMAppImpl.handle(RMAppImpl.java:100)
	at org.apache.hadoop.yarn.server.resourcemanager.rmapp.TestRMAppTransitions.testCreateAppFinalSaving(TestRMAppTransitions.java:446)
	at org.apache.hadoop.yarn.server.resourcemanager.rmapp.TestRMAppTransitions.testCreateAppFinishing(TestRMAppTransitions.java:456)
	at org.apache.hadoop.yarn.server.resourcemanager.rmapp.TestRMAppTransitions.testCreateAppFinished(TestRMAppTransitions.java:474)
	at org.apache.hadoop.yarn.server.resourcemanager.rmapp.TestRMAppTransitions.testAppSuccessPath(TestRMAppTransitions.java:524)


FAILED:  org.apache.hadoop.yarn.server.resourcemanager.rmapp.TestRMAppTransitions.testAppRunningKill[0]

Error Message:
application finish time is not greater then 0

Stack Trace:
java.lang.AssertionError: application finish time is not greater then 0
	at org.junit.Assert.fail(Assert.java:88)
	at org.junit.Assert.assertTrue(Assert.java:41)
	at org.apache.hadoop.yarn.server.resourcemanager.rmapp.TestRMAppTransitions.assertTimesAtFinish(TestRMAppTransitions.java:322)
	at org.apache.hadoop.yarn.server.resourcemanager.rmapp.TestRMAppTransitions.assertKilled(TestRMAppTransitions.java:339)
	at org.apache.hadoop.yarn.server.resourcemanager.rmapp.TestRMAppTransitions.testAppRunningKill(TestRMAppTransitions.java:758)


FAILED:  org.apache.hadoop.yarn.server.resourcemanager.rmapp.TestRMAppTransitions.testAppSubmittedRejected[0]

Error Message:
null

Stack Trace:
java.lang.NullPointerException: null
	at org.apache.hadoop.yarn.proto.YarnServerResourceManagerRecoveryProtos$ApplicationStateDataProto$Builder.setAggregatorAddr(YarnServerResourceManagerRecoveryProtos.java:1729)
	at org.apache.hadoop.yarn.server.resourcemanager.recovery.records.impl.pb.ApplicationStateDataPBImpl.setAggregatorAddr(ApplicationStateDataPBImpl.java:117)
	at org.apache.hadoop.yarn.server.resourcemanager.recovery.records.ApplicationStateData.newInstance(ApplicationStateData.java:65)
	at org.apache.hadoop.yarn.server.resourcemanager.recovery.records.ApplicationStateData.newInstance(ApplicationStateData.java:48)
	at org.apache.hadoop.yarn.server.resourcemanager.rmapp.RMAppImpl.rememberTargetTransitionsAndStoreState(RMAppImpl.java:1071)
	at org.apache.hadoop.yarn.server.resourcemanager.rmapp.RMAppImpl.access$3400(RMAppImpl.java:101)
	at org.apache.hadoop.yarn.server.resourcemanager.rmapp.RMAppImpl$FinalSavingTransition.transition(RMAppImpl.java:1097)
	at org.apache.hadoop.yarn.server.resourcemanager.rmapp.RMAppImpl$FinalSavingTransition.transition(RMAppImpl.java:1078)
	at org.apache.hadoop.yarn.state.StateMachineFactory$SingleInternalArc.doTransition(StateMachineFactory.java:362)
	at org.apache.hadoop.yarn.state.StateMachineFactory.doTransition(StateMachineFactory.java:302)
	at org.apache.hadoop.yarn.state.StateMachineFactory.access$300(StateMachineFactory.java:46)
	at org.apache.hadoop.yarn.state.StateMachineFactory$InternalStateMachine.doTransition(StateMachineFactory.java:448)
	at org.apache.hadoop.yarn.server.resourcemanager.rmapp.RMAppImpl.handle(RMAppImpl.java:741)
	at org.apache.hadoop.yarn.server.resourcemanager.rmapp.RMAppImpl.handle(RMAppImpl.java:100)
	at org.apache.hadoop.yarn.server.resourcemanager.rmapp.TestRMAppTransitions.testAppSubmittedRejected(TestRMAppTransitions.java:640)


FAILED:  org.apache.hadoop.yarn.server.resourcemanager.rmapp.TestRMAppTransitions.testAppNewSavingReject[0]

Error Message:
null

Stack Trace:
java.lang.NullPointerException: null
	at org.apache.hadoop.yarn.proto.YarnServerResourceManagerRecoveryProtos$ApplicationStateDataProto$Builder.setAggregatorAddr(YarnServerResourceManagerRecoveryProtos.java:1729)
	at org.apache.hadoop.yarn.server.resourcemanager.recovery.records.impl.pb.ApplicationStateDataPBImpl.setAggregatorAddr(ApplicationStateDataPBImpl.java:117)
	at org.apache.hadoop.yarn.server.resourcemanager.recovery.records.ApplicationStateData.newInstance(ApplicationStateData.java:65)
	at org.apache.hadoop.yarn.server.resourcemanager.recovery.records.ApplicationStateData.newInstance(ApplicationStateData.java:48)
	at org.apache.hadoop.yarn.server.resourcemanager.rmapp.RMAppImpl.rememberTargetTransitionsAndStoreState(RMAppImpl.java:1071)
	at org.apache.hadoop.yarn.server.resourcemanager.rmapp.RMAppImpl.access$3400(RMAppImpl.java:101)
	at org.apache.hadoop.yarn.server.resourcemanager.rmapp.RMAppImpl$FinalSavingTransition.transition(RMAppImpl.java:1097)
	at org.apache.hadoop.yarn.server.resourcemanager.rmapp.RMAppImpl$FinalSavingTransition.transition(RMAppImpl.java:1078)
	at org.apache.hadoop.yarn.state.StateMachineFactory$SingleInternalArc.doTransition(StateMachineFactory.java:362)
	at org.apache.hadoop.yarn.state.StateMachineFactory.doTransition(StateMachineFactory.java:302)
	at org.apache.hadoop.yarn.state.StateMachineFactory.access$300(StateMachineFactory.java:46)
	at org.apache.hadoop.yarn.state.StateMachineFactory$InternalStateMachine.doTransition(StateMachineFactory.java:448)
	at org.apache.hadoop.yarn.server.resourcemanager.rmapp.RMAppImpl.handle(RMAppImpl.java:741)
	at org.apache.hadoop.yarn.server.resourcemanager.rmapp.RMAppImpl.handle(RMAppImpl.java:100)
	at org.apache.hadoop.yarn.server.resourcemanager.rmapp.TestRMAppTransitions.testAppNewSavingReject(TestRMAppTransitions.java:623)


FAILED:  org.apache.hadoop.yarn.server.resourcemanager.rmapp.TestRMAppTransitions.testAppKilledKilled[0]

Error Message:
application finish time is not greater then 0

Stack Trace:
java.lang.AssertionError: application finish time is not greater then 0
	at org.junit.Assert.fail(Assert.java:88)
	at org.junit.Assert.assertTrue(Assert.java:41)
	at org.apache.hadoop.yarn.server.resourcemanager.rmapp.TestRMAppTransitions.assertTimesAtFinish(TestRMAppTransitions.java:322)
	at org.apache.hadoop.yarn.server.resourcemanager.rmapp.TestRMAppTransitions.testAppKilledKilled(TestRMAppTransitions.java:917)


FAILED:  org.apache.hadoop.yarn.server.resourcemanager.rmapp.TestRMAppTransitions.testUnmanagedApp[0]

Error Message:
null

Stack Trace:
java.lang.NullPointerException: null
	at org.apache.hadoop.yarn.proto.YarnServerResourceManagerRecoveryProtos$ApplicationStateDataProto$Builder.setAggregatorAddr(YarnServerResourceManagerRecoveryProtos.java:1729)
	at org.apache.hadoop.yarn.server.resourcemanager.recovery.records.impl.pb.ApplicationStateDataPBImpl.setAggregatorAddr(ApplicationStateDataPBImpl.java:117)
	at org.apache.hadoop.yarn.server.resourcemanager.recovery.records.ApplicationStateData.newInstance(ApplicationStateData.java:65)
	at org.apache.hadoop.yarn.server.resourcemanager.recovery.records.ApplicationStateData.newInstance(ApplicationStateData.java:48)
	at org.apache.hadoop.yarn.server.resourcemanager.rmapp.RMAppImpl.rememberTargetTransitionsAndStoreState(RMAppImpl.java:1071)
	at org.apache.hadoop.yarn.server.resourcemanager.rmapp.RMAppImpl.access$3400(RMAppImpl.java:101)
	at org.apache.hadoop.yarn.server.resourcemanager.rmapp.RMAppImpl$AttemptFailedTransition.transition(RMAppImpl.java:1292)
	at org.apache.hadoop.yarn.server.resourcemanager.rmapp.RMAppImpl$AttemptFailedTransition.transition(RMAppImpl.java:1245)
	at org.apache.hadoop.yarn.state.StateMachineFactory$MultipleInternalArc.doTransition(StateMachineFactory.java:385)
	at org.apache.hadoop.yarn.state.StateMachineFactory.doTransition(StateMachineFactory.java:302)
	at org.apache.hadoop.yarn.state.StateMachineFactory.access$300(StateMachineFactory.java:46)
	at org.apache.hadoop.yarn.state.StateMachineFactory$InternalStateMachine.doTransition(StateMachineFactory.java:448)
	at org.apache.hadoop.yarn.server.resourcemanager.rmapp.RMAppImpl.handle(RMAppImpl.java:741)
	at org.apache.hadoop.yarn.server.resourcemanager.rmapp.RMAppImpl.handle(RMAppImpl.java:100)
	at org.apache.hadoop.yarn.server.resourcemanager.rmapp.TestRMAppTransitions.testUnmanagedApp(TestRMAppTransitions.java:510)


FAILED:  org.apache.hadoop.yarn.server.resourcemanager.rmapp.TestRMAppTransitions.testAppFinishedFinished[0]

Error Message:
null

Stack Trace:
java.lang.NullPointerException: null
	at org.apache.hadoop.yarn.proto.YarnServerResourceManagerRecoveryProtos$ApplicationStateDataProto$Builder.setAggregatorAddr(YarnServerResourceManagerRecoveryProtos.java:1729)
	at org.apache.hadoop.yarn.server.resourcemanager.recovery.records.impl.pb.ApplicationStateDataPBImpl.setAggregatorAddr(ApplicationStateDataPBImpl.java:117)
	at org.apache.hadoop.yarn.server.resourcemanager.recovery.records.ApplicationStateData.newInstance(ApplicationStateData.java:65)
	at org.apache.hadoop.yarn.server.resourcemanager.recovery.records.ApplicationStateData.newInstance(ApplicationStateData.java:48)
	at org.apache.hadoop.yarn.server.resourcemanager.rmapp.RMAppImpl.rememberTargetTransitionsAndStoreState(RMAppImpl.java:1071)
	at org.apache.hadoop.yarn.server.resourcemanager.rmapp.RMAppImpl.access$3400(RMAppImpl.java:101)
	at org.apache.hadoop.yarn.server.resourcemanager.rmapp.RMAppImpl$FinalSavingTransition.transition(RMAppImpl.java:1097)
	at org.apache.hadoop.yarn.server.resourcemanager.rmapp.RMAppImpl$FinalSavingTransition.transition(RMAppImpl.java:1078)
	at org.apache.hadoop.yarn.state.StateMachineFactory$SingleInternalArc.doTransition(StateMachineFactory.java:362)
	at org.apache.hadoop.yarn.state.StateMachineFactory.doTransition(StateMachineFactory.java:302)
	at org.apache.hadoop.yarn.state.StateMachineFactory.access$300(StateMachineFactory.java:46)
	at org.apache.hadoop.yarn.state.StateMachineFactory$InternalStateMachine.doTransition(StateMachineFactory.java:448)
	at org.apache.hadoop.yarn.server.resourcemanager.rmapp.RMAppImpl.handle(RMAppImpl.java:741)
	at org.apache.hadoop.yarn.server.resourcemanager.rmapp.RMAppImpl.handle(RMAppImpl.java:100)
	at org.apache.hadoop.yarn.server.resourcemanager.rmapp.TestRMAppTransitions.testCreateAppFinalSaving(TestRMAppTransitions.java:446)
	at org.apache.hadoop.yarn.server.resourcemanager.rmapp.TestRMAppTransitions.testCreateAppFinishing(TestRMAppTransitions.java:456)
	at org.apache.hadoop.yarn.server.resourcemanager.rmapp.TestRMAppTransitions.testCreateAppFinished(TestRMAppTransitions.java:474)
	at org.apache.hadoop.yarn.server.resourcemanager.rmapp.TestRMAppTransitions.testAppFinishedFinished(TestRMAppTransitions.java:862)


FAILED:  org.apache.hadoop.yarn.server.resourcemanager.rmapp.TestRMAppTransitions.testAppRunningFailed[0]

Error Message:
null

Stack Trace:
java.lang.NullPointerException: null
	at org.apache.hadoop.yarn.proto.YarnServerResourceManagerRecoveryProtos$ApplicationStateDataProto$Builder.setAggregatorAddr(YarnServerResourceManagerRecoveryProtos.java:1729)
	at org.apache.hadoop.yarn.server.resourcemanager.recovery.records.impl.pb.ApplicationStateDataPBImpl.setAggregatorAddr(ApplicationStateDataPBImpl.java:117)
	at org.apache.hadoop.yarn.server.resourcemanager.recovery.records.ApplicationStateData.newInstance(ApplicationStateData.java:65)
	at org.apache.hadoop.yarn.server.resourcemanager.recovery.records.ApplicationStateData.newInstance(ApplicationStateData.java:48)
	at org.apache.hadoop.yarn.server.resourcemanager.rmapp.RMAppImpl.rememberTargetTransitionsAndStoreState(RMAppImpl.java:1071)
	at org.apache.hadoop.yarn.server.resourcemanager.rmapp.RMAppImpl.access$3400(RMAppImpl.java:101)
	at org.apache.hadoop.yarn.server.resourcemanager.rmapp.RMAppImpl$AttemptFailedTransition.transition(RMAppImpl.java:1292)
	at org.apache.hadoop.yarn.server.resourcemanager.rmapp.RMAppImpl$AttemptFailedTransition.transition(RMAppImpl.java:1245)
	at org.apache.hadoop.yarn.state.StateMachineFactory$MultipleInternalArc.doTransition(StateMachineFactory.java:385)
	at org.apache.hadoop.yarn.state.StateMachineFactory.doTransition(StateMachineFactory.java:302)
	at org.apache.hadoop.yarn.state.StateMachineFactory.access$300(StateMachineFactory.java:46)
	at org.apache.hadoop.yarn.state.StateMachineFactory$InternalStateMachine.doTransition(StateMachineFactory.java:448)
	at org.apache.hadoop.yarn.server.resourcemanager.rmapp.RMAppImpl.handle(RMAppImpl.java:741)
	at org.apache.hadoop.yarn.server.resourcemanager.rmapp.RMAppImpl.handle(RMAppImpl.java:100)
	at org.apache.hadoop.yarn.server.resourcemanager.rmapp.TestRMAppTransitions.testAppRunningFailed(TestRMAppTransitions.java:803)


FAILED:  org.apache.hadoop.yarn.server.resourcemanager.rmapp.TestRMAppTransitions.testAppsRecoveringStates[0]

Error Message:
null

Stack Trace:
java.lang.NullPointerException: null
	at org.apache.hadoop.yarn.proto.YarnServerResourceManagerRecoveryProtos$ApplicationStateDataProto$Builder.setAggregatorAddr(YarnServerResourceManagerRecoveryProtos.java:1729)
	at org.apache.hadoop.yarn.server.resourcemanager.recovery.records.impl.pb.ApplicationStateDataPBImpl.setAggregatorAddr(ApplicationStateDataPBImpl.java:117)
	at org.apache.hadoop.yarn.server.resourcemanager.recovery.records.ApplicationStateData.newInstance(ApplicationStateData.java:65)
	at org.apache.hadoop.yarn.server.resourcemanager.recovery.records.ApplicationStateData.newInstance(ApplicationStateData.java:48)
	at org.apache.hadoop.yarn.server.resourcemanager.rmapp.TestRMAppTransitions.createRMStateForApplications(TestRMAppTransitions.java:999)
	at org.apache.hadoop.yarn.server.resourcemanager.rmapp.TestRMAppTransitions.testAppsRecoveringStates(TestRMAppTransitions.java:955)


FAILED:  org.apache.hadoop.yarn.server.resourcemanager.rmapp.TestRMAppTransitions.testAppNewReject[0]

Error Message:
null

Stack Trace:
java.lang.NullPointerException: null
	at org.apache.hadoop.yarn.proto.YarnServerResourceManagerRecoveryProtos$ApplicationStateDataProto$Builder.setAggregatorAddr(YarnServerResourceManagerRecoveryProtos.java:1729)
	at org.apache.hadoop.yarn.server.resourcemanager.recovery.records.impl.pb.ApplicationStateDataPBImpl.setAggregatorAddr(ApplicationStateDataPBImpl.java:117)
	at org.apache.hadoop.yarn.server.resourcemanager.recovery.records.ApplicationStateData.newInstance(ApplicationStateData.java:65)
	at org.apache.hadoop.yarn.server.resourcemanager.recovery.records.ApplicationStateData.newInstance(ApplicationStateData.java:48)
	at org.apache.hadoop.yarn.server.resourcemanager.rmapp.RMAppImpl.rememberTargetTransitionsAndStoreState(RMAppImpl.java:1071)
	at org.apache.hadoop.yarn.server.resourcemanager.rmapp.RMAppImpl.access$3400(RMAppImpl.java:101)
	at org.apache.hadoop.yarn.server.resourcemanager.rmapp.RMAppImpl$FinalSavingTransition.transition(RMAppImpl.java:1097)
	at org.apache.hadoop.yarn.server.resourcemanager.rmapp.RMAppImpl$FinalSavingTransition.transition(RMAppImpl.java:1078)
	at org.apache.hadoop.yarn.state.StateMachineFactory$SingleInternalArc.doTransition(StateMachineFactory.java:362)
	at org.apache.hadoop.yarn.state.StateMachineFactory.doTransition(StateMachineFactory.java:302)
	at org.apache.hadoop.yarn.state.StateMachineFactory.access$300(StateMachineFactory.java:46)
	at org.apache.hadoop.yarn.state.StateMachineFactory$InternalStateMachine.doTransition(StateMachineFactory.java:448)
	at org.apache.hadoop.yarn.server.resourcemanager.rmapp.RMAppImpl.handle(RMAppImpl.java:741)
	at org.apache.hadoop.yarn.server.resourcemanager.rmapp.RMAppImpl.handle(RMAppImpl.java:100)
	at org.apache.hadoop.yarn.server.resourcemanager.rmapp.TestRMAppTransitions.testAppNewReject(TestRMAppTransitions.java:572)


FAILED:  org.apache.hadoop.yarn.server.resourcemanager.rmapp.TestRMAppTransitions.testAppAcceptedFailed[1]

Error Message:
null

Stack Trace:
java.lang.NullPointerException: null
	at org.apache.hadoop.yarn.proto.YarnServerResourceManagerRecoveryProtos$ApplicationStateDataProto$Builder.setAggregatorAddr(YarnServerResourceManagerRecoveryProtos.java:1729)
	at org.apache.hadoop.yarn.server.resourcemanager.recovery.records.impl.pb.ApplicationStateDataPBImpl.setAggregatorAddr(ApplicationStateDataPBImpl.java:117)
	at org.apache.hadoop.yarn.server.resourcemanager.recovery.records.ApplicationStateData.newInstance(ApplicationStateData.java:65)
	at org.apache.hadoop.yarn.server.resourcemanager.recovery.records.ApplicationStateData.newInstance(ApplicationStateData.java:48)
	at org.apache.hadoop.yarn.server.resourcemanager.rmapp.RMAppImpl.rememberTargetTransitionsAndStoreState(RMAppImpl.java:1071)
	at org.apache.hadoop.yarn.server.resourcemanager.rmapp.RMAppImpl.access$3400(RMAppImpl.java:101)
	at org.apache.hadoop.yarn.server.resourcemanager.rmapp.RMAppImpl$AttemptFailedTransition.transition(RMAppImpl.java:1292)
	at org.apache.hadoop.yarn.server.resourcemanager.rmapp.RMAppImpl$AttemptFailedTransition.transition(RMAppImpl.java:1245)
	at org.apache.hadoop.yarn.state.StateMachineFactory$MultipleInternalArc.doTransition(StateMachineFactory.java:385)
	at org.apache.hadoop.yarn.state.StateMachineFactory.doTransition(StateMachineFactory.java:302)
	at org.apache.hadoop.yarn.state.StateMachineFactory.access$300(StateMachineFactory.java:46)
	at org.apache.hadoop.yarn.state.StateMachineFactory$InternalStateMachine.doTransition(StateMachineFactory.java:448)
	at org.apache.hadoop.yarn.server.resourcemanager.rmapp.RMAppImpl.handle(RMAppImpl.java:741)
	at org.apache.hadoop.yarn.server.resourcemanager.rmapp.RMAppImpl.handle(RMAppImpl.java:100)
	at org.apache.hadoop.yarn.server.resourcemanager.rmapp.TestRMAppTransitions.testAppAcceptedFailed(TestRMAppTransitions.java:691)


FAILED:  org.apache.hadoop.yarn.server.resourcemanager.rmapp.TestRMAppTransitions.testAppRecoverPath[1]

Error Message:
null

Stack Trace:
java.lang.NullPointerException: null
	at org.apache.hadoop.yarn.proto.YarnServerResourceManagerRecoveryProtos$ApplicationStateDataProto$Builder.setAggregatorAddr(YarnServerResourceManagerRecoveryProtos.java:1729)
	at org.apache.hadoop.yarn.server.resourcemanager.recovery.records.impl.pb.ApplicationStateDataPBImpl.setAggregatorAddr(ApplicationStateDataPBImpl.java:117)
	at org.apache.hadoop.yarn.server.resourcemanager.recovery.records.ApplicationStateData.newInstance(ApplicationStateData.java:65)
	at org.apache.hadoop.yarn.server.resourcemanager.recovery.records.ApplicationStateData.newInstance(ApplicationStateData.java:48)
	at org.apache.hadoop.yarn.server.resourcemanager.recovery.records.ApplicationStateData.newInstance(ApplicationStateData.java:71)
	at org.apache.hadoop.yarn.server.resourcemanager.rmapp.TestRMAppTransitions.testCreateAppSubmittedRecovery(TestRMAppTransitions.java:400)
	at org.apache.hadoop.yarn.server.resourcemanager.rmapp.TestRMAppTransitions.testAppRecoverPath(TestRMAppTransitions.java:543)


FAILED:  org.apache.hadoop.yarn.server.resourcemanager.rmapp.TestRMAppTransitions.testAppFailedFailed[1]

Error Message:
null

Stack Trace:
java.lang.NullPointerException: null
	at org.apache.hadoop.yarn.proto.YarnServerResourceManagerRecoveryProtos$ApplicationStateDataProto$Builder.setAggregatorAddr(YarnServerResourceManagerRecoveryProtos.java:1729)
	at org.apache.hadoop.yarn.server.resourcemanager.recovery.records.impl.pb.ApplicationStateDataPBImpl.setAggregatorAddr(ApplicationStateDataPBImpl.java:117)
	at org.apache.hadoop.yarn.server.resourcemanager.recovery.records.ApplicationStateData.newInstance(ApplicationStateData.java:65)
	at org.apache.hadoop.yarn.server.resourcemanager.recovery.records.ApplicationStateData.newInstance(ApplicationStateData.java:48)
	at org.apache.hadoop.yarn.server.resourcemanager.rmapp.RMAppImpl.rememberTargetTransitionsAndStoreState(RMAppImpl.java:1071)
	at org.apache.hadoop.yarn.server.resourcemanager.rmapp.RMAppImpl.access$3400(RMAppImpl.java:101)
	at org.apache.hadoop.yarn.server.resourcemanager.rmapp.RMAppImpl$FinalSavingTransition.transition(RMAppImpl.java:1097)
	at org.apache.hadoop.yarn.server.resourcemanager.rmapp.RMAppImpl$FinalSavingTransition.transition(RMAppImpl.java:1078)
	at org.apache.hadoop.yarn.state.StateMachineFactory$SingleInternalArc.doTransition(StateMachineFactory.java:362)
	at org.apache.hadoop.yarn.state.StateMachineFactory.doTransition(StateMachineFactory.java:302)
	at org.apache.hadoop.yarn.state.StateMachineFactory.access$300(StateMachineFactory.java:46)
	at org.apache.hadoop.yarn.state.StateMachineFactory$InternalStateMachine.doTransition(StateMachineFactory.java:448)
	at org.apache.hadoop.yarn.server.resourcemanager.rmapp.RMAppImpl.handle(RMAppImpl.java:741)
	at org.apache.hadoop.yarn.server.resourcemanager.rmapp.RMAppImpl.handle(RMAppImpl.java:100)
	at org.apache.hadoop.yarn.server.resourcemanager.rmapp.TestRMAppTransitions.testAppFailedFailed(TestRMAppTransitions.java:885)


FAILED:  org.apache.hadoop.yarn.server.resourcemanager.rmapp.TestRMAppTransitions.testAppFinalSavingToFinished[1]

Error Message:
null

Stack Trace:
java.lang.NullPointerException: null
	at org.apache.hadoop.yarn.proto.YarnServerResourceManagerRecoveryProtos$ApplicationStateDataProto$Builder.setAggregatorAddr(YarnServerResourceManagerRecoveryProtos.java:1729)
	at org.apache.hadoop.yarn.server.resourcemanager.recovery.records.impl.pb.ApplicationStateDataPBImpl.setAggregatorAddr(ApplicationStateDataPBImpl.java:117)
	at org.apache.hadoop.yarn.server.resourcemanager.recovery.records.ApplicationStateData.newInstance(ApplicationStateData.java:65)
	at org.apache.hadoop.yarn.server.resourcemanager.recovery.records.ApplicationStateData.newInstance(ApplicationStateData.java:48)
	at org.apache.hadoop.yarn.server.resourcemanager.rmapp.RMAppImpl.rememberTargetTransitionsAndStoreState(RMAppImpl.java:1071)
	at org.apache.hadoop.yarn.server.resourcemanager.rmapp.RMAppImpl.access$3400(RMAppImpl.java:101)
	at org.apache.hadoop.yarn.server.resourcemanager.rmapp.RMAppImpl$FinalSavingTransition.transition(RMAppImpl.java:1097)
	at org.apache.hadoop.yarn.server.resourcemanager.rmapp.RMAppImpl$FinalSavingTransition.transition(RMAppImpl.java:1078)
	at org.apache.hadoop.yarn.state.StateMachineFactory$SingleInternalArc.doTransition(StateMachineFactory.java:362)
	at org.apache.hadoop.yarn.state.StateMachineFactory.doTransition(StateMachineFactory.java:302)
	at org.apache.hadoop.yarn.state.StateMachineFactory.access$300(StateMachineFactory.java:46)
	at org.apache.hadoop.yarn.state.StateMachineFactory$InternalStateMachine.doTransition(StateMachineFactory.java:448)
	at org.apache.hadoop.yarn.server.resourcemanager.rmapp.RMAppImpl.handle(RMAppImpl.java:741)
	at org.apache.hadoop.yarn.server.resourcemanager.rmapp.RMAppImpl.handle(RMAppImpl.java:100)
	at org.apache.hadoop.yarn.server.resourcemanager.rmapp.TestRMAppTransitions.testCreateAppFinalSaving(TestRMAppTransitions.java:446)
	at org.apache.hadoop.yarn.server.resourcemanager.rmapp.TestRMAppTransitions.testAppFinalSavingToFinished(TestRMAppTransitions.java:839)


FAILED:  org.apache.hadoop.yarn.server.resourcemanager.rmapp.TestRMAppTransitions.testAppSubmittedKill[1]

Error Message:
null

Stack Trace:
java.lang.NullPointerException: null
	at org.apache.hadoop.yarn.proto.YarnServerResourceManagerRecoveryProtos$ApplicationStateDataProto$Builder.setAggregatorAddr(YarnServerResourceManagerRecoveryProtos.java:1729)
	at org.apache.hadoop.yarn.server.resourcemanager.recovery.records.impl.pb.ApplicationStateDataPBImpl.setAggregatorAddr(ApplicationStateDataPBImpl.java:117)
	at org.apache.hadoop.yarn.server.resourcemanager.recovery.records.ApplicationStateData.newInstance(ApplicationStateData.java:65)
	at org.apache.hadoop.yarn.server.resourcemanager.recovery.records.ApplicationStateData.newInstance(ApplicationStateData.java:48)
	at org.apache.hadoop.yarn.server.resourcemanager.rmapp.RMAppImpl.rememberTargetTransitionsAndStoreState(RMAppImpl.java:1071)
	at org.apache.hadoop.yarn.server.resourcemanager.rmapp.RMAppImpl.access$3400(RMAppImpl.java:101)
	at org.apache.hadoop.yarn.server.resourcemanager.rmapp.RMAppImpl$FinalSavingTransition.transition(RMAppImpl.java:1097)
	at org.apache.hadoop.yarn.server.resourcemanager.rmapp.RMAppImpl$FinalSavingTransition.transition(RMAppImpl.java:1078)
	at org.apache.hadoop.yarn.state.StateMachineFactory$SingleInternalArc.doTransition(StateMachineFactory.java:362)
	at org.apache.hadoop.yarn.state.StateMachineFactory.doTransition(StateMachineFactory.java:302)
	at org.apache.hadoop.yarn.state.StateMachineFactory.access$300(StateMachineFactory.java:46)
	at org.apache.hadoop.yarn.state.StateMachineFactory$InternalStateMachine.doTransition(StateMachineFactory.java:448)
	at org.apache.hadoop.yarn.server.resourcemanager.rmapp.RMAppImpl.handle(RMAppImpl.java:741)
	at org.apache.hadoop.yarn.server.resourcemanager.rmapp.RMAppImpl.handle(RMAppImpl.java:100)
	at org.apache.hadoop.yarn.server.resourcemanager.rmapp.TestRMAppTransitions.testAppSubmittedKill(TestRMAppTransitions.java:655)


FAILED:  org.apache.hadoop.yarn.server.resourcemanager.rmapp.TestRMAppTransitions.testAppAcceptedAttemptKilled[1]

Error Message:
null

Stack Trace:
java.lang.NullPointerException: null
	at org.apache.hadoop.yarn.proto.YarnServerResourceManagerRecoveryProtos$ApplicationStateDataProto$Builder.setAggregatorAddr(YarnServerResourceManagerRecoveryProtos.java:1729)
	at org.apache.hadoop.yarn.server.resourcemanager.recovery.records.impl.pb.ApplicationStateDataPBImpl.setAggregatorAddr(ApplicationStateDataPBImpl.java:117)
	at org.apache.hadoop.yarn.server.resourcemanager.recovery.records.ApplicationStateData.newInstance(ApplicationStateData.java:65)
	at org.apache.hadoop.yarn.server.resourcemanager.recovery.records.ApplicationStateData.newInstance(ApplicationStateData.java:48)
	at org.apache.hadoop.yarn.server.resourcemanager.rmapp.RMAppImpl.rememberTargetTransitionsAndStoreState(RMAppImpl.java:1071)
	at org.apache.hadoop.yarn.server.resourcemanager.rmapp.RMAppImpl.access$3400(RMAppImpl.java:101)
	at org.apache.hadoop.yarn.server.resourcemanager.rmapp.RMAppImpl$FinalSavingTransition.transition(RMAppImpl.java:1097)
	at org.apache.hadoop.yarn.server.resourcemanager.rmapp.RMAppImpl$FinalSavingTransition.transition(RMAppImpl.java:1078)
	at org.apache.hadoop.yarn.state.StateMachineFactory$SingleInternalArc.doTransition(StateMachineFactory.java:362)
	at org.apache.hadoop.yarn.state.StateMachineFactory.doTransition(StateMachineFactory.java:302)
	at org.apache.hadoop.yarn.state.StateMachineFactory.access$300(StateMachineFactory.java:46)
	at org.apache.hadoop.yarn.state.StateMachineFactory$InternalStateMachine.doTransition(StateMachineFactory.java:448)
	at org.apache.hadoop.yarn.server.resourcemanager.rmapp.RMAppImpl.handle(RMAppImpl.java:741)
	at org.apache.hadoop.yarn.server.resourcemanager.rmapp.RMAppImpl.handle(RMAppImpl.java:100)
	at org.apache.hadoop.yarn.server.resourcemanager.rmapp.TestRMAppTransitions.testAppAcceptedAttemptKilled(TestRMAppTransitions.java:734)


FAILED:  org.apache.hadoop.yarn.server.resourcemanager.rmapp.TestRMAppTransitions.testAppAcceptedKill[1]

Error Message:
null

Stack Trace:
java.lang.NullPointerException: null
	at org.apache.hadoop.yarn.proto.YarnServerResourceManagerRecoveryProtos$ApplicationStateDataProto$Builder.setAggregatorAddr(YarnServerResourceManagerRecoveryProtos.java:1729)
	at org.apache.hadoop.yarn.server.resourcemanager.recovery.records.impl.pb.ApplicationStateDataPBImpl.setAggregatorAddr(ApplicationStateDataPBImpl.java:117)
	at org.apache.hadoop.yarn.server.resourcemanager.recovery.records.ApplicationStateData.newInstance(ApplicationStateData.java:65)
	at org.apache.hadoop.yarn.server.resourcemanager.recovery.records.ApplicationStateData.newInstance(ApplicationStateData.java:48)
	at org.apache.hadoop.yarn.server.resourcemanager.rmapp.RMAppImpl.rememberTargetTransitionsAndStoreState(RMAppImpl.java:1071)
	at org.apache.hadoop.yarn.server.resourcemanager.rmapp.RMAppImpl.access$3400(RMAppImpl.java:101)
	at org.apache.hadoop.yarn.server.resourcemanager.rmapp.RMAppImpl$FinalSavingTransition.transition(RMAppImpl.java:1097)
	at org.apache.hadoop.yarn.server.resourcemanager.rmapp.RMAppImpl$FinalSavingTransition.transition(RMAppImpl.java:1078)
	at org.apache.hadoop.yarn.state.StateMachineFactory$SingleInternalArc.doTransition(StateMachineFactory.java:362)
	at org.apache.hadoop.yarn.state.StateMachineFactory.doTransition(StateMachineFactory.java:302)
	at org.apache.hadoop.yarn.state.StateMachineFactory.access$300(StateMachineFactory.java:46)
	at org.apache.hadoop.yarn.state.StateMachineFactory$InternalStateMachine.doTransition(StateMachineFactory.java:448)
	at org.apache.hadoop.yarn.server.resourcemanager.rmapp.RMAppImpl.handle(RMAppImpl.java:741)
	at org.apache.hadoop.yarn.server.resourcemanager.rmapp.RMAppImpl.handle(RMAppImpl.java:100)
	at org.apache.hadoop.yarn.server.resourcemanager.rmapp.TestRMAppTransitions.testAppAcceptedKill(TestRMAppTransitions.java:713)


FAILED:  org.apache.hadoop.yarn.server.resourcemanager.rmapp.TestRMAppTransitions.testAppAtFinishingIgnoreKill[1]

Error Message:
null

Stack Trace:
java.lang.NullPointerException: null
	at org.apache.hadoop.yarn.proto.YarnServerResourceManagerRecoveryProtos$ApplicationStateDataProto$Builder.setAggregatorAddr(YarnServerResourceManagerRecoveryProtos.java:1729)
	at org.apache.hadoop.yarn.server.resourcemanager.recovery.records.impl.pb.ApplicationStateDataPBImpl.setAggregatorAddr(ApplicationStateDataPBImpl.java:117)
	at org.apache.hadoop.yarn.server.resourcemanager.recovery.records.ApplicationStateData.newInstance(ApplicationStateData.java:65)
	at org.apache.hadoop.yarn.server.resourcemanager.recovery.records.ApplicationStateData.newInstance(ApplicationStateData.java:48)
	at org.apache.hadoop.yarn.server.resourcemanager.rmapp.RMAppImpl.rememberTargetTransitionsAndStoreState(RMAppImpl.java:1071)
	at org.apache.hadoop.yarn.server.resourcemanager.rmapp.RMAppImpl.access$3400(RMAppImpl.java:101)
	at org.apache.hadoop.yarn.server.resourcemanager.rmapp.RMAppImpl$FinalSavingTransition.transition(RMAppImpl.java:1097)
	at org.apache.hadoop.yarn.server.resourcemanager.rmapp.RMAppImpl$FinalSavingTransition.transition(RMAppImpl.java:1078)
	at org.apache.hadoop.yarn.state.StateMachineFactory$SingleInternalArc.doTransition(StateMachineFactory.java:362)
	at org.apache.hadoop.yarn.state.StateMachineFactory.doTransition(StateMachineFactory.java:302)
	at org.apache.hadoop.yarn.state.StateMachineFactory.access$300(StateMachineFactory.java:46)
	at org.apache.hadoop.yarn.state.StateMachineFactory$InternalStateMachine.doTransition(StateMachineFactory.java:448)
	at org.apache.hadoop.yarn.server.resourcemanager.rmapp.RMAppImpl.handle(RMAppImpl.java:741)
	at org.apache.hadoop.yarn.server.resourcemanager.rmapp.RMAppImpl.handle(RMAppImpl.java:100)
	at org.apache.hadoop.yarn.server.resourcemanager.rmapp.TestRMAppTransitions.testCreateAppFinalSaving(TestRMAppTransitions.java:446)
	at org.apache.hadoop.yarn.server.resourcemanager.rmapp.TestRMAppTransitions.testCreateAppFinishing(TestRMAppTransitions.java:456)
	at org.apache.hadoop.yarn.server.resourcemanager.rmapp.TestRMAppTransitions.testAppAtFinishingIgnoreKill(TestRMAppTransitions.java:822)


FAILED:  org.apache.hadoop.yarn.server.resourcemanager.rmapp.TestRMAppTransitions.testAppNewRejectAddToStore[1]

Error Message:
null

Stack Trace:
java.lang.NullPointerException: null
	at org.apache.hadoop.yarn.proto.YarnServerResourceManagerRecoveryProtos$ApplicationStateDataProto$Builder.setAggregatorAddr(YarnServerResourceManagerRecoveryProtos.java:1729)
	at org.apache.hadoop.yarn.server.resourcemanager.recovery.records.impl.pb.ApplicationStateDataPBImpl.setAggregatorAddr(ApplicationStateDataPBImpl.java:117)
	at org.apache.hadoop.yarn.server.resourcemanager.recovery.records.ApplicationStateData.newInstance(ApplicationStateData.java:65)
	at org.apache.hadoop.yarn.server.resourcemanager.recovery.records.ApplicationStateData.newInstance(ApplicationStateData.java:48)
	at org.apache.hadoop.yarn.server.resourcemanager.rmapp.RMAppImpl.rememberTargetTransitionsAndStoreState(RMAppImpl.java:1071)
	at org.apache.hadoop.yarn.server.resourcemanager.rmapp.RMAppImpl.access$3400(RMAppImpl.java:101)
	at org.apache.hadoop.yarn.server.resourcemanager.rmapp.RMAppImpl$FinalSavingTransition.transition(RMAppImpl.java:1097)
	at org.apache.hadoop.yarn.server.resourcemanager.rmapp.RMAppImpl$FinalSavingTransition.transition(RMAppImpl.java:1078)
	at org.apache.hadoop.yarn.state.StateMachineFactory$SingleInternalArc.doTransition(StateMachineFactory.java:362)
	at org.apache.hadoop.yarn.state.StateMachineFactory.doTransition(StateMachineFactory.java:302)
	at org.apache.hadoop.yarn.state.StateMachineFactory.access$300(StateMachineFactory.java:46)
	at org.apache.hadoop.yarn.state.StateMachineFactory$InternalStateMachine.doTransition(StateMachineFactory.java:448)
	at org.apache.hadoop.yarn.server.resourcemanager.rmapp.RMAppImpl.handle(RMAppImpl.java:741)
	at org.apache.hadoop.yarn.server.resourcemanager.rmapp.RMAppImpl.handle(RMAppImpl.java:100)
	at org.apache.hadoop.yarn.server.resourcemanager.rmapp.TestRMAppTransitions.testAppNewRejectAddToStore(TestRMAppTransitions.java:589)


FAILED:  org.apache.hadoop.yarn.server.resourcemanager.rmapp.TestRMAppTransitions.testAppNewSavingKill[1]

Error Message:
null

Stack Trace:
java.lang.NullPointerException: null
	at org.apache.hadoop.yarn.proto.YarnServerResourceManagerRecoveryProtos$ApplicationStateDataProto$Builder.setAggregatorAddr(YarnServerResourceManagerRecoveryProtos.java:1729)
	at org.apache.hadoop.yarn.server.resourcemanager.recovery.records.impl.pb.ApplicationStateDataPBImpl.setAggregatorAddr(ApplicationStateDataPBImpl.java:117)
	at org.apache.hadoop.yarn.server.resourcemanager.recovery.records.ApplicationStateData.newInstance(ApplicationStateData.java:65)
	at org.apache.hadoop.yarn.server.resourcemanager.recovery.records.ApplicationStateData.newInstance(ApplicationStateData.java:48)
	at org.apache.hadoop.yarn.server.resourcemanager.rmapp.RMAppImpl.rememberTargetTransitionsAndStoreState(RMAppImpl.java:1071)
	at org.apache.hadoop.yarn.server.resourcemanager.rmapp.RMAppImpl.access$3400(RMAppImpl.java:101)
	at org.apache.hadoop.yarn.server.resourcemanager.rmapp.RMAppImpl$FinalSavingTransition.transition(RMAppImpl.java:1097)
	at org.apache.hadoop.yarn.server.resourcemanager.rmapp.RMAppImpl$FinalSavingTransition.transition(RMAppImpl.java:1078)
	at org.apache.hadoop.yarn.state.StateMachineFactory$SingleInternalArc.doTransition(StateMachineFactory.java:362)
	at org.apache.hadoop.yarn.state.StateMachineFactory.doTransition(StateMachineFactory.java:302)
	at org.apache.hadoop.yarn.state.StateMachineFactory.access$300(StateMachineFactory.java:46)
	at org.apache.hadoop.yarn.state.StateMachineFactory$InternalStateMachine.doTransition(StateMachineFactory.java:448)
	at org.apache.hadoop.yarn.server.resourcemanager.rmapp.RMAppImpl.handle(RMAppImpl.java:741)
	at org.apache.hadoop.yarn.server.resourcemanager.rmapp.RMAppImpl.handle(RMAppImpl.java:100)
	at org.apache.hadoop.yarn.server.resourcemanager.rmapp.TestRMAppTransitions.testAppNewSavingKill(TestRMAppTransitions.java:606)


FAILED:  org.apache.hadoop.yarn.server.resourcemanager.rmapp.TestRMAppTransitions.testAppSuccessPath[1]

Error Message:
null

Stack Trace:
java.lang.NullPointerException: null
	at org.apache.hadoop.yarn.proto.YarnServerResourceManagerRecoveryProtos$ApplicationStateDataProto$Builder.setAggregatorAddr(YarnServerResourceManagerRecoveryProtos.java:1729)
	at org.apache.hadoop.yarn.server.resourcemanager.recovery.records.impl.pb.ApplicationStateDataPBImpl.setAggregatorAddr(ApplicationStateDataPBImpl.java:117)
	at org.apache.hadoop.yarn.server.resourcemanager.recovery.records.ApplicationStateData.newInstance(ApplicationStateData.java:65)
	at org.apache.hadoop.yarn.server.resourcemanager.recovery.records.ApplicationStateData.newInstance(ApplicationStateData.java:48)
	at org.apache.hadoop.yarn.server.resourcemanager.rmapp.RMAppImpl.rememberTargetTransitionsAndStoreState(RMAppImpl.java:1071)
	at org.apache.hadoop.yarn.server.resourcemanager.rmapp.RMAppImpl.access$3400(RMAppImpl.java:101)
	at org.apache.hadoop.yarn.server.resourcemanager.rmapp.RMAppImpl$FinalSavingTransition.transition(RMAppImpl.java:1097)
	at org.apache.hadoop.yarn.server.resourcemanager.rmapp.RMAppImpl$FinalSavingTransition.transition(RMAppImpl.java:1078)
	at org.apache.hadoop.yarn.state.StateMachineFactory$SingleInternalArc.doTransition(StateMachineFactory.java:362)
	at org.apache.hadoop.yarn.state.StateMachineFactory.doTransition(StateMachineFactory.java:302)
	at org.apache.hadoop.yarn.state.StateMachineFactory.access$300(StateMachineFactory.java:46)
	at org.apache.hadoop.yarn.state.StateMachineFactory$InternalStateMachine.doTransition(StateMachineFactory.java:448)
	at org.apache.hadoop.yarn.server.resourcemanager.rmapp.RMAppImpl.handle(RMAppImpl.java:741)
	at org.apache.hadoop.yarn.server.resourcemanager.rmapp.RMAppImpl.handle(RMAppImpl.java:100)
	at org.apache.hadoop.yarn.server.resourcemanager.rmapp.TestRMAppTransitions.testCreateAppFinalSaving(TestRMAppTransitions.java:446)
	at org.apache.hadoop.yarn.server.resourcemanager.rmapp.TestRMAppTransitions.testCreateAppFinishing(TestRMAppTransitions.java:456)
	at org.apache.hadoop.yarn.server.resourcemanager.rmapp.TestRMAppTransitions.testCreateAppFinished(TestRMAppTransitions.java:474)
	at org.apache.hadoop.yarn.server.resourcemanager.rmapp.TestRMAppTransitions.testAppSuccessPath(TestRMAppTransitions.java:524)


FAILED:  org.apache.hadoop.yarn.server.resourcemanager.rmapp.TestRMAppTransitions.testAppRunningKill[1]

Error Message:
application finish time is not greater then 0

Stack Trace:
java.lang.AssertionError: application finish time is not greater then 0
	at org.junit.Assert.fail(Assert.java:88)
	at org.junit.Assert.assertTrue(Assert.java:41)
	at org.apache.hadoop.yarn.server.resourcemanager.rmapp.TestRMAppTransitions.assertTimesAtFinish(TestRMAppTransitions.java:322)
	at org.apache.hadoop.yarn.server.resourcemanager.rmapp.TestRMAppTransitions.assertKilled(TestRMAppTransitions.java:339)
	at org.apache.hadoop.yarn.server.resourcemanager.rmapp.TestRMAppTransitions.testAppRunningKill(TestRMAppTransitions.java:758)


FAILED:  org.apache.hadoop.yarn.server.resourcemanager.rmapp.TestRMAppTransitions.testAppSubmittedRejected[1]

Error Message:
null

Stack Trace:
java.lang.NullPointerException: null
	at org.apache.hadoop.yarn.proto.YarnServerResourceManagerRecoveryProtos$ApplicationStateDataProto$Builder.setAggregatorAddr(YarnServerResourceManagerRecoveryProtos.java:1729)
	at org.apache.hadoop.yarn.server.resourcemanager.recovery.records.impl.pb.ApplicationStateDataPBImpl.setAggregatorAddr(ApplicationStateDataPBImpl.java:117)
	at org.apache.hadoop.yarn.server.resourcemanager.recovery.records.ApplicationStateData.newInstance(ApplicationStateData.java:65)
	at org.apache.hadoop.yarn.server.resourcemanager.recovery.records.ApplicationStateData.newInstance(ApplicationStateData.java:48)
	at org.apache.hadoop.yarn.server.resourcemanager.rmapp.RMAppImpl.rememberTargetTransitionsAndStoreState(RMAppImpl.java:1071)
	at org.apache.hadoop.yarn.server.resourcemanager.rmapp.RMAppImpl.access$3400(RMAppImpl.java:101)
	at org.apache.hadoop.yarn.server.resourcemanager.rmapp.RMAppImpl$FinalSavingTransition.transition(RMAppImpl.java:1097)
	at org.apache.hadoop.yarn.server.resourcemanager.rmapp.RMAppImpl$FinalSavingTransition.transition(RMAppImpl.java:1078)
	at org.apache.hadoop.yarn.state.StateMachineFactory$SingleInternalArc.doTransition(StateMachineFactory.java:362)
	at org.apache.hadoop.yarn.state.StateMachineFactory.doTransition(StateMachineFactory.java:302)
	at org.apache.hadoop.yarn.state.StateMachineFactory.access$300(StateMachineFactory.java:46)
	at org.apache.hadoop.yarn.state.StateMachineFactory$InternalStateMachine.doTransition(StateMachineFactory.java:448)
	at org.apache.hadoop.yarn.server.resourcemanager.rmapp.RMAppImpl.handle(RMAppImpl.java:741)
	at org.apache.hadoop.yarn.server.resourcemanager.rmapp.RMAppImpl.handle(RMAppImpl.java:100)
	at org.apache.hadoop.yarn.server.resourcemanager.rmapp.TestRMAppTransitions.testAppSubmittedRejected(TestRMAppTransitions.java:640)


FAILED:  org.apache.hadoop.yarn.server.resourcemanager.rmapp.TestRMAppTransitions.testAppNewSavingReject[1]

Error Message:
null

Stack Trace:
java.lang.NullPointerException: null
	at org.apache.hadoop.yarn.proto.YarnServerResourceManagerRecoveryProtos$ApplicationStateDataProto$Builder.setAggregatorAddr(YarnServerResourceManagerRecoveryProtos.java:1729)
	at org.apache.hadoop.yarn.server.resourcemanager.recovery.records.impl.pb.ApplicationStateDataPBImpl.setAggregatorAddr(ApplicationStateDataPBImpl.java:117)
	at org.apache.hadoop.yarn.server.resourcemanager.recovery.records.ApplicationStateData.newInstance(ApplicationStateData.java:65)
	at org.apache.hadoop.yarn.server.resourcemanager.recovery.records.ApplicationStateData.newInstance(ApplicationStateData.java:48)
	at org.apache.hadoop.yarn.server.resourcemanager.rmapp.RMAppImpl.rememberTargetTransitionsAndStoreState(RMAppImpl.java:1071)
	at org.apache.hadoop.yarn.server.resourcemanager.rmapp.RMAppImpl.access$3400(RMAppImpl.java:101)
	at org.apache.hadoop.yarn.server.resourcemanager.rmapp.RMAppImpl$FinalSavingTransition.transition(RMAppImpl.java:1097)
	at org.apache.hadoop.yarn.server.resourcemanager.rmapp.RMAppImpl$FinalSavingTransition.transition(RMAppImpl.java:1078)
	at org.apache.hadoop.yarn.state.StateMachineFactory$SingleInternalArc.doTransition(StateMachineFactory.java:362)
	at org.apache.hadoop.yarn.state.StateMachineFactory.doTransition(StateMachineFactory.java:302)
	at org.apache.hadoop.yarn.state.StateMachineFactory.access$300(StateMachineFactory.java:46)
	at org.apache.hadoop.yarn.state.StateMachineFactory$InternalStateMachine.doTransition(StateMachineFactory.java:448)
	at org.apache.hadoop.yarn.server.resourcemanager.rmapp.RMAppImpl.handle(RMAppImpl.java:741)
	at org.apache.hadoop.yarn.server.resourcemanager.rmapp.RMAppImpl.handle(RMAppImpl.java:100)
	at org.apache.hadoop.yarn.server.resourcemanager.rmapp.TestRMAppTransitions.testAppNewSavingReject(TestRMAppTransitions.java:623)


FAILED:  org.apache.hadoop.yarn.server.resourcemanager.rmapp.TestRMAppTransitions.testAppKilledKilled[1]

Error Message:
application finish time is not greater then 0

Stack Trace:
java.lang.AssertionError: application finish time is not greater then 0
	at org.junit.Assert.fail(Assert.java:88)
	at org.junit.Assert.assertTrue(Assert.java:41)
	at org.apache.hadoop.yarn.server.resourcemanager.rmapp.TestRMAppTransitions.assertTimesAtFinish(TestRMAppTransitions.java:322)
	at org.apache.hadoop.yarn.server.resourcemanager.rmapp.TestRMAppTransitions.testAppKilledKilled(TestRMAppTransitions.java:917)


FAILED:  org.apache.hadoop.yarn.server.resourcemanager.rmapp.TestRMAppTransitions.testUnmanagedApp[1]

Error Message:
null

Stack Trace:
java.lang.NullPointerException: null
	at org.apache.hadoop.yarn.proto.YarnServerResourceManagerRecoveryProtos$ApplicationStateDataProto$Builder.setAggregatorAddr(YarnServerResourceManagerRecoveryProtos.java:1729)
	at org.apache.hadoop.yarn.server.resourcemanager.recovery.records.impl.pb.ApplicationStateDataPBImpl.setAggregatorAddr(ApplicationStateDataPBImpl.java:117)
	at org.apache.hadoop.yarn.server.resourcemanager.recovery.records.ApplicationStateData.newInstance(ApplicationStateData.java:65)
	at org.apache.hadoop.yarn.server.resourcemanager.recovery.records.ApplicationStateData.newInstance(ApplicationStateData.java:48)
	at org.apache.hadoop.yarn.server.resourcemanager.rmapp.RMAppImpl.rememberTargetTransitionsAndStoreState(RMAppImpl.java:1071)
	at org.apache.hadoop.yarn.server.resourcemanager.rmapp.RMAppImpl.access$3400(RMAppImpl.java:101)
	at org.apache.hadoop.yarn.server.resourcemanager.rmapp.RMAppImpl$AttemptFailedTransition.transition(RMAppImpl.java:1292)
	at org.apache.hadoop.yarn.server.resourcemanager.rmapp.RMAppImpl$AttemptFailedTransition.transition(RMAppImpl.java:1245)
	at org.apache.hadoop.yarn.state.StateMachineFactory$MultipleInternalArc.doTransition(StateMachineFactory.java:385)
	at org.apache.hadoop.yarn.state.StateMachineFactory.doTransition(StateMachineFactory.java:302)
	at org.apache.hadoop.yarn.state.StateMachineFactory.access$300(StateMachineFactory.java:46)
	at org.apache.hadoop.yarn.state.StateMachineFactory$InternalStateMachine.doTransition(StateMachineFactory.java:448)
	at org.apache.hadoop.yarn.server.resourcemanager.rmapp.RMAppImpl.handle(RMAppImpl.java:741)
	at org.apache.hadoop.yarn.server.resourcemanager.rmapp.RMAppImpl.handle(RMAppImpl.java:100)
	at org.apache.hadoop.yarn.server.resourcemanager.rmapp.TestRMAppTransitions.testUnmanagedApp(TestRMAppTransitions.java:510)


FAILED:  org.apache.hadoop.yarn.server.resourcemanager.rmapp.TestRMAppTransitions.testAppFinishedFinished[1]

Error Message:
null

Stack Trace:
java.lang.NullPointerException: null
	at org.apache.hadoop.yarn.proto.YarnServerResourceManagerRecoveryProtos$ApplicationStateDataProto$Builder.setAggregatorAddr(YarnServerResourceManagerRecoveryProtos.java:1729)
	at org.apache.hadoop.yarn.server.resourcemanager.recovery.records.impl.pb.ApplicationStateDataPBImpl.setAggregatorAddr(ApplicationStateDataPBImpl.java:117)
	at org.apache.hadoop.yarn.server.resourcemanager.recovery.records.ApplicationStateData.newInstance(ApplicationStateData.java:65)
	at org.apache.hadoop.yarn.server.resourcemanager.recovery.records.ApplicationStateData.newInstance(ApplicationStateData.java:48)
	at org.apache.hadoop.yarn.server.resourcemanager.rmapp.RMAppImpl.rememberTargetTransitionsAndStoreState(RMAppImpl.java:1071)
	at org.apache.hadoop.yarn.server.resourcemanager.rmapp.RMAppImpl.access$3400(RMAppImpl.java:101)
	at org.apache.hadoop.yarn.server.resourcemanager.rmapp.RMAppImpl$FinalSavingTransition.transition(RMAppImpl.java:1097)
	at org.apache.hadoop.yarn.server.resourcemanager.rmapp.RMAppImpl$FinalSavingTransition.transition(RMAppImpl.java:1078)
	at org.apache.hadoop.yarn.state.StateMachineFactory$SingleInternalArc.doTransition(StateMachineFactory.java:362)
	at org.apache.hadoop.yarn.state.StateMachineFactory.doTransition(StateMachineFactory.java:302)
	at org.apache.hadoop.yarn.state.StateMachineFactory.access$300(StateMachineFactory.java:46)
	at org.apache.hadoop.yarn.state.StateMachineFactory$InternalStateMachine.doTransition(StateMachineFactory.java:448)
	at org.apache.hadoop.yarn.server.resourcemanager.rmapp.RMAppImpl.handle(RMAppImpl.java:741)
	at org.apache.hadoop.yarn.server.resourcemanager.rmapp.RMAppImpl.handle(RMAppImpl.java:100)
	at org.apache.hadoop.yarn.server.resourcemanager.rmapp.TestRMAppTransitions.testCreateAppFinalSaving(TestRMAppTransitions.java:446)
	at org.apache.hadoop.yarn.server.resourcemanager.rmapp.TestRMAppTransitions.testCreateAppFinishing(TestRMAppTransitions.java:456)
	at org.apache.hadoop.yarn.server.resourcemanager.rmapp.TestRMAppTransitions.testCreateAppFinished(TestRMAppTransitions.java:474)
	at org.apache.hadoop.yarn.server.resourcemanager.rmapp.TestRMAppTransitions.testAppFinishedFinished(TestRMAppTransitions.java:862)


FAILED:  org.apache.hadoop.yarn.server.resourcemanager.rmapp.TestRMAppTransitions.testAppRunningFailed[1]

Error Message:
null

Stack Trace:
java.lang.NullPointerException: null
	at org.apache.hadoop.yarn.proto.YarnServerResourceManagerRecoveryProtos$ApplicationStateDataProto$Builder.setAggregatorAddr(YarnServerResourceManagerRecoveryProtos.java:1729)
	at org.apache.hadoop.yarn.server.resourcemanager.recovery.records.impl.pb.ApplicationStateDataPBImpl.setAggregatorAddr(ApplicationStateDataPBImpl.java:117)
	at org.apache.hadoop.yarn.server.resourcemanager.recovery.records.ApplicationStateData.newInstance(ApplicationStateData.java:65)
	at org.apache.hadoop.yarn.server.resourcemanager.recovery.records.ApplicationStateData.newInstance(ApplicationStateData.java:48)
	at org.apache.hadoop.yarn.server.resourcemanager.rmapp.RMAppImpl.rememberTargetTransitionsAndStoreState(RMAppImpl.java:1071)
	at org.apache.hadoop.yarn.server.resourcemanager.rmapp.RMAppImpl.access$3400(RMAppImpl.java:101)
	at org.apache.hadoop.yarn.server.resourcemanager.rmapp.RMAppImpl$AttemptFailedTransition.transition(RMAppImpl.java:1292)
	at org.apache.hadoop.yarn.server.resourcemanager.rmapp.RMAppImpl$AttemptFailedTransition.transition(RMAppImpl.java:1245)
	at org.apache.hadoop.yarn.state.StateMachineFactory$MultipleInternalArc.doTransition(StateMachineFactory.java:385)
	at org.apache.hadoop.yarn.state.StateMachineFactory.doTransition(StateMachineFactory.java:302)
	at org.apache.hadoop.yarn.state.StateMachineFactory.access$300(StateMachineFactory.java:46)
	at org.apache.hadoop.yarn.state.StateMachineFactory$InternalStateMachine.doTransition(StateMachineFactory.java:448)
	at org.apache.hadoop.yarn.server.resourcemanager.rmapp.RMAppImpl.handle(RMAppImpl.java:741)
	at org.apache.hadoop.yarn.server.resourcemanager.rmapp.RMAppImpl.handle(RMAppImpl.java:100)
	at org.apache.hadoop.yarn.server.resourcemanager.rmapp.TestRMAppTransitions.testAppRunningFailed(TestRMAppTransitions.java:803)


FAILED:  org.apache.hadoop.yarn.server.resourcemanager.rmapp.TestRMAppTransitions.testAppsRecoveringStates[1]

Error Message:
null

Stack Trace:
java.lang.NullPointerException: null
	at org.apache.hadoop.yarn.proto.YarnServerResourceManagerRecoveryProtos$ApplicationStateDataProto$Builder.setAggregatorAddr(YarnServerResourceManagerRecoveryProtos.java:1729)
	at org.apache.hadoop.yarn.server.resourcemanager.recovery.records.impl.pb.ApplicationStateDataPBImpl.setAggregatorAddr(ApplicationStateDataPBImpl.java:117)
	at org.apache.hadoop.yarn.server.resourcemanager.recovery.records.ApplicationStateData.newInstance(ApplicationStateData.java:65)
	at org.apache.hadoop.yarn.server.resourcemanager.recovery.records.ApplicationStateData.newInstance(ApplicationStateData.java:48)
	at org.apache.hadoop.yarn.server.resourcemanager.rmapp.TestRMAppTransitions.createRMStateForApplications(TestRMAppTransitions.java:999)
	at org.apache.hadoop.yarn.server.resourcemanager.rmapp.TestRMAppTransitions.testAppsRecoveringStates(TestRMAppTransitions.java:955)


FAILED:  org.apache.hadoop.yarn.server.resourcemanager.rmapp.TestRMAppTransitions.testAppNewReject[1]

Error Message:
null

Stack Trace:
java.lang.NullPointerException: null
	at org.apache.hadoop.yarn.proto.YarnServerResourceManagerRecoveryProtos$ApplicationStateDataProto$Builder.setAggregatorAddr(YarnServerResourceManagerRecoveryProtos.java:1729)
	at org.apache.hadoop.yarn.server.resourcemanager.recovery.records.impl.pb.ApplicationStateDataPBImpl.setAggregatorAddr(ApplicationStateDataPBImpl.java:117)
	at org.apache.hadoop.yarn.server.resourcemanager.recovery.records.ApplicationStateData.newInstance(ApplicationStateData.java:65)
	at org.apache.hadoop.yarn.server.resourcemanager.recovery.records.ApplicationStateData.newInstance(ApplicationStateData.java:48)
	at org.apache.hadoop.yarn.server.resourcemanager.rmapp.RMAppImpl.rememberTargetTransitionsAndStoreState(RMAppImpl.java:1071)
	at org.apache.hadoop.yarn.server.resourcemanager.rmapp.RMAppImpl.access$3400(RMAppImpl.java:101)
	at org.apache.hadoop.yarn.server.resourcemanager.rmapp.RMAppImpl$FinalSavingTransition.transition(RMAppImpl.java:1097)
	at org.apache.hadoop.yarn.server.resourcemanager.rmapp.RMAppImpl$FinalSavingTransition.transition(RMAppImpl.java:1078)
	at org.apache.hadoop.yarn.state.StateMachineFactory$SingleInternalArc.doTransition(StateMachineFactory.java:362)
	at org.apache.hadoop.yarn.state.StateMachineFactory.doTransition(StateMachineFactory.java:302)
	at org.apache.hadoop.yarn.state.StateMachineFactory.access$300(StateMachineFactory.java:46)
	at org.apache.hadoop.yarn.state.StateMachineFactory$InternalStateMachine.doTransition(StateMachineFactory.java:448)
	at org.apache.hadoop.yarn.server.resourcemanager.rmapp.RMAppImpl.handle(RMAppImpl.java:741)
	at org.apache.hadoop.yarn.server.resourcemanager.rmapp.RMAppImpl.handle(RMAppImpl.java:100)
	at org.apache.hadoop.yarn.server.resourcemanager.rmapp.TestRMAppTransitions.testAppNewReject(TestRMAppTransitions.java:572)


FAILED:  org.apache.hadoop.yarn.server.resourcemanager.rmcontainer.TestRMContainerImpl.testExistenceOfResourceRequestInRMContainer

Error Message:
App state is not correct (timedout) expected:<ACCEPTED> but was:<NEW>

Stack Trace:
java.lang.AssertionError: App state is not correct (timedout) expected:<ACCEPTED> but was:<NEW>
	at org.junit.Assert.fail(Assert.java:88)
	at org.junit.Assert.failNotEquals(Assert.java:743)
	at org.junit.Assert.assertEquals(Assert.java:118)
	at org.apache.hadoop.yarn.server.resourcemanager.MockRM.waitForState(MockRM.java:134)
	at org.apache.hadoop.yarn.server.resourcemanager.MockRM.submitApp(MockRM.java:422)
	at org.apache.hadoop.yarn.server.resourcemanager.MockRM.submitApp(MockRM.java:314)
	at org.apache.hadoop.yarn.server.resourcemanager.MockRM.submitApp(MockRM.java:306)
	at org.apache.hadoop.yarn.server.resourcemanager.MockRM.submitApp(MockRM.java:297)
	at org.apache.hadoop.yarn.server.resourcemanager.MockRM.submitApp(MockRM.java:290)
	at org.apache.hadoop.yarn.server.resourcemanager.MockRM.submitApp(MockRM.java:259)
	at org.apache.hadoop.yarn.server.resourcemanager.MockRM.submitApp(MockRM.java:247)
	at org.apache.hadoop.yarn.server.resourcemanager.MockRM.submitApp(MockRM.java:242)
	at org.apache.hadoop.yarn.server.resourcemanager.rmcontainer.TestRMContainerImpl.testExistenceOfResourceRequestInRMContainer(TestRMContainerImpl.java:248)


FAILED:  org.apache.hadoop.yarn.server.resourcemanager.scheduler.TestSchedulerUtils.testValidateResourceBlacklistRequest

Error Message:
App state is not correct (timedout) expected:<ACCEPTED> but was:<NEW>

Stack Trace:
java.lang.AssertionError: App state is not correct (timedout) expected:<ACCEPTED> but was:<NEW>
	at org.junit.Assert.fail(Assert.java:88)
	at org.junit.Assert.failNotEquals(Assert.java:743)
	at org.junit.Assert.assertEquals(Assert.java:118)
	at org.apache.hadoop.yarn.server.resourcemanager.MockRM.waitForState(MockRM.java:134)
	at org.apache.hadoop.yarn.server.resourcemanager.MockRM.submitApp(MockRM.java:422)
	at org.apache.hadoop.yarn.server.resourcemanager.MockRM.submitApp(MockRM.java:314)
	at org.apache.hadoop.yarn.server.resourcemanager.MockRM.submitApp(MockRM.java:306)
	at org.apache.hadoop.yarn.server.resourcemanager.MockRM.submitApp(MockRM.java:297)
	at org.apache.hadoop.yarn.server.resourcemanager.MockRM.submitApp(MockRM.java:290)
	at org.apache.hadoop.yarn.server.resourcemanager.MockRM.submitApp(MockRM.java:266)
	at org.apache.hadoop.yarn.server.resourcemanager.scheduler.TestSchedulerUtils.testValidateResourceBlacklistRequest(TestSchedulerUtils.java:525)


FAILED:  org.apache.hadoop.yarn.server.resourcemanager.scheduler.capacity.TestCapacityScheduler.testRecoverRequestAfterPreemption

Error Message:
test timed out after 30000 milliseconds

Stack Trace:
java.lang.Exception: test timed out after 30000 milliseconds
	at java.lang.Thread.sleep(Native Method)
	at org.apache.hadoop.yarn.server.resourcemanager.MockRM.waitForState(MockRM.java:131)
	at org.apache.hadoop.yarn.server.resourcemanager.MockRM.submitApp(MockRM.java:422)
	at org.apache.hadoop.yarn.server.resourcemanager.MockRM.submitApp(MockRM.java:314)
	at org.apache.hadoop.yarn.server.resourcemanager.MockRM.submitApp(MockRM.java:306)
	at org.apache.hadoop.yarn.server.resourcemanager.MockRM.submitApp(MockRM.java:297)
	at org.apache.hadoop.yarn.server.resourcemanager.MockRM.submitApp(MockRM.java:290)
	at org.apache.hadoop.yarn.server.resourcemanager.MockRM.submitApp(MockRM.java:259)
	at org.apache.hadoop.yarn.server.resourcemanager.MockRM.submitApp(MockRM.java:247)
	at org.apache.hadoop.yarn.server.resourcemanager.MockRM.submitApp(MockRM.java:242)
	at org.apache.hadoop.yarn.server.resourcemanager.scheduler.capacity.TestCapacityScheduler.testRecoverRequestAfterPreemption(TestCapacityScheduler.java:1086)


FAILED:  org.apache.hadoop.yarn.server.resourcemanager.scheduler.capacity.TestCapacityScheduler.testAppReservationWithDominantResourceCalculator

Error Message:
test timed out after 30000 milliseconds

Stack Trace:
java.lang.Exception: test timed out after 30000 milliseconds
	at java.lang.Thread.sleep(Native Method)
	at org.apache.hadoop.yarn.server.resourcemanager.MockRM.waitForState(MockRM.java:131)
	at org.apache.hadoop.yarn.server.resourcemanager.MockRM.submitApp(MockRM.java:422)
	at org.apache.hadoop.yarn.server.resourcemanager.MockRM.submitApp(MockRM.java:314)
	at org.apache.hadoop.yarn.server.resourcemanager.MockRM.submitApp(MockRM.java:306)
	at org.apache.hadoop.yarn.server.resourcemanager.MockRM.submitApp(MockRM.java:297)
	at org.apache.hadoop.yarn.server.resourcemanager.MockRM.submitApp(MockRM.java:290)
	at org.apache.hadoop.yarn.server.resourcemanager.MockRM.submitApp(MockRM.java:259)
	at org.apache.hadoop.yarn.server.resourcemanager.MockRM.submitApp(MockRM.java:247)
	at org.apache.hadoop.yarn.server.resourcemanager.MockRM.submitApp(MockRM.java:242)
	at org.apache.hadoop.yarn.server.resourcemanager.scheduler.capacity.TestCapacityScheduler.testAppReservationWithDominantResourceCalculator(TestCapacityScheduler.java:2037)


FAILED:  org.apache.hadoop.yarn.server.resourcemanager.scheduler.capacity.TestCapacityScheduler.testMoveAllApps

Error Message:
App state is not correct (timedout) expected:<ACCEPTED> but was:<NEW>

Stack Trace:
java.lang.AssertionError: App state is not correct (timedout) expected:<ACCEPTED> but was:<NEW>
	at org.junit.Assert.fail(Assert.java:88)
	at org.junit.Assert.failNotEquals(Assert.java:743)
	at org.junit.Assert.assertEquals(Assert.java:118)
	at org.apache.hadoop.yarn.server.resourcemanager.MockRM.waitForState(MockRM.java:134)
	at org.apache.hadoop.yarn.server.resourcemanager.MockRM.submitApp(MockRM.java:422)
	at org.apache.hadoop.yarn.server.resourcemanager.MockRM.submitApp(MockRM.java:314)
	at org.apache.hadoop.yarn.server.resourcemanager.MockRM.submitApp(MockRM.java:306)
	at org.apache.hadoop.yarn.server.resourcemanager.MockRM.submitApp(MockRM.java:297)
	at org.apache.hadoop.yarn.server.resourcemanager.MockRM.submitApp(MockRM.java:290)
	at org.apache.hadoop.yarn.server.resourcemanager.MockRM.submitApp(MockRM.java:273)
	at org.apache.hadoop.yarn.server.resourcemanager.scheduler.capacity.TestCapacityScheduler.testMoveAllApps(TestCapacityScheduler.java:1750)


FAILED:  org.apache.hadoop.yarn.server.resourcemanager.scheduler.capacity.TestCapacityScheduler.testAllocateDoesNotBlockOnSchedulerLock

Error Message:
test timed out after 30000 milliseconds

Stack Trace:
java.lang.Exception: test timed out after 30000 milliseconds
	at java.lang.Thread.sleep(Native Method)
	at org.apache.hadoop.yarn.server.resourcemanager.MockRM.waitForState(MockRM.java:131)
	at org.apache.hadoop.yarn.server.resourcemanager.MockRM.submitApp(MockRM.java:422)
	at org.apache.hadoop.yarn.server.resourcemanager.MockRM.submitApp(MockRM.java:314)
	at org.apache.hadoop.yarn.server.resourcemanager.MockRM.submitApp(MockRM.java:306)
	at org.apache.hadoop.yarn.server.resourcemanager.MockRM.submitApp(MockRM.java:297)
	at org.apache.hadoop.yarn.server.resourcemanager.MockRM.submitApp(MockRM.java:290)
	at org.apache.hadoop.yarn.server.resourcemanager.MockRM.submitApp(MockRM.java:266)
	at org.apache.hadoop.yarn.server.resourcemanager.scheduler.capacity.TestCapacityScheduler.testAllocateDoesNotBlockOnSchedulerLock(TestCapacityScheduler.java:900)


FAILED:  org.apache.hadoop.yarn.server.resourcemanager.scheduler.capacity.TestCapacityScheduler.testMoveAllAppsInvalidSource

Error Message:
App state is not correct (timedout) expected:<ACCEPTED> but was:<NEW>

Stack Trace:
java.lang.AssertionError: App state is not correct (timedout) expected:<ACCEPTED> but was:<NEW>
	at org.junit.Assert.fail(Assert.java:88)
	at org.junit.Assert.failNotEquals(Assert.java:743)
	at org.junit.Assert.assertEquals(Assert.java:118)
	at org.apache.hadoop.yarn.server.resourcemanager.MockRM.waitForState(MockRM.java:134)
	at org.apache.hadoop.yarn.server.resourcemanager.MockRM.submitApp(MockRM.java:422)
	at org.apache.hadoop.yarn.server.resourcemanager.MockRM.submitApp(MockRM.java:314)
	at org.apache.hadoop.yarn.server.resourcemanager.MockRM.submitApp(MockRM.java:306)
	at org.apache.hadoop.yarn.server.resourcemanager.MockRM.submitApp(MockRM.java:297)
	at org.apache.hadoop.yarn.server.resourcemanager.MockRM.submitApp(MockRM.java:290)
	at org.apache.hadoop.yarn.server.resourcemanager.MockRM.submitApp(MockRM.java:273)
	at org.apache.hadoop.yarn.server.resourcemanager.scheduler.capacity.TestCapacityScheduler.testMoveAllAppsInvalidSource(TestCapacityScheduler.java:1872)


FAILED:  org.apache.hadoop.yarn.server.resourcemanager.scheduler.capacity.TestCapacityScheduler.testMoveAllAppsInvalidDestination

Error Message:
App state is not correct (timedout) expected:<ACCEPTED> but was:<NEW>

Stack Trace:
java.lang.AssertionError: App state is not correct (timedout) expected:<ACCEPTED> but was:<NEW>
	at org.junit.Assert.fail(Assert.java:88)
	at org.junit.Assert.failNotEquals(Assert.java:743)
	at org.junit.Assert.assertEquals(Assert.java:118)
	at org.apache.hadoop.yarn.server.resourcemanager.MockRM.waitForState(MockRM.java:134)
	at org.apache.hadoop.yarn.server.resourcemanager.MockRM.submitApp(MockRM.java:422)
	at org.apache.hadoop.yarn.server.resourcemanager.MockRM.submitApp(MockRM.java:314)
	at org.apache.hadoop.yarn.server.resourcemanager.MockRM.submitApp(MockRM.java:306)
	at org.apache.hadoop.yarn.server.resourcemanager.MockRM.submitApp(MockRM.java:297)
	at org.apache.hadoop.yarn.server.resourcemanager.MockRM.submitApp(MockRM.java:290)
	at org.apache.hadoop.yarn.server.resourcemanager.MockRM.submitApp(MockRM.java:273)
	at org.apache.hadoop.yarn.server.resourcemanager.scheduler.capacity.TestCapacityScheduler.testMoveAllAppsInvalidDestination(TestCapacityScheduler.java:1813)


FAILED:  org.apache.hadoop.yarn.server.resourcemanager.scheduler.capacity.TestCapacityScheduler.testPreemptionInfo

Error Message:
App state is not correct (timedout) expected:<ACCEPTED> but was:<NEW>

Stack Trace:
java.lang.AssertionError: App state is not correct (timedout) expected:<ACCEPTED> but was:<NEW>
	at org.junit.Assert.fail(Assert.java:88)
	at org.junit.Assert.failNotEquals(Assert.java:743)
	at org.junit.Assert.assertEquals(Assert.java:118)
	at org.apache.hadoop.yarn.server.resourcemanager.MockRM.waitForState(MockRM.java:134)
	at org.apache.hadoop.yarn.server.resourcemanager.MockRM.submitApp(MockRM.java:422)
	at org.apache.hadoop.yarn.server.resourcemanager.MockRM.submitApp(MockRM.java:314)
	at org.apache.hadoop.yarn.server.resourcemanager.MockRM.submitApp(MockRM.java:306)
	at org.apache.hadoop.yarn.server.resourcemanager.MockRM.submitApp(MockRM.java:297)
	at org.apache.hadoop.yarn.server.resourcemanager.MockRM.submitApp(MockRM.java:290)
	at org.apache.hadoop.yarn.server.resourcemanager.MockRM.submitApp(MockRM.java:259)
	at org.apache.hadoop.yarn.server.resourcemanager.MockRM.submitApp(MockRM.java:247)
	at org.apache.hadoop.yarn.server.resourcemanager.MockRM.submitApp(MockRM.java:242)
	at org.apache.hadoop.yarn.server.resourcemanager.scheduler.capacity.TestCapacityScheduler.testPreemptionInfo(TestCapacityScheduler.java:1023)


FAILED:  org.apache.hadoop.yarn.server.resourcemanager.scheduler.capacity.TestCapacityScheduler.testKillAllAppsInvalidSource

Error Message:
App state is not correct (timedout) expected:<ACCEPTED> but was:<NEW>

Stack Trace:
java.lang.AssertionError: App state is not correct (timedout) expected:<ACCEPTED> but was:<NEW>
	at org.junit.Assert.fail(Assert.java:88)
	at org.junit.Assert.failNotEquals(Assert.java:743)
	at org.junit.Assert.assertEquals(Assert.java:118)
	at org.apache.hadoop.yarn.server.resourcemanager.MockRM.waitForState(MockRM.java:134)
	at org.apache.hadoop.yarn.server.resourcemanager.MockRM.submitApp(MockRM.java:422)
	at org.apache.hadoop.yarn.server.resourcemanager.MockRM.submitApp(MockRM.java:314)
	at org.apache.hadoop.yarn.server.resourcemanager.MockRM.submitApp(MockRM.java:306)
	at org.apache.hadoop.yarn.server.resourcemanager.MockRM.submitApp(MockRM.java:297)
	at org.apache.hadoop.yarn.server.resourcemanager.MockRM.submitApp(MockRM.java:290)
	at org.apache.hadoop.yarn.server.resourcemanager.MockRM.submitApp(MockRM.java:273)
	at org.apache.hadoop.yarn.server.resourcemanager.scheduler.capacity.TestCapacityScheduler.testKillAllAppsInvalidSource(TestCapacityScheduler.java:1976)


FAILED:  org.apache.hadoop.yarn.server.resourcemanager.scheduler.capacity.TestCapacityScheduler.testResourceOverCommit

Error Message:
App state is not correct (timedout) expected:<ACCEPTED> but was:<NEW>

Stack Trace:
java.lang.AssertionError: App state is not correct (timedout) expected:<ACCEPTED> but was:<NEW>
	at org.junit.Assert.fail(Assert.java:88)
	at org.junit.Assert.failNotEquals(Assert.java:743)
	at org.junit.Assert.assertEquals(Assert.java:118)
	at org.apache.hadoop.yarn.server.resourcemanager.MockRM.waitForState(MockRM.java:134)
	at org.apache.hadoop.yarn.server.resourcemanager.MockRM.submitApp(MockRM.java:422)
	at org.apache.hadoop.yarn.server.resourcemanager.MockRM.submitApp(MockRM.java:314)
	at org.apache.hadoop.yarn.server.resourcemanager.MockRM.submitApp(MockRM.java:306)
	at org.apache.hadoop.yarn.server.resourcemanager.MockRM.submitApp(MockRM.java:297)
	at org.apache.hadoop.yarn.server.resourcemanager.MockRM.submitApp(MockRM.java:290)
	at org.apache.hadoop.yarn.server.resourcemanager.MockRM.submitApp(MockRM.java:259)
	at org.apache.hadoop.yarn.server.resourcemanager.MockRM.submitApp(MockRM.java:247)
	at org.apache.hadoop.yarn.server.resourcemanager.MockRM.submitApp(MockRM.java:242)
	at org.apache.hadoop.yarn.server.resourcemanager.scheduler.capacity.TestCapacityScheduler.testResourceOverCommit(TestCapacityScheduler.java:662)


FAILED:  org.apache.hadoop.yarn.server.resourcemanager.scheduler.capacity.TestCapacityScheduler.testKillAllAppsInQueue

Error Message:
App state is not correct (timedout) expected:<ACCEPTED> but was:<NEW>

Stack Trace:
java.lang.AssertionError: App state is not correct (timedout) expected:<ACCEPTED> but was:<NEW>
	at org.junit.Assert.fail(Assert.java:88)
	at org.junit.Assert.failNotEquals(Assert.java:743)
	at org.junit.Assert.assertEquals(Assert.java:118)
	at org.apache.hadoop.yarn.server.resourcemanager.MockRM.waitForState(MockRM.java:134)
	at org.apache.hadoop.yarn.server.resourcemanager.MockRM.submitApp(MockRM.java:422)
	at org.apache.hadoop.yarn.server.resourcemanager.MockRM.submitApp(MockRM.java:314)
	at org.apache.hadoop.yarn.server.resourcemanager.MockRM.submitApp(MockRM.java:306)
	at org.apache.hadoop.yarn.server.resourcemanager.MockRM.submitApp(MockRM.java:297)
	at org.apache.hadoop.yarn.server.resourcemanager.MockRM.submitApp(MockRM.java:290)
	at org.apache.hadoop.yarn.server.resourcemanager.MockRM.submitApp(MockRM.java:273)
	at org.apache.hadoop.yarn.server.resourcemanager.scheduler.capacity.TestCapacityScheduler.testKillAllAppsInQueue(TestCapacityScheduler.java:1931)


FAILED:  org.apache.hadoop.yarn.server.resourcemanager.scheduler.capacity.TestCapacityScheduler.testMoveAppSameParent

Error Message:
App state is not correct (timedout) expected:<ACCEPTED> but was:<NEW>

Stack Trace:
java.lang.AssertionError: App state is not correct (timedout) expected:<ACCEPTED> but was:<NEW>
	at org.junit.Assert.fail(Assert.java:88)
	at org.junit.Assert.failNotEquals(Assert.java:743)
	at org.junit.Assert.assertEquals(Assert.java:118)
	at org.apache.hadoop.yarn.server.resourcemanager.MockRM.waitForState(MockRM.java:134)
	at org.apache.hadoop.yarn.server.resourcemanager.MockRM.submitApp(MockRM.java:422)
	at org.apache.hadoop.yarn.server.resourcemanager.MockRM.submitApp(MockRM.java:314)
	at org.apache.hadoop.yarn.server.resourcemanager.MockRM.submitApp(MockRM.java:306)
	at org.apache.hadoop.yarn.server.resourcemanager.MockRM.submitApp(MockRM.java:297)
	at org.apache.hadoop.yarn.server.resourcemanager.MockRM.submitApp(MockRM.java:290)
	at org.apache.hadoop.yarn.server.resourcemanager.MockRM.submitApp(MockRM.java:273)
	at org.apache.hadoop.yarn.server.resourcemanager.scheduler.capacity.TestCapacityScheduler.testMoveAppSameParent(TestCapacityScheduler.java:1220)


FAILED:  org.apache.hadoop.yarn.server.resourcemanager.scheduler.capacity.TestCapacityScheduler.testMoveAppBasic

Error Message:
App state is not correct (timedout) expected:<ACCEPTED> but was:<NEW>

Stack Trace:
java.lang.AssertionError: App state is not correct (timedout) expected:<ACCEPTED> but was:<NEW>
	at org.junit.Assert.fail(Assert.java:88)
	at org.junit.Assert.failNotEquals(Assert.java:743)
	at org.junit.Assert.assertEquals(Assert.java:118)
	at org.apache.hadoop.yarn.server.resourcemanager.MockRM.waitForState(MockRM.java:134)
	at org.apache.hadoop.yarn.server.resourcemanager.MockRM.submitApp(MockRM.java:422)
	at org.apache.hadoop.yarn.server.resourcemanager.MockRM.submitApp(MockRM.java:314)
	at org.apache.hadoop.yarn.server.resourcemanager.MockRM.submitApp(MockRM.java:306)
	at org.apache.hadoop.yarn.server.resourcemanager.MockRM.submitApp(MockRM.java:297)
	at org.apache.hadoop.yarn.server.resourcemanager.MockRM.submitApp(MockRM.java:290)
	at org.apache.hadoop.yarn.server.resourcemanager.MockRM.submitApp(MockRM.java:273)
	at org.apache.hadoop.yarn.server.resourcemanager.scheduler.capacity.TestCapacityScheduler.testMoveAppBasic(TestCapacityScheduler.java:1158)


FAILED:  org.apache.hadoop.yarn.server.resourcemanager.scheduler.capacity.TestCapacitySchedulerDynamicBehavior.testRemoveQueue

Error Message:
App state is not correct (timedout) expected:<ACCEPTED> but was:<NEW>

Stack Trace:
java.lang.AssertionError: App state is not correct (timedout) expected:<ACCEPTED> but was:<NEW>
	at org.junit.Assert.fail(Assert.java:88)
	at org.junit.Assert.failNotEquals(Assert.java:743)
	at org.junit.Assert.assertEquals(Assert.java:118)
	at org.apache.hadoop.yarn.server.resourcemanager.MockRM.waitForState(MockRM.java:134)
	at org.apache.hadoop.yarn.server.resourcemanager.MockRM.submitApp(MockRM.java:422)
	at org.apache.hadoop.yarn.server.resourcemanager.MockRM.submitApp(MockRM.java:314)
	at org.apache.hadoop.yarn.server.resourcemanager.MockRM.submitApp(MockRM.java:306)
	at org.apache.hadoop.yarn.server.resourcemanager.MockRM.submitApp(MockRM.java:297)
	at org.apache.hadoop.yarn.server.resourcemanager.MockRM.submitApp(MockRM.java:290)
	at org.apache.hadoop.yarn.server.resourcemanager.MockRM.submitApp(MockRM.java:273)
	at org.apache.hadoop.yarn.server.resourcemanager.scheduler.capacity.TestCapacitySchedulerDynamicBehavior.testRemoveQueue(TestCapacitySchedulerDynamicBehavior.java:160)


FAILED:  org.apache.hadoop.yarn.server.resourcemanager.scheduler.capacity.TestCapacitySchedulerDynamicBehavior.testMoveAppToPlanQueue

Error Message:
App state is not correct (timedout) expected:<ACCEPTED> but was:<NEW>

Stack Trace:
java.lang.AssertionError: App state is not correct (timedout) expected:<ACCEPTED> but was:<NEW>
	at org.junit.Assert.fail(Assert.java:88)
	at org.junit.Assert.failNotEquals(Assert.java:743)
	at org.junit.Assert.assertEquals(Assert.java:118)
	at org.apache.hadoop.yarn.server.resourcemanager.MockRM.waitForState(MockRM.java:134)
	at org.apache.hadoop.yarn.server.resourcemanager.MockRM.submitApp(MockRM.java:422)
	at org.apache.hadoop.yarn.server.resourcemanager.MockRM.submitApp(MockRM.java:314)
	at org.apache.hadoop.yarn.server.resourcemanager.MockRM.submitApp(MockRM.java:306)
	at org.apache.hadoop.yarn.server.resourcemanager.MockRM.submitApp(MockRM.java:297)
	at org.apache.hadoop.yarn.server.resourcemanager.MockRM.submitApp(MockRM.java:290)
	at org.apache.hadoop.yarn.server.resourcemanager.MockRM.submitApp(MockRM.java:273)
	at org.apache.hadoop.yarn.server.resourcemanager.scheduler.capacity.TestCapacitySchedulerDynamicBehavior.testMoveAppToPlanQueue(TestCapacitySchedulerDynamicBehavior.java:195)


FAILED:  org.apache.hadoop.yarn.server.resourcemanager.scheduler.capacity.TestCapacitySchedulerNodeLabelUpdate.testNodeUpdate

Error Message:
test timed out after 30000 milliseconds

Stack Trace:
java.lang.Exception: test timed out after 30000 milliseconds
	at java.lang.Thread.sleep(Native Method)
	at org.apache.hadoop.yarn.server.resourcemanager.MockRM.waitForState(MockRM.java:131)
	at org.apache.hadoop.yarn.server.resourcemanager.MockRM.submitApp(MockRM.java:422)
	at org.apache.hadoop.yarn.server.resourcemanager.MockRM.submitApp(MockRM.java:314)
	at org.apache.hadoop.yarn.server.resourcemanager.MockRM.submitApp(MockRM.java:306)
	at org.apache.hadoop.yarn.server.resourcemanager.MockRM.submitApp(MockRM.java:297)
	at org.apache.hadoop.yarn.server.resourcemanager.MockRM.submitApp(MockRM.java:290)
	at org.apache.hadoop.yarn.server.resourcemanager.MockRM.submitApp(MockRM.java:273)
	at org.apache.hadoop.yarn.server.resourcemanager.scheduler.capacity.TestCapacitySchedulerNodeLabelUpdate.testNodeUpdate(TestCapacitySchedulerNodeLabelUpdate.java:127)


FAILED:  org.apache.hadoop.yarn.server.resourcemanager.scheduler.capacity.TestCapacitySchedulerQueueACLs.testApplicationACLs

Error Message:
App state is not correct (timedout) expected:<ACCEPTED> but was:<NEW>

Stack Trace:
java.lang.AssertionError: App state is not correct (timedout) expected:<ACCEPTED> but was:<NEW>
	at org.junit.Assert.fail(Assert.java:88)
	at org.junit.Assert.failNotEquals(Assert.java:743)
	at org.junit.Assert.assertEquals(Assert.java:118)
	at org.apache.hadoop.yarn.server.resourcemanager.MockRM.waitForState(MockRM.java:134)
	at org.apache.hadoop.yarn.server.resourcemanager.QueueACLsTestBase.submitAppAndGetAppId(QueueACLsTestBase.java:231)
	at org.apache.hadoop.yarn.server.resourcemanager.QueueACLsTestBase.verifyKillAppSuccess(QueueACLsTestBase.java:193)
	at org.apache.hadoop.yarn.server.resourcemanager.QueueACLsTestBase.testApplicationACLs(QueueACLsTestBase.java:124)
	at sun.reflect.NativeMethodAccessorImpl.invoke0(Native Method)
	at sun.reflect.NativeMethodAccessorImpl.invoke(NativeMethodAccessorImpl.java:57)
	at sun.reflect.DelegatingMethodAccessorImpl.invoke(DelegatingMethodAccessorImpl.java:43)
	at java.lang.reflect.Method.invoke(Method.java:606)
	at org.junit.runners.model.FrameworkMethod$1.runReflectiveCall(FrameworkMethod.java:47)
	at org.junit.internal.runners.model.ReflectiveCallable.run(ReflectiveCallable.java:12)
	at org.junit.runners.model.FrameworkMethod.invokeExplosively(FrameworkMethod.java:44)
	at org.junit.internal.runners.statements.InvokeMethod.evaluate(InvokeMethod.java:17)
	at org.junit.internal.runners.statements.RunBefores.evaluate(RunBefores.java:26)
	at org.junit.internal.runners.statements.RunAfters.evaluate(RunAfters.java:27)
	at org.junit.runners.ParentRunner.runLeaf(ParentRunner.java:271)
	at org.junit.runners.BlockJUnit4ClassRunner.runChild(BlockJUnit4ClassRunner.java:70)
	at org.junit.runners.BlockJUnit4ClassRunner.runChild(BlockJUnit4ClassRunner.java:50)
	at org.junit.runners.ParentRunner$3.run(ParentRunner.java:238)
	at org.junit.runners.ParentRunner$1.schedule(ParentRunner.java:63)
	at org.junit.runners.ParentRunner.runChildren(ParentRunner.java:236)
	at org.junit.runners.ParentRunner.access$000(ParentRunner.java:53)
	at org.junit.runners.ParentRunner$2.evaluate(ParentRunner.java:229)
	at org.junit.runners.ParentRunner.run(ParentRunner.java:309)
	at org.apache.maven.surefire.junit4.JUnit4Provider.execute(JUnit4Provider.java:264)
	at org.apache.maven.surefire.junit4.JUnit4Provider.executeTestSet(JUnit4Provider.java:153)
	at org.apache.maven.surefire.junit4.JUnit4Provider.invoke(JUnit4Provider.java:124)
	at org.apache.maven.surefire.booter.ForkedBooter.invokeProviderInSameClassLoader(ForkedBooter.java:200)
	at org.apache.maven.surefire.booter.ForkedBooter.runSuitesInProcess(ForkedBooter.java:153)
	at org.apache.maven.surefire.booter.ForkedBooter.main(ForkedBooter.java:103)


FAILED:  org.apache.hadoop.yarn.server.resourcemanager.scheduler.capacity.TestContainerAllocation.testContainerAllocateWithComplexLabels

Error Message:
App state is not correct (timedout) expected:<ACCEPTED> but was:<NEW>

Stack Trace:
java.lang.AssertionError: App state is not correct (timedout) expected:<ACCEPTED> but was:<NEW>
	at org.junit.Assert.fail(Assert.java:88)
	at org.junit.Assert.failNotEquals(Assert.java:743)
	at org.junit.Assert.assertEquals(Assert.java:118)
	at org.apache.hadoop.yarn.server.resourcemanager.MockRM.waitForState(MockRM.java:134)
	at org.apache.hadoop.yarn.server.resourcemanager.MockRM.submitApp(MockRM.java:422)
	at org.apache.hadoop.yarn.server.resourcemanager.MockRM.submitApp(MockRM.java:314)
	at org.apache.hadoop.yarn.server.resourcemanager.MockRM.submitApp(MockRM.java:306)
	at org.apache.hadoop.yarn.server.resourcemanager.MockRM.submitApp(MockRM.java:297)
	at org.apache.hadoop.yarn.server.resourcemanager.MockRM.submitApp(MockRM.java:290)
	at org.apache.hadoop.yarn.server.resourcemanager.MockRM.submitApp(MockRM.java:273)
	at org.apache.hadoop.yarn.server.resourcemanager.scheduler.capacity.TestContainerAllocation.testContainerAllocateWithComplexLabels(TestContainerAllocation.java:570)


FAILED:  org.apache.hadoop.yarn.server.resourcemanager.scheduler.capacity.TestContainerAllocation.testContainerAllocateWithDefaultQueueLabels

Error Message:
App state is not correct (timedout) expected:<ACCEPTED> but was:<NEW>

Stack Trace:
java.lang.AssertionError: App state is not correct (timedout) expected:<ACCEPTED> but was:<NEW>
	at org.junit.Assert.fail(Assert.java:88)
	at org.junit.Assert.failNotEquals(Assert.java:743)
	at org.junit.Assert.assertEquals(Assert.java:118)
	at org.apache.hadoop.yarn.server.resourcemanager.MockRM.waitForState(MockRM.java:134)
	at org.apache.hadoop.yarn.server.resourcemanager.MockRM.submitApp(MockRM.java:422)
	at org.apache.hadoop.yarn.server.resourcemanager.MockRM.submitApp(MockRM.java:314)
	at org.apache.hadoop.yarn.server.resourcemanager.MockRM.submitApp(MockRM.java:306)
	at org.apache.hadoop.yarn.server.resourcemanager.MockRM.submitApp(MockRM.java:297)
	at org.apache.hadoop.yarn.server.resourcemanager.MockRM.submitApp(MockRM.java:290)
	at org.apache.hadoop.yarn.server.resourcemanager.MockRM.submitApp(MockRM.java:273)
	at org.apache.hadoop.yarn.server.resourcemanager.scheduler.capacity.TestContainerAllocation.testContainerAllocateWithDefaultQueueLabels(TestContainerAllocation.java:725)


FAILED:  org.apache.hadoop.yarn.server.resourcemanager.scheduler.capacity.TestContainerAllocation.testLogAggregationContextPassedIntoContainerToken

Error Message:
App state is not correct (timedout) expected:<ACCEPTED> but was:<NEW>

Stack Trace:
java.lang.AssertionError: App state is not correct (timedout) expected:<ACCEPTED> but was:<NEW>
	at org.junit.Assert.fail(Assert.java:88)
	at org.junit.Assert.failNotEquals(Assert.java:743)
	at org.junit.Assert.assertEquals(Assert.java:118)
	at org.apache.hadoop.yarn.server.resourcemanager.MockRM.waitForState(MockRM.java:134)
	at org.apache.hadoop.yarn.server.resourcemanager.MockRM.submitApp(MockRM.java:422)
	at org.apache.hadoop.yarn.server.resourcemanager.MockRM.submitApp(MockRM.java:340)
	at org.apache.hadoop.yarn.server.resourcemanager.scheduler.capacity.TestContainerAllocation.getLogAggregationContextFromContainerToken(TestContainerAllocation.java:245)
	at org.apache.hadoop.yarn.server.resourcemanager.scheduler.capacity.TestContainerAllocation.testLogAggregationContextPassedIntoContainerToken(TestContainerAllocation.java:227)


FAILED:  org.apache.hadoop.yarn.server.resourcemanager.scheduler.capacity.TestContainerAllocation.testContainerAllocateWithLabels

Error Message:
App state is not correct (timedout) expected:<ACCEPTED> but was:<NEW>

Stack Trace:
java.lang.AssertionError: App state is not correct (timedout) expected:<ACCEPTED> but was:<NEW>
	at org.junit.Assert.fail(Assert.java:88)
	at org.junit.Assert.failNotEquals(Assert.java:743)
	at org.junit.Assert.assertEquals(Assert.java:118)
	at org.apache.hadoop.yarn.server.resourcemanager.MockRM.waitForState(MockRM.java:134)
	at org.apache.hadoop.yarn.server.resourcemanager.MockRM.submitApp(MockRM.java:422)
	at org.apache.hadoop.yarn.server.resourcemanager.MockRM.submitApp(MockRM.java:314)
	at org.apache.hadoop.yarn.server.resourcemanager.MockRM.submitApp(MockRM.java:306)
	at org.apache.hadoop.yarn.server.resourcemanager.MockRM.submitApp(MockRM.java:297)
	at org.apache.hadoop.yarn.server.resourcemanager.MockRM.submitApp(MockRM.java:290)
	at org.apache.hadoop.yarn.server.resourcemanager.MockRM.submitApp(MockRM.java:273)
	at org.apache.hadoop.yarn.server.resourcemanager.scheduler.capacity.TestContainerAllocation.testContainerAllocateWithLabels(TestContainerAllocation.java:649)


FAILED:  org.apache.hadoop.yarn.server.resourcemanager.scheduler.capacity.TestContainerAllocation.testAMContainerAllocationWhenDNSUnavailable

Error Message:
test timed out after 30000 milliseconds

Stack Trace:
java.lang.Exception: test timed out after 30000 milliseconds
	at java.lang.Thread.sleep(Native Method)
	at org.apache.hadoop.yarn.server.resourcemanager.MockRM.waitForState(MockRM.java:131)
	at org.apache.hadoop.yarn.server.resourcemanager.MockRM.submitApp(MockRM.java:422)
	at org.apache.hadoop.yarn.server.resourcemanager.MockRM.submitApp(MockRM.java:314)
	at org.apache.hadoop.yarn.server.resourcemanager.MockRM.submitApp(MockRM.java:306)
	at org.apache.hadoop.yarn.server.resourcemanager.MockRM.submitApp(MockRM.java:297)
	at org.apache.hadoop.yarn.server.resourcemanager.MockRM.submitApp(MockRM.java:290)
	at org.apache.hadoop.yarn.server.resourcemanager.MockRM.submitApp(MockRM.java:259)
	at org.apache.hadoop.yarn.server.resourcemanager.MockRM.submitApp(MockRM.java:247)
	at org.apache.hadoop.yarn.server.resourcemanager.MockRM.submitApp(MockRM.java:242)
	at org.apache.hadoop.yarn.server.resourcemanager.scheduler.capacity.TestContainerAllocation.testAMContainerAllocationWhenDNSUnavailable(TestContainerAllocation.java:307)


FAILED:  org.apache.hadoop.yarn.server.resourcemanager.scheduler.capacity.TestContainerAllocation.testContainerTokenGeneratedOnPullRequest

Error Message:
App state is not correct (timedout) expected:<ACCEPTED> but was:<NEW>

Stack Trace:
java.lang.AssertionError: App state is not correct (timedout) expected:<ACCEPTED> but was:<NEW>
	at org.junit.Assert.fail(Assert.java:88)
	at org.junit.Assert.failNotEquals(Assert.java:743)
	at org.junit.Assert.assertEquals(Assert.java:118)
	at org.apache.hadoop.yarn.server.resourcemanager.MockRM.waitForState(MockRM.java:134)
	at org.apache.hadoop.yarn.server.resourcemanager.MockRM.submitApp(MockRM.java:422)
	at org.apache.hadoop.yarn.server.resourcemanager.MockRM.submitApp(MockRM.java:314)
	at org.apache.hadoop.yarn.server.resourcemanager.MockRM.submitApp(MockRM.java:306)
	at org.apache.hadoop.yarn.server.resourcemanager.MockRM.submitApp(MockRM.java:297)
	at org.apache.hadoop.yarn.server.resourcemanager.MockRM.submitApp(MockRM.java:290)
	at org.apache.hadoop.yarn.server.resourcemanager.MockRM.submitApp(MockRM.java:259)
	at org.apache.hadoop.yarn.server.resourcemanager.MockRM.submitApp(MockRM.java:247)
	at org.apache.hadoop.yarn.server.resourcemanager.MockRM.submitApp(MockRM.java:242)
	at org.apache.hadoop.yarn.server.resourcemanager.scheduler.capacity.TestContainerAllocation.testContainerTokenGeneratedOnPullRequest(TestContainerAllocation.java:163)


FAILED:  org.apache.hadoop.yarn.server.resourcemanager.scheduler.capacity.TestContainerAllocation.testExcessReservationThanNodeManagerCapacity

Error Message:
org.apache.hadoop.yarn.server.api.protocolrecords.NodeHeartbeatResponse.setAppAggregatorsMap(Ljava/util/Map;)V

Stack Trace:
java.lang.NoSuchMethodError: org.apache.hadoop.yarn.server.api.protocolrecords.NodeHeartbeatResponse.setAppAggregatorsMap(Ljava/util/Map;)V
	at org.apache.hadoop.yarn.server.resourcemanager.ResourceTrackerService.nodeHeartbeat(ResourceTrackerService.java:443)
	at org.apache.hadoop.yarn.server.resourcemanager.MockNM.nodeHeartbeat(MockNM.java:174)
	at org.apache.hadoop.yarn.server.resourcemanager.MockNM.nodeHeartbeat(MockNM.java:132)
	at org.apache.hadoop.yarn.server.resourcemanager.scheduler.capacity.TestContainerAllocation.testExcessReservationThanNodeManagerCapacity(TestContainerAllocation.java:98)


FAILED:  org.apache.hadoop.yarn.server.resourcemanager.scheduler.capacity.TestContainerAllocation.testNormalContainerAllocationWhenDNSUnavailable

Error Message:
App state is not correct (timedout) expected:<ACCEPTED> but was:<NEW>

Stack Trace:
java.lang.AssertionError: App state is not correct (timedout) expected:<ACCEPTED> but was:<NEW>
	at org.junit.Assert.fail(Assert.java:88)
	at org.junit.Assert.failNotEquals(Assert.java:743)
	at org.junit.Assert.assertEquals(Assert.java:118)
	at org.apache.hadoop.yarn.server.resourcemanager.MockRM.waitForState(MockRM.java:134)
	at org.apache.hadoop.yarn.server.resourcemanager.MockRM.submitApp(MockRM.java:422)
	at org.apache.hadoop.yarn.server.resourcemanager.MockRM.submitApp(MockRM.java:314)
	at org.apache.hadoop.yarn.server.resourcemanager.MockRM.submitApp(MockRM.java:306)
	at org.apache.hadoop.yarn.server.resourcemanager.MockRM.submitApp(MockRM.java:297)
	at org.apache.hadoop.yarn.server.resourcemanager.MockRM.submitApp(MockRM.java:290)
	at org.apache.hadoop.yarn.server.resourcemanager.MockRM.submitApp(MockRM.java:259)
	at org.apache.hadoop.yarn.server.resourcemanager.MockRM.submitApp(MockRM.java:247)
	at org.apache.hadoop.yarn.server.resourcemanager.MockRM.submitApp(MockRM.java:242)
	at org.apache.hadoop.yarn.server.resourcemanager.scheduler.capacity.TestContainerAllocation.testNormalContainerAllocationWhenDNSUnavailable(TestContainerAllocation.java:192)


FAILED:  org.apache.hadoop.yarn.server.resourcemanager.scheduler.capacity.TestContainerAllocation.testContainerAllocationWithSingleUserLimits

Error Message:
App state is not correct (timedout) expected:<ACCEPTED> but was:<NEW>

Stack Trace:
java.lang.AssertionError: App state is not correct (timedout) expected:<ACCEPTED> but was:<NEW>
	at org.junit.Assert.fail(Assert.java:88)
	at org.junit.Assert.failNotEquals(Assert.java:743)
	at org.junit.Assert.assertEquals(Assert.java:118)
	at org.apache.hadoop.yarn.server.resourcemanager.MockRM.waitForState(MockRM.java:134)
	at org.apache.hadoop.yarn.server.resourcemanager.MockRM.submitApp(MockRM.java:422)
	at org.apache.hadoop.yarn.server.resourcemanager.MockRM.submitApp(MockRM.java:314)
	at org.apache.hadoop.yarn.server.resourcemanager.MockRM.submitApp(MockRM.java:306)
	at org.apache.hadoop.yarn.server.resourcemanager.MockRM.submitApp(MockRM.java:297)
	at org.apache.hadoop.yarn.server.resourcemanager.MockRM.submitApp(MockRM.java:290)
	at org.apache.hadoop.yarn.server.resourcemanager.MockRM.submitApp(MockRM.java:273)
	at org.apache.hadoop.yarn.server.resourcemanager.scheduler.capacity.TestContainerAllocation.testContainerAllocationWithSingleUserLimits(TestContainerAllocation.java:480)


FAILED:  org.apache.hadoop.yarn.server.resourcemanager.scheduler.capacity.TestQueueMappings.testQueueMapping

Error Message:
test timed out after 60000 milliseconds

Stack Trace:
java.lang.Exception: test timed out after 60000 milliseconds
	at java.lang.Thread.sleep(Native Method)
	at org.apache.hadoop.yarn.server.resourcemanager.MockRM.waitForState(MockRM.java:131)
	at org.apache.hadoop.yarn.server.resourcemanager.scheduler.capacity.TestQueueMappings.checkAppQueue(TestQueueMappings.java:198)
	at org.apache.hadoop.yarn.server.resourcemanager.scheduler.capacity.TestQueueMappings.testQueueMapping(TestQueueMappings.java:152)


FAILED:  org.apache.hadoop.yarn.server.resourcemanager.scheduler.fair.TestFairScheduler.testNotAllowSubmitApplication

Error Message:
null

Stack Trace:
java.lang.NullPointerException: null
	at org.apache.hadoop.yarn.proto.YarnServerResourceManagerRecoveryProtos$ApplicationStateDataProto$Builder.setAggregatorAddr(YarnServerResourceManagerRecoveryProtos.java:1729)
	at org.apache.hadoop.yarn.server.resourcemanager.recovery.records.impl.pb.ApplicationStateDataPBImpl.setAggregatorAddr(ApplicationStateDataPBImpl.java:117)
	at org.apache.hadoop.yarn.server.resourcemanager.recovery.records.ApplicationStateData.newInstance(ApplicationStateData.java:65)
	at org.apache.hadoop.yarn.server.resourcemanager.recovery.records.ApplicationStateData.newInstance(ApplicationStateData.java:48)
	at org.apache.hadoop.yarn.server.resourcemanager.recovery.records.ApplicationStateData.newInstance(ApplicationStateData.java:71)
	at org.apache.hadoop.yarn.server.resourcemanager.recovery.RMStateStore.storeNewApplication(RMStateStore.java:598)
	at org.apache.hadoop.yarn.server.resourcemanager.rmapp.RMAppImpl$RMAppNewlySavingTransition.transition(RMAppImpl.java:1026)
	at org.apache.hadoop.yarn.server.resourcemanager.rmapp.RMAppImpl$RMAppNewlySavingTransition.transition(RMAppImpl.java:1017)
	at org.apache.hadoop.yarn.state.StateMachineFactory$SingleInternalArc.doTransition(StateMachineFactory.java:362)
	at org.apache.hadoop.yarn.state.StateMachineFactory.doTransition(StateMachineFactory.java:302)
	at org.apache.hadoop.yarn.state.StateMachineFactory.access$300(StateMachineFactory.java:46)
	at org.apache.hadoop.yarn.state.StateMachineFactory$InternalStateMachine.doTransition(StateMachineFactory.java:448)
	at org.apache.hadoop.yarn.server.resourcemanager.rmapp.RMAppImpl.handle(RMAppImpl.java:741)
	at org.apache.hadoop.yarn.server.resourcemanager.rmapp.RMAppImpl.handle(RMAppImpl.java:100)
	at org.apache.hadoop.yarn.server.resourcemanager.scheduler.fair.TestFairScheduler.testNotAllowSubmitApplication(TestFairScheduler.java:2679)


FAILED:  org.apache.hadoop.yarn.server.resourcemanager.scheduler.fair.TestFairSchedulerQueueACLs.testApplicationACLs

Error Message:
App state is not correct (timedout) expected:<ACCEPTED> but was:<NEW>

Stack Trace:
java.lang.AssertionError: App state is not correct (timedout) expected:<ACCEPTED> but was:<NEW>
	at org.junit.Assert.fail(Assert.java:88)
	at org.junit.Assert.failNotEquals(Assert.java:743)
	at org.junit.Assert.assertEquals(Assert.java:118)
	at org.apache.hadoop.yarn.server.resourcemanager.MockRM.waitForState(MockRM.java:134)
	at org.apache.hadoop.yarn.server.resourcemanager.QueueACLsTestBase.submitAppAndGetAppId(QueueACLsTestBase.java:231)
	at org.apache.hadoop.yarn.server.resourcemanager.QueueACLsTestBase.verifyKillAppSuccess(QueueACLsTestBase.java:193)
	at org.apache.hadoop.yarn.server.resourcemanager.QueueACLsTestBase.testApplicationACLs(QueueACLsTestBase.java:124)
	at sun.reflect.NativeMethodAccessorImpl.invoke0(Native Method)
	at sun.reflect.NativeMethodAccessorImpl.invoke(NativeMethodAccessorImpl.java:57)
	at sun.reflect.DelegatingMethodAccessorImpl.invoke(DelegatingMethodAccessorImpl.java:43)
	at java.lang.reflect.Method.invoke(Method.java:606)
	at org.junit.runners.model.FrameworkMethod$1.runReflectiveCall(FrameworkMethod.java:47)
	at org.junit.internal.runners.model.ReflectiveCallable.run(ReflectiveCallable.java:12)
	at org.junit.runners.model.FrameworkMethod.invokeExplosively(FrameworkMethod.java:44)
	at org.junit.internal.runners.statements.InvokeMethod.evaluate(InvokeMethod.java:17)
	at org.junit.internal.runners.statements.RunBefores.evaluate(RunBefores.java:26)
	at org.junit.internal.runners.statements.RunAfters.evaluate(RunAfters.java:27)
	at org.junit.runners.ParentRunner.runLeaf(ParentRunner.java:271)
	at org.junit.runners.BlockJUnit4ClassRunner.runChild(BlockJUnit4ClassRunner.java:70)
	at org.junit.runners.BlockJUnit4ClassRunner.runChild(BlockJUnit4ClassRunner.java:50)
	at org.junit.runners.ParentRunner$3.run(ParentRunner.java:238)
	at org.junit.runners.ParentRunner$1.schedule(ParentRunner.java:63)
	at org.junit.runners.ParentRunner.runChildren(ParentRunner.java:236)
	at org.junit.runners.ParentRunner.access$000(ParentRunner.java:53)
	at org.junit.runners.ParentRunner$2.evaluate(ParentRunner.java:229)
	at org.junit.runners.ParentRunner.run(ParentRunner.java:309)
	at org.apache.maven.surefire.junit4.JUnit4Provider.execute(JUnit4Provider.java:264)
	at org.apache.maven.surefire.junit4.JUnit4Provider.executeTestSet(JUnit4Provider.java:153)
	at org.apache.maven.surefire.junit4.JUnit4Provider.invoke(JUnit4Provider.java:124)
	at org.apache.maven.surefire.booter.ForkedBooter.invokeProviderInSameClassLoader(ForkedBooter.java:200)
	at org.apache.maven.surefire.booter.ForkedBooter.runSuitesInProcess(ForkedBooter.java:153)
	at org.apache.maven.surefire.booter.ForkedBooter.main(ForkedBooter.java:103)


FAILED:  org.apache.hadoop.yarn.server.resourcemanager.security.TestClientToAMTokens.testClientToAMTokens[0]

Error Message:
App state is not correct (timedout) expected:<ACCEPTED> but was:<NEW>

Stack Trace:
java.lang.AssertionError: App state is not correct (timedout) expected:<ACCEPTED> but was:<NEW>
	at org.junit.Assert.fail(Assert.java:88)
	at org.junit.Assert.failNotEquals(Assert.java:743)
	at org.junit.Assert.assertEquals(Assert.java:118)
	at org.apache.hadoop.yarn.server.resourcemanager.MockRM.waitForState(MockRM.java:134)
	at org.apache.hadoop.yarn.server.resourcemanager.MockRM.submitApp(MockRM.java:422)
	at org.apache.hadoop.yarn.server.resourcemanager.MockRM.submitApp(MockRM.java:314)
	at org.apache.hadoop.yarn.server.resourcemanager.MockRM.submitApp(MockRM.java:306)
	at org.apache.hadoop.yarn.server.resourcemanager.MockRM.submitApp(MockRM.java:297)
	at org.apache.hadoop.yarn.server.resourcemanager.MockRM.submitApp(MockRM.java:290)
	at org.apache.hadoop.yarn.server.resourcemanager.MockRM.submitApp(MockRM.java:259)
	at org.apache.hadoop.yarn.server.resourcemanager.MockRM.submitApp(MockRM.java:247)
	at org.apache.hadoop.yarn.server.resourcemanager.MockRM.submitApp(MockRM.java:242)
	at org.apache.hadoop.yarn.server.resourcemanager.security.TestClientToAMTokens.testClientToAMTokens(TestClientToAMTokens.java:213)


FAILED:  org.apache.hadoop.yarn.server.resourcemanager.security.TestClientToAMTokens.testClientTokenRace[0]

Error Message:
java.net.BindException: Problem binding to [0.0.0.0:8032] java.net.BindException: Address already in use; For more details see:  http://wiki.apache.org/hadoop/BindException

Stack Trace:
org.apache.hadoop.yarn.exceptions.YarnRuntimeException: java.net.BindException: Problem binding to [0.0.0.0:8032] java.net.BindException: Address already in use; For more details see:  http://wiki.apache.org/hadoop/BindException
	at sun.nio.ch.Net.bind0(Native Method)
	at sun.nio.ch.Net.bind(Net.java:444)
	at sun.nio.ch.Net.bind(Net.java:436)
	at sun.nio.ch.ServerSocketChannelImpl.bind(ServerSocketChannelImpl.java:214)
	at sun.nio.ch.ServerSocketAdaptor.bind(ServerSocketAdaptor.java:74)
	at org.apache.hadoop.ipc.Server.bind(Server.java:411)
	at org.apache.hadoop.ipc.Server$Listener.<init>(Server.java:577)
	at org.apache.hadoop.ipc.Server.<init>(Server.java:2301)
	at org.apache.hadoop.ipc.RPC$Server.<init>(RPC.java:942)
	at org.apache.hadoop.ipc.ProtobufRpcEngine$Server.<init>(ProtobufRpcEngine.java:534)
	at org.apache.hadoop.ipc.ProtobufRpcEngine.getServer(ProtobufRpcEngine.java:509)
	at org.apache.hadoop.ipc.RPC$Builder.build(RPC.java:787)
	at org.apache.hadoop.yarn.factories.impl.pb.RpcServerFactoryPBImpl.createServer(RpcServerFactoryPBImpl.java:169)
	at org.apache.hadoop.yarn.factories.impl.pb.RpcServerFactoryPBImpl.getServer(RpcServerFactoryPBImpl.java:132)
	at org.apache.hadoop.yarn.ipc.HadoopYarnProtoRPC.getServer(HadoopYarnProtoRPC.java:65)
	at org.apache.hadoop.yarn.ipc.YarnRPC.getServer(YarnRPC.java:54)
	at org.apache.hadoop.yarn.server.resourcemanager.ClientRMService.serviceStart(ClientRMService.java:219)
	at org.apache.hadoop.service.AbstractService.start(AbstractService.java:193)
	at org.apache.hadoop.service.CompositeService.serviceStart(CompositeService.java:120)
	at org.apache.hadoop.yarn.server.resourcemanager.ResourceManager$RMActiveServices.serviceStart(ResourceManager.java:583)
	at org.apache.hadoop.service.AbstractService.start(AbstractService.java:193)
	at org.apache.hadoop.yarn.server.resourcemanager.ResourceManager.startActiveServices(ResourceManager.java:993)
	at org.apache.hadoop.yarn.server.resourcemanager.ResourceManager$1.run(ResourceManager.java:1034)
	at org.apache.hadoop.yarn.server.resourcemanager.ResourceManager$1.run(ResourceManager.java:1030)
	at java.security.AccessController.doPrivileged(Native Method)
	at javax.security.auth.Subject.doAs(Subject.java:415)
	at org.apache.hadoop.security.UserGroupInformation.doAs(UserGroupInformation.java:1669)
	at org.apache.hadoop.yarn.server.resourcemanager.ResourceManager.transitionToActive(ResourceManager.java:1030)
	at org.apache.hadoop.yarn.server.resourcemanager.ResourceManager.serviceStart(ResourceManager.java:1070)
	at org.apache.hadoop.service.AbstractService.start(AbstractService.java:193)
	at org.apache.hadoop.yarn.server.resourcemanager.security.TestClientToAMTokens.testClientTokenRace(TestClientToAMTokens.java:452)


FAILED:  org.apache.hadoop.yarn.server.resourcemanager.security.TestClientToAMTokens.testClientToAMTokens[1]

Error Message:
org.apache.hadoop.yarn.server.resourcemanager.scheduler.QueueMetrics cannot be cast to org.apache.hadoop.yarn.server.resourcemanager.scheduler.fair.FSQueueMetrics

Stack Trace:
java.lang.ClassCastException: org.apache.hadoop.yarn.server.resourcemanager.scheduler.QueueMetrics cannot be cast to org.apache.hadoop.yarn.server.resourcemanager.scheduler.fair.FSQueueMetrics
	at org.apache.hadoop.yarn.server.resourcemanager.scheduler.fair.FSQueueMetrics.forQueue(FSQueueMetrics.java:118)
	at org.apache.hadoop.yarn.server.resourcemanager.scheduler.fair.FairScheduler.initScheduler(FairScheduler.java:1330)
	at org.apache.hadoop.yarn.server.resourcemanager.scheduler.fair.FairScheduler.serviceInit(FairScheduler.java:1383)
	at org.apache.hadoop.service.AbstractService.init(AbstractService.java:163)
	at org.apache.hadoop.service.CompositeService.serviceInit(CompositeService.java:107)
	at org.apache.hadoop.yarn.server.resourcemanager.ResourceManager$RMActiveServices.serviceInit(ResourceManager.java:555)
	at org.apache.hadoop.service.AbstractService.init(AbstractService.java:163)
	at org.apache.hadoop.yarn.server.resourcemanager.ResourceManager.createAndInitActiveServices(ResourceManager.java:983)
	at org.apache.hadoop.yarn.server.resourcemanager.ResourceManager.serviceInit(ResourceManager.java:250)
	at org.apache.hadoop.service.AbstractService.init(AbstractService.java:163)
	at org.apache.hadoop.yarn.server.resourcemanager.MockRM.<init>(MockRM.java:108)
	at org.apache.hadoop.yarn.server.resourcemanager.MockRM.<init>(MockRM.java:103)
	at org.apache.hadoop.yarn.server.resourcemanager.MockRMWithCustomAMLauncher.<init>(MockRMWithCustomAMLauncher.java:45)
	at org.apache.hadoop.yarn.server.resourcemanager.security.TestClientToAMTokens$1.<init>(TestClientToAMTokens.java:194)
	at org.apache.hadoop.yarn.server.resourcemanager.security.TestClientToAMTokens.testClientToAMTokens(TestClientToAMTokens.java:194)


FAILED:  org.apache.hadoop.yarn.server.resourcemanager.security.TestClientToAMTokens.testClientTokenRace[1]

Error Message:
java.net.BindException: Problem binding to [0.0.0.0:8032] java.net.BindException: Address already in use; For more details see:  http://wiki.apache.org/hadoop/BindException

Stack Trace:
org.apache.hadoop.yarn.exceptions.YarnRuntimeException: java.net.BindException: Problem binding to [0.0.0.0:8032] java.net.BindException: Address already in use; For more details see:  http://wiki.apache.org/hadoop/BindException
	at sun.nio.ch.Net.bind0(Native Method)
	at sun.nio.ch.Net.bind(Net.java:444)
	at sun.nio.ch.Net.bind(Net.java:436)
	at sun.nio.ch.ServerSocketChannelImpl.bind(ServerSocketChannelImpl.java:214)
	at sun.nio.ch.ServerSocketAdaptor.bind(ServerSocketAdaptor.java:74)
	at org.apache.hadoop.ipc.Server.bind(Server.java:411)
	at org.apache.hadoop.ipc.Server$Listener.<init>(Server.java:577)
	at org.apache.hadoop.ipc.Server.<init>(Server.java:2301)
	at org.apache.hadoop.ipc.RPC$Server.<init>(RPC.java:942)
	at org.apache.hadoop.ipc.ProtobufRpcEngine$Server.<init>(ProtobufRpcEngine.java:534)
	at org.apache.hadoop.ipc.ProtobufRpcEngine.getServer(ProtobufRpcEngine.java:509)
	at org.apache.hadoop.ipc.RPC$Builder.build(RPC.java:787)
	at org.apache.hadoop.yarn.factories.impl.pb.RpcServerFactoryPBImpl.createServer(RpcServerFactoryPBImpl.java:169)
	at org.apache.hadoop.yarn.factories.impl.pb.RpcServerFactoryPBImpl.getServer(RpcServerFactoryPBImpl.java:132)
	at org.apache.hadoop.yarn.ipc.HadoopYarnProtoRPC.getServer(HadoopYarnProtoRPC.java:65)
	at org.apache.hadoop.yarn.ipc.YarnRPC.getServer(YarnRPC.java:54)
	at org.apache.hadoop.yarn.server.resourcemanager.ClientRMService.serviceStart(ClientRMService.java:219)
	at org.apache.hadoop.service.AbstractService.start(AbstractService.java:193)
	at org.apache.hadoop.service.CompositeService.serviceStart(CompositeService.java:120)
	at org.apache.hadoop.yarn.server.resourcemanager.ResourceManager$RMActiveServices.serviceStart(ResourceManager.java:583)
	at org.apache.hadoop.service.AbstractService.start(AbstractService.java:193)
	at org.apache.hadoop.yarn.server.resourcemanager.ResourceManager.startActiveServices(ResourceManager.java:993)
	at org.apache.hadoop.yarn.server.resourcemanager.ResourceManager$1.run(ResourceManager.java:1034)
	at org.apache.hadoop.yarn.server.resourcemanager.ResourceManager$1.run(ResourceManager.java:1030)
	at java.security.AccessController.doPrivileged(Native Method)
	at javax.security.auth.Subject.doAs(Subject.java:415)
	at org.apache.hadoop.security.UserGroupInformation.doAs(UserGroupInformation.java:1669)
	at org.apache.hadoop.yarn.server.resourcemanager.ResourceManager.transitionToActive(ResourceManager.java:1030)
	at org.apache.hadoop.yarn.server.resourcemanager.ResourceManager.serviceStart(ResourceManager.java:1070)
	at org.apache.hadoop.service.AbstractService.start(AbstractService.java:193)
	at org.apache.hadoop.yarn.server.resourcemanager.security.TestClientToAMTokens.testClientTokenRace(TestClientToAMTokens.java:452)


FAILED:  org.apache.hadoop.yarn.server.resourcemanager.security.TestDelegationTokenRenewer.testAppSubmissionWithPreviousToken

Error Message:
test timed out after 30000 milliseconds

Stack Trace:
java.lang.Exception: test timed out after 30000 milliseconds
	at java.lang.Thread.sleep(Native Method)
	at org.apache.hadoop.yarn.server.resourcemanager.MockRM.waitForState(MockRM.java:131)
	at org.apache.hadoop.yarn.server.resourcemanager.MockRM.submitApp(MockRM.java:422)
	at org.apache.hadoop.yarn.server.resourcemanager.security.TestDelegationTokenRenewer.testAppSubmissionWithPreviousToken(TestDelegationTokenRenewer.java:1005)


FAILED:  org.apache.hadoop.yarn.server.resourcemanager.security.TestDelegationTokenRenewer.testReplaceExpiringDelegationToken

Error Message:
test timed out after 20000 milliseconds

Stack Trace:
java.lang.Exception: test timed out after 20000 milliseconds
	at java.lang.Thread.sleep(Native Method)
	at org.apache.hadoop.yarn.server.resourcemanager.MockRM.waitForState(MockRM.java:131)
	at org.apache.hadoop.yarn.server.resourcemanager.MockRM.submitApp(MockRM.java:422)
	at org.apache.hadoop.yarn.server.resourcemanager.MockRM.submitApp(MockRM.java:314)
	at org.apache.hadoop.yarn.server.resourcemanager.MockRM.submitApp(MockRM.java:306)
	at org.apache.hadoop.yarn.server.resourcemanager.MockRM.submitApp(MockRM.java:297)
	at org.apache.hadoop.yarn.server.resourcemanager.MockRM.submitApp(MockRM.java:290)
	at org.apache.hadoop.yarn.server.resourcemanager.security.TestDelegationTokenRenewer.testReplaceExpiringDelegationToken(TestDelegationTokenRenewer.java:891)


FAILED:  org.apache.hadoop.yarn.server.resourcemanager.security.TestDelegationTokenRenewer.testAppSubmissionWithoutDelegationToken

Error Message:
App state is not correct (timedout) expected:<ACCEPTED> but was:<NEW>

Stack Trace:
java.lang.AssertionError: App state is not correct (timedout) expected:<ACCEPTED> but was:<NEW>
	at org.junit.Assert.fail(Assert.java:88)
	at org.junit.Assert.failNotEquals(Assert.java:743)
	at org.junit.Assert.assertEquals(Assert.java:118)
	at org.apache.hadoop.yarn.server.resourcemanager.MockRM.waitForState(MockRM.java:134)
	at org.apache.hadoop.yarn.server.resourcemanager.MockRM.submitApp(MockRM.java:422)
	at org.apache.hadoop.yarn.server.resourcemanager.MockRM.submitApp(MockRM.java:314)
	at org.apache.hadoop.yarn.server.resourcemanager.MockRM.submitApp(MockRM.java:306)
	at org.apache.hadoop.yarn.server.resourcemanager.MockRM.submitApp(MockRM.java:297)
	at org.apache.hadoop.yarn.server.resourcemanager.MockRM.submitApp(MockRM.java:290)
	at org.apache.hadoop.yarn.server.resourcemanager.MockRM.submitApp(MockRM.java:259)
	at org.apache.hadoop.yarn.server.resourcemanager.MockRM.submitApp(MockRM.java:247)
	at org.apache.hadoop.yarn.server.resourcemanager.MockRM.submitApp(MockRM.java:242)
	at org.apache.hadoop.yarn.server.resourcemanager.security.TestDelegationTokenRenewer.testAppSubmissionWithoutDelegationToken(TestDelegationTokenRenewer.java:956)



Mime
  • Unnamed multipart/mixed (inline, None, 0 bytes)
View raw message