hadoop-yarn-dev mailing list archives

Site index · List index
Message view « Date » · « Thread »
Top « Date » · « Thread »
From Apache Jenkins Server <jenk...@builds.apache.org>
Subject Failed: YARN-3025 PreCommit Build #6630
Date Fri, 13 Feb 2015 05:48:43 GMT
Jira: https://issues.apache.org/jira/browse/YARN-3025
Build: https://builds.apache.org/job/PreCommit-YARN-Build/6630/

###################################################################################
########################## LAST 60 LINES OF THE CONSOLE ###########################
[...truncated 3279 lines...]

    {color:green}+1 @author{color}.  The patch does not contain any @author tags.

    {color:green}+1 tests included{color}.  The patch appears to include 1 new or modified
test files.

    {color:green}+1 javac{color}.  The applied patch does not increase the total number of
javac compiler warnings.

    {color:green}+1 javadoc{color}.  There were no new javadoc warning messages.

    {color:green}+1 eclipse:eclipse{color}.  The patch built with eclipse:eclipse.

    {color:green}+1 findbugs{color}.  The patch does not introduce any new Findbugs (version
2.0.3) warnings.

    {color:green}+1 release audit{color}.  The applied patch does not increase the total number
of release audit warnings.

    {color:red}-1 core tests{color}.  The patch failed these unit tests in hadoop-yarn-project/hadoop-yarn/hadoop-yarn-client:

                  org.apache.hadoop.yarn.client.TestApplicationMasterServiceProtocolOnHA

                                      The following test timeouts occurred in hadoop-yarn-project/hadoop-yarn/hadoop-yarn-client:

org.apache.hadoop.yarn.client.TestRMFailover

Test results: https://builds.apache.org/job/PreCommit-YARN-Build/6630//testReport/
Console output: https://builds.apache.org/job/PreCommit-YARN-Build/6630//console

This message is automatically generated.


======================================================================
======================================================================
    Adding comment to Jira.
======================================================================
======================================================================


Comment added.
b01da0cee57620bb243ccdf23f5ed6f1c1366f67 logged out


======================================================================
======================================================================
    Finished build.
======================================================================
======================================================================


Build step 'Execute shell' marked build as failure
Archiving artifacts
Sending artifact delta relative to PreCommit-YARN-Build #6622
Archived 15 artifacts
Archive block size is 32768
Received 2 blocks and 8710552 bytes
Compression is 0.7%
Took 2.2 sec
[description-setter] Could not determine description.
Recording test results
Email was triggered for: Failure
Sending email for trigger: Failure



###################################################################################
############################## FAILED TESTS (if any) ##############################
3 tests failed.
FAILED:  org.apache.hadoop.yarn.client.TestApplicationMasterServiceProtocolOnHA.testRegisterApplicationMasterOnHA

Error Message:
java.io.IOException: ResourceManager failed to start. Final state is STOPPED

Stack Trace:
org.apache.hadoop.yarn.exceptions.YarnRuntimeException: java.io.IOException: ResourceManager
failed to start. Final state is STOPPED
	at org.apache.hadoop.yarn.server.MiniYARNCluster.startResourceManager(MiniYARNCluster.java:325)
	at org.apache.hadoop.yarn.server.MiniYARNCluster.access$500(MiniYARNCluster.java:97)
	at org.apache.hadoop.yarn.server.MiniYARNCluster$ResourceManagerWrapper.serviceStart(MiniYARNCluster.java:450)
	at org.apache.hadoop.service.AbstractService.start(AbstractService.java:193)
	at org.apache.hadoop.service.CompositeService.serviceStart(CompositeService.java:120)
	at org.apache.hadoop.service.AbstractService.start(AbstractService.java:193)
	at org.apache.hadoop.yarn.client.ProtocolHATestBase.startHACluster(ProtocolHATestBase.java:302)
	at org.apache.hadoop.yarn.client.TestApplicationMasterServiceProtocolOnHA.initialize(TestApplicationMasterServiceProtocolOnHA.java:55)


FAILED:  org.apache.hadoop.yarn.client.TestApplicationMasterServiceProtocolOnHA.testFinishApplicationMasterOnHA

Error Message:
java.io.IOException: ResourceManager failed to start. Final state is STOPPED

Stack Trace:
org.apache.hadoop.yarn.exceptions.YarnRuntimeException: java.io.IOException: ResourceManager
failed to start. Final state is STOPPED
	at org.apache.hadoop.yarn.server.MiniYARNCluster.startResourceManager(MiniYARNCluster.java:325)
	at org.apache.hadoop.yarn.server.MiniYARNCluster.access$500(MiniYARNCluster.java:97)
	at org.apache.hadoop.yarn.server.MiniYARNCluster$ResourceManagerWrapper.serviceStart(MiniYARNCluster.java:450)
	at org.apache.hadoop.service.AbstractService.start(AbstractService.java:193)
	at org.apache.hadoop.service.CompositeService.serviceStart(CompositeService.java:120)
	at org.apache.hadoop.service.AbstractService.start(AbstractService.java:193)
	at org.apache.hadoop.yarn.client.ProtocolHATestBase.startHACluster(ProtocolHATestBase.java:302)
	at org.apache.hadoop.yarn.client.TestApplicationMasterServiceProtocolOnHA.initialize(TestApplicationMasterServiceProtocolOnHA.java:55)


FAILED:  org.apache.hadoop.yarn.client.TestApplicationMasterServiceProtocolOnHA.testAllocateOnHA

Error Message:
java.io.IOException: ResourceManager failed to start. Final state is STOPPED

Stack Trace:
org.apache.hadoop.yarn.exceptions.YarnRuntimeException: java.io.IOException: ResourceManager
failed to start. Final state is STOPPED
	at org.apache.hadoop.yarn.server.MiniYARNCluster.startResourceManager(MiniYARNCluster.java:325)
	at org.apache.hadoop.yarn.server.MiniYARNCluster.access$500(MiniYARNCluster.java:97)
	at org.apache.hadoop.yarn.server.MiniYARNCluster$ResourceManagerWrapper.serviceStart(MiniYARNCluster.java:450)
	at org.apache.hadoop.service.AbstractService.start(AbstractService.java:193)
	at org.apache.hadoop.service.CompositeService.serviceStart(CompositeService.java:120)
	at org.apache.hadoop.service.AbstractService.start(AbstractService.java:193)
	at org.apache.hadoop.yarn.client.ProtocolHATestBase.startHACluster(ProtocolHATestBase.java:302)
	at org.apache.hadoop.yarn.client.TestApplicationMasterServiceProtocolOnHA.initialize(TestApplicationMasterServiceProtocolOnHA.java:55)



Mime
  • Unnamed multipart/mixed (inline, None, 0 bytes)
View raw message