hadoop-yarn-dev mailing list archives

Site index · List index
Message view « Date » · « Thread »
Top « Date » · « Thread »
From Apache Jenkins Server <jenk...@builds.apache.org>
Subject Failed: YARN-2725 PreCommit Build #6627
Date Fri, 13 Feb 2015 04:30:28 GMT
Jira: https://issues.apache.org/jira/browse/YARN-2725
Build: https://builds.apache.org/job/PreCommit-YARN-Build/6627/

###################################################################################
########################## LAST 60 LINES OF THE CONSOLE ###########################
[...truncated 3465 lines...]
    {color:green}+1 @author{color}.  The patch does not contain any @author tags.

    {color:green}+1 tests included{color}.  The patch appears to include 1 new or modified
test files.

    {color:green}+1 javac{color}.  The applied patch does not increase the total number of
javac compiler warnings.

    {color:green}+1 javadoc{color}.  There were no new javadoc warning messages.

    {color:green}+1 eclipse:eclipse{color}.  The patch built with eclipse:eclipse.

    {color:red}-1 findbugs{color}.  The patch appears to introduce 5 new Findbugs (version
2.0.3) warnings.

    {color:green}+1 release audit{color}.  The applied patch does not increase the total number
of release audit warnings.

    {color:red}-1 core tests{color}.  The patch failed these unit tests in hadoop-yarn-project/hadoop-yarn/hadoop-yarn-server/hadoop-yarn-server-resourcemanager:

                  org.apache.hadoop.yarn.server.resourcemanager.scheduler.fair.TestSchedulingPolicy

                                      The following test timeouts occurred in hadoop-yarn-project/hadoop-yarn/hadoop-yarn-server/hadoop-yarn-server-resourcemanager:

org.apache.hadoop.yarn.server.resourcemanager.webapp.TestRMWebServicesAppsModification

Test results: https://builds.apache.org/job/PreCommit-YARN-Build/6627//testReport/
Findbugs warnings: https://builds.apache.org/job/PreCommit-YARN-Build/6627//artifact/patchprocess/newPatchFindbugsWarningshadoop-yarn-server-resourcemanager.html
Console output: https://builds.apache.org/job/PreCommit-YARN-Build/6627//console

This message is automatically generated.


======================================================================
======================================================================
    Adding comment to Jira.
======================================================================
======================================================================


Comment added.
365e17c51c39812fb02c94beaa9852011abc705c logged out


======================================================================
======================================================================
    Finished build.
======================================================================
======================================================================


Build step 'Execute shell' marked build as failure
Archiving artifacts
Sending artifact delta relative to PreCommit-YARN-Build #6622
Archived 15 artifacts
Archive block size is 32768
Received 2 blocks and 8981742 bytes
Compression is 0.7%
Took 2.2 sec
[description-setter] Could not determine description.
Recording test results
Email was triggered for: Failure
Sending email for trigger: Failure



###################################################################################
############################## FAILED TESTS (if any) ##############################
1 tests failed.
FAILED:  org.apache.hadoop.yarn.server.resourcemanager.scheduler.fair.TestSchedulingPolicy.testIsApplicableTo

Error Message:
test timed out after 1000 milliseconds

Stack Trace:
java.lang.Exception: test timed out after 1000 milliseconds
	at java.lang.ClassLoader.defineClass1(Native Method)
	at java.lang.ClassLoader.defineClass(ClassLoader.java:800)
	at java.security.SecureClassLoader.defineClass(SecureClassLoader.java:142)
	at java.net.URLClassLoader.defineClass(URLClassLoader.java:449)
	at java.net.URLClassLoader.access$100(URLClassLoader.java:71)
	at java.net.URLClassLoader$1.run(URLClassLoader.java:361)
	at java.net.URLClassLoader$1.run(URLClassLoader.java:355)
	at java.security.AccessController.doPrivileged(Native Method)
	at java.net.URLClassLoader.findClass(URLClassLoader.java:354)
	at java.lang.ClassLoader.loadClass(ClassLoader.java:425)
	at sun.misc.Launcher$AppClassLoader.loadClass(Launcher.java:308)
	at java.lang.ClassLoader.loadClass(ClassLoader.java:358)
	at org.mockito.cglib.proxy.CallbackInfo.<clinit>(CallbackInfo.java:52)
	at org.mockito.cglib.proxy.Enhancer.setCallbackTypes(Enhancer.java:274)
	at org.mockito.internal.creation.jmock.ClassImposterizer.createProxyClass(ClassImposterizer.java:84)
	at org.mockito.internal.creation.jmock.ClassImposterizer.imposterise(ClassImposterizer.java:50)
	at org.mockito.internal.util.MockUtil.createMock(MockUtil.java:54)
	at org.mockito.internal.MockitoCore.mock(MockitoCore.java:45)
	at org.mockito.Mockito.mock(Mockito.java:921)
	at org.mockito.Mockito.mock(Mockito.java:816)
	at org.apache.hadoop.yarn.server.resourcemanager.scheduler.fair.TestSchedulingPolicy.testIsApplicableTo(TestSchedulingPolicy.java:116)



Mime
  • Unnamed multipart/mixed (inline, None, 0 bytes)
View raw message