hadoop-yarn-dev mailing list archives

Site index · List index
Message view « Date » · « Thread »
Top « Date » · « Thread »
From Apache Jenkins Server <jenk...@builds.apache.org>
Subject Failed: YARN-3145 PreCommit Build #6517
Date Thu, 05 Feb 2015 07:52:58 GMT
Jira: https://issues.apache.org/jira/browse/YARN-3145
Build: https://builds.apache.org/job/PreCommit-YARN-Build/6517/

###################################################################################
########################## LAST 60 LINES OF THE CONSOLE ###########################
[...truncated 3439 lines...]
  http://issues.apache.org/jira/secure/attachment/12696681/YARN-3145.001.patch
  against trunk revision 0b567f4.

    {color:green}+1 @author{color}.  The patch does not contain any @author tags.

    {color:red}-1 tests included{color}.  The patch doesn't appear to include any new or modified
tests.
                        Please justify why no new tests are needed for this patch.
                        Also please list what manual steps were performed to verify this patch.

    {color:green}+1 javac{color}.  The applied patch does not increase the total number of
javac compiler warnings.

    {color:green}+1 javadoc{color}.  There were no new javadoc warning messages.

    {color:green}+1 eclipse:eclipse{color}.  The patch built with eclipse:eclipse.

    {color:green}+1 findbugs{color}.  The patch does not introduce any new Findbugs (version
2.0.3) warnings.

    {color:green}+1 release audit{color}.  The applied patch does not increase the total number
of release audit warnings.

    {color:red}-1 core tests{color}.  The patch failed these unit tests in hadoop-yarn-project/hadoop-yarn/hadoop-yarn-server/hadoop-yarn-server-resourcemanager:

                  org.apache.hadoop.yarn.server.resourcemanager.recovery.TestFSRMStateStore

Test results: https://builds.apache.org/job/PreCommit-YARN-Build/6517//testReport/
Console output: https://builds.apache.org/job/PreCommit-YARN-Build/6517//console

This message is automatically generated.


======================================================================
======================================================================
    Adding comment to Jira.
======================================================================
======================================================================


Comment added.
230d590a01c549186d5b9d538e972505d4dbb8c5 logged out


======================================================================
======================================================================
    Finished build.
======================================================================
======================================================================


Build step 'Execute shell' marked build as failure
Archiving artifacts
Sending artifact delta relative to PreCommit-YARN-Build #6515
Archived 15 artifacts
Archive block size is 32768
Received 50 blocks and 7352532 bytes
Compression is 18.2%
Took 1.9 sec
[description-setter] Could not determine description.
Recording test results
Email was triggered for: Failure
Sending email for trigger: Failure



###################################################################################
############################## FAILED TESTS (if any) ##############################
1 tests failed.
FAILED:  org.apache.hadoop.yarn.server.resourcemanager.recovery.TestFSRMStateStore.testFSRMStateStoreClientRetry

Error Message:
null

Stack Trace:
java.lang.AssertionError: null
	at org.junit.Assert.fail(Assert.java:86)
	at org.junit.Assert.assertTrue(Assert.java:41)
	at org.junit.Assert.assertFalse(Assert.java:64)
	at org.junit.Assert.assertFalse(Assert.java:74)
	at org.apache.hadoop.yarn.server.resourcemanager.recovery.TestFSRMStateStore.testFSRMStateStoreClientRetry(TestFSRMStateStore.java:289)



Mime
  • Unnamed multipart/mixed (inline, None, 0 bytes)
View raw message