hadoop-yarn-dev mailing list archives

Site index · List index
Message view « Date » · « Thread »
Top « Date » · « Thread »
From Apache Jenkins Server <jenk...@builds.apache.org>
Subject Failed: YARN-1514 PreCommit Build #6631
Date Fri, 13 Feb 2015 10:22:28 GMT
Jira: https://issues.apache.org/jira/browse/YARN-1514
Build: https://builds.apache.org/job/PreCommit-YARN-Build/6631/

###################################################################################
########################## LAST 60 LINES OF THE CONSOLE ###########################
[...truncated 3451 lines...]
  http://issues.apache.org/jira/secure/attachment/12698679/YARN-1514.6.patch
  against trunk revision ba3c80a.

    {color:green}+1 @author{color}.  The patch does not contain any @author tags.

    {color:green}+1 tests included{color}.  The patch appears to include 2 new or modified
test files.

      {color:red}-1 javac{color}.  The applied patch generated 1152 javac compiler warnings
(more than the trunk's current 1151 warnings).

    {color:green}+1 javadoc{color}.  There were no new javadoc warning messages.

    {color:green}+1 eclipse:eclipse{color}.  The patch built with eclipse:eclipse.

    {color:red}-1 findbugs{color}.  The patch appears to introduce 5 new Findbugs (version
2.0.3) warnings.

    {color:green}+1 release audit{color}.  The applied patch does not increase the total number
of release audit warnings.

    {color:red}-1 core tests{color}.  The patch failed these unit tests in hadoop-yarn-project/hadoop-yarn/hadoop-yarn-server/hadoop-yarn-server-resourcemanager:

                  org.apache.hadoop.yarn.server.resourcemanager.recovery.TestFSRMStateStore

Test results: https://builds.apache.org/job/PreCommit-YARN-Build/6631//testReport/
Findbugs warnings: https://builds.apache.org/job/PreCommit-YARN-Build/6631//artifact/patchprocess/newPatchFindbugsWarningshadoop-yarn-server-resourcemanager.html
Javac warnings: https://builds.apache.org/job/PreCommit-YARN-Build/6631//artifact/patchprocess/diffJavacWarnings.txt
Console output: https://builds.apache.org/job/PreCommit-YARN-Build/6631//console

This message is automatically generated.


======================================================================
======================================================================
    Adding comment to Jira.
======================================================================
======================================================================


Comment added.
08ededabe762509d797c94d9edaacd344f2109de logged out


======================================================================
======================================================================
    Finished build.
======================================================================
======================================================================


Build step 'Execute shell' marked build as failure
Archiving artifacts
Sending artifact delta relative to PreCommit-YARN-Build #6622
Archived 16 artifacts
Archive block size is 32768
Received 2 blocks and 8986352 bytes
Compression is 0.7%
Took 2 sec
Description set: MAPREDUCE-6255
Recording test results
Email was triggered for: Failure
Sending email for trigger: Failure



###################################################################################
############################## FAILED TESTS (if any) ##############################
1 tests failed.
FAILED:  org.apache.hadoop.yarn.server.resourcemanager.recovery.TestFSRMStateStore.testFSRMStateStoreClientRetry

Error Message:
null

Stack Trace:
java.lang.AssertionError: null
	at org.junit.Assert.fail(Assert.java:86)
	at org.junit.Assert.assertTrue(Assert.java:41)
	at org.junit.Assert.assertFalse(Assert.java:64)
	at org.junit.Assert.assertFalse(Assert.java:74)
	at org.apache.hadoop.yarn.server.resourcemanager.recovery.TestFSRMStateStore.testFSRMStateStoreClientRetry(TestFSRMStateStore.java:289)



Mime
  • Unnamed multipart/mixed (inline, None, 0 bytes)
View raw message