hadoop-yarn-dev mailing list archives

Site index · List index
Message view « Date » · « Thread »
Top « Date » · « Thread »
From Apache Jenkins Server <jenk...@builds.apache.org>
Subject Failed: YARN-3076 PreCommit Build #6664
Date Thu, 19 Feb 2015 04:51:29 GMT
Jira: https://issues.apache.org/jira/browse/YARN-3076
Build: https://builds.apache.org/job/PreCommit-YARN-Build/6664/

###################################################################################
########################## LAST 60 LINES OF THE CONSOLE ###########################
[...truncated 4300 lines...]
  http://issues.apache.org/jira/secure/attachment/12699124/YARN-3076.003.patch
  against trunk revision b8a14ef.

    {color:green}+1 @author{color}.  The patch does not contain any @author tags.

    {color:green}+1 tests included{color}.  The patch appears to include 4 new or modified
test files.

    {color:green}+1 javac{color}.  The applied patch does not increase the total number of
javac compiler warnings.

    {color:green}+1 javadoc{color}.  There were no new javadoc warning messages.

    {color:green}+1 eclipse:eclipse{color}.  The patch built with eclipse:eclipse.

    {color:red}-1 findbugs{color}.  The patch appears to introduce 5 new Findbugs (version
2.0.3) warnings.

    {color:green}+1 release audit{color}.  The applied patch does not increase the total number
of release audit warnings.

    {color:red}-1 core tests{color}.  The patch failed these unit tests in hadoop-mapreduce-project/hadoop-mapreduce-client/hadoop-mapreduce-client-jobclient
hadoop-yarn-project/hadoop-yarn/hadoop-yarn-api hadoop-yarn-project/hadoop-yarn/hadoop-yarn-client
hadoop-yarn-project/hadoop-yarn/hadoop-yarn-common hadoop-yarn-project/hadoop-yarn/hadoop-yarn-server/hadoop-yarn-server-resourcemanager:

                  org.apache.hadoop.conf.TestJobConf
                  org.apache.hadoop.yarn.server.resourcemanager.recovery.TestFSRMStateStore

Test results: https://builds.apache.org/job/PreCommit-YARN-Build/6664//testReport/
Findbugs warnings: https://builds.apache.org/job/PreCommit-YARN-Build/6664//artifact/patchprocess/newPatchFindbugsWarningshadoop-yarn-server-resourcemanager.html
Console output: https://builds.apache.org/job/PreCommit-YARN-Build/6664//console

This message is automatically generated.


======================================================================
======================================================================
    Adding comment to Jira.
======================================================================
======================================================================


Comment added.
4cbc8358eeca8419890b09a4512348bbe0eeff16 logged out


======================================================================
======================================================================
    Finished build.
======================================================================
======================================================================


Build step 'Execute shell' marked build as failure
Archiving artifacts
Sending artifact delta relative to PreCommit-YARN-Build #6663
Archived 35 artifacts
Archive block size is 32768
Received 224 blocks and 2540984 bytes
Compression is 74.3%
Took 1.1 sec
[description-setter] Could not determine description.
Recording test results
Email was triggered for: Failure
Sending email for trigger: Failure



###################################################################################
############################## FAILED TESTS (if any) ##############################
2 tests failed.
FAILED:  org.apache.hadoop.conf.TestJobConf.testNegativeValueForTaskVmem

Error Message:
expected:<1024> but was:<-1>

Stack Trace:
java.lang.AssertionError: expected:<1024> but was:<-1>
	at org.junit.Assert.fail(Assert.java:88)
	at org.junit.Assert.failNotEquals(Assert.java:743)
	at org.junit.Assert.assertEquals(Assert.java:118)
	at org.junit.Assert.assertEquals(Assert.java:555)
	at org.junit.Assert.assertEquals(Assert.java:542)
	at org.apache.hadoop.conf.TestJobConf.testNegativeValueForTaskVmem(TestJobConf.java:111)


FAILED:  org.apache.hadoop.yarn.server.resourcemanager.recovery.TestFSRMStateStore.testFSRMStateStoreClientRetry

Error Message:
null

Stack Trace:
java.lang.AssertionError: null
	at org.junit.Assert.fail(Assert.java:86)
	at org.junit.Assert.assertTrue(Assert.java:41)
	at org.junit.Assert.assertFalse(Assert.java:64)
	at org.junit.Assert.assertFalse(Assert.java:74)
	at org.apache.hadoop.yarn.server.resourcemanager.recovery.TestFSRMStateStore.testFSRMStateStoreClientRetry(TestFSRMStateStore.java:289)



Mime
  • Unnamed multipart/mixed (inline, None, 0 bytes)
View raw message