hadoop-yarn-dev mailing list archives

Site index · List index
Message view « Date » · « Thread »
Top « Date » · « Thread »
From Apache Jenkins Server <jenk...@builds.apache.org>
Subject Failed: YARN-3265 PreCommit Build #6748
Date Thu, 26 Feb 2015 02:02:07 GMT
Jira: https://issues.apache.org/jira/browse/YARN-3265
Build: https://builds.apache.org/job/PreCommit-YARN-Build/6748/

###################################################################################
########################## LAST 60 LINES OF THE CONSOLE ###########################
[...truncated 3495 lines...]
  http://issues.apache.org/jira/secure/attachment/12700919/YARN-3265.1.patch
  against trunk revision d140d76.

    {color:green}+1 @author{color}.  The patch does not contain any @author tags.

    {color:green}+1 tests included{color}.  The patch appears to include 2 new or modified
test files.

    {color:green}+1 javac{color}.  The applied patch does not increase the total number of
javac compiler warnings.

    {color:green}+1 javadoc{color}.  There were no new javadoc warning messages.

    {color:green}+1 eclipse:eclipse{color}.  The patch built with eclipse:eclipse.

    {color:red}-1 findbugs{color}.  The patch appears to introduce 5 new Findbugs (version
2.0.3) warnings.

    {color:green}+1 release audit{color}.  The applied patch does not increase the total number
of release audit warnings.

    {color:red}-1 core tests{color}.  The patch failed these unit tests in hadoop-yarn-project/hadoop-yarn/hadoop-yarn-server/hadoop-yarn-server-resourcemanager:

                  org.apache.hadoop.yarn.server.resourcemanager.scheduler.TestResourceUsage
                  org.apache.hadoop.yarn.server.resourcemanager.recovery.TestFSRMStateStore

Test results: https://builds.apache.org/job/PreCommit-YARN-Build/6748//testReport/
Findbugs warnings: https://builds.apache.org/job/PreCommit-YARN-Build/6748//artifact/patchprocess/newPatchFindbugsWarningshadoop-yarn-server-resourcemanager.html
Console output: https://builds.apache.org/job/PreCommit-YARN-Build/6748//console

This message is automatically generated.


======================================================================
======================================================================
    Adding comment to Jira.
======================================================================
======================================================================


Comment added.
8c513c523639de976c3432236a24bf3a2fa23492 logged out


======================================================================
======================================================================
    Finished build.
======================================================================
======================================================================


Build step 'Execute shell' marked build as failure
Archiving artifacts
Sending artifact delta relative to PreCommit-YARN-Build #6747
Archived 15 artifacts
Archive block size is 32768
Received 53 blocks and 7333075 bytes
Compression is 19.1%
Took 2.1 sec
[description-setter] Could not determine description.
Recording test results
Email was triggered for: Failure
Sending email for trigger: Failure



###################################################################################
############################## FAILED TESTS (if any) ##############################
2 tests failed.
FAILED:  org.apache.hadoop.yarn.server.resourcemanager.recovery.TestFSRMStateStore.testFSRMStateStoreClientRetry

Error Message:
null

Stack Trace:
java.lang.AssertionError: null
	at org.junit.Assert.fail(Assert.java:86)
	at org.junit.Assert.assertTrue(Assert.java:41)
	at org.junit.Assert.assertFalse(Assert.java:64)
	at org.junit.Assert.assertFalse(Assert.java:74)
	at org.apache.hadoop.yarn.server.resourcemanager.recovery.TestFSRMStateStore.testFSRMStateStoreClientRetry(TestFSRMStateStore.java:289)


FAILED:  org.apache.hadoop.yarn.server.resourcemanager.scheduler.TestResourceUsage.testModifyAndRead[2]

Error Message:
expected:<1> but was:<-2147483647>

Stack Trace:
java.lang.AssertionError: expected:<1> but was:<-2147483647>
	at org.junit.Assert.fail(Assert.java:88)
	at org.junit.Assert.failNotEquals(Assert.java:743)
	at org.junit.Assert.assertEquals(Assert.java:118)
	at org.junit.Assert.assertEquals(Assert.java:555)
	at org.junit.Assert.assertEquals(Assert.java:542)
	at org.apache.hadoop.yarn.server.resourcemanager.scheduler.TestResourceUsage.check(TestResourceUsage.java:128)
	at org.apache.hadoop.yarn.server.resourcemanager.scheduler.TestResourceUsage.internalTestModifyAndRead(TestResourceUsage.java:116)
	at org.apache.hadoop.yarn.server.resourcemanager.scheduler.TestResourceUsage.testModifyAndRead(TestResourceUsage.java:135)



Mime
  • Unnamed multipart/mixed (inline, None, 0 bytes)
View raw message