hadoop-yarn-dev mailing list archives

Site index · List index
Message view « Date » · « Thread »
Top « Date » · « Thread »
From Apache Jenkins Server <jenk...@builds.apache.org>
Subject Failed: YARN-3251 PreCommit Build #6744
Date Wed, 25 Feb 2015 23:31:18 GMT
Jira: https://issues.apache.org/jira/browse/YARN-3251
Build: https://builds.apache.org/job/PreCommit-YARN-Build/6744/

###################################################################################
########################## LAST 60 LINES OF THE CONSOLE ###########################
[...truncated 3485 lines...]
{color:red}-1 overall{color}.  Here are the results of testing the latest attachment 
  http://issues.apache.org/jira/secure/attachment/12700875/YARN-3251.trunk.1.patch
  against trunk revision caa42ad.

    {color:green}+1 @author{color}.  The patch does not contain any @author tags.

    {color:green}+1 tests included{color}.  The patch appears to include 2 new or modified
test files.

    {color:green}+1 javac{color}.  The applied patch does not increase the total number of
javac compiler warnings.

    {color:green}+1 javadoc{color}.  There were no new javadoc warning messages.

    {color:green}+1 eclipse:eclipse{color}.  The patch built with eclipse:eclipse.

    {color:red}-1 findbugs{color}.  The patch appears to introduce 5 new Findbugs (version
2.0.3) warnings.

    {color:green}+1 release audit{color}.  The applied patch does not increase the total number
of release audit warnings.

    {color:red}-1 core tests{color}.  The patch failed these unit tests in hadoop-yarn-project/hadoop-yarn/hadoop-yarn-server/hadoop-yarn-server-resourcemanager:

                  org.apache.hadoop.yarn.server.resourcemanager.scheduler.TestResourceUsage

Test results: https://builds.apache.org/job/PreCommit-YARN-Build/6744//testReport/
Findbugs warnings: https://builds.apache.org/job/PreCommit-YARN-Build/6744//artifact/patchprocess/newPatchFindbugsWarningshadoop-yarn-server-resourcemanager.html
Console output: https://builds.apache.org/job/PreCommit-YARN-Build/6744//console

This message is automatically generated.


======================================================================
======================================================================
    Adding comment to Jira.
======================================================================
======================================================================


Comment added.
4ae5a8d902ba178392bcd3d570b9a03f63d97c94 logged out


======================================================================
======================================================================
    Finished build.
======================================================================
======================================================================


Build step 'Execute shell' marked build as failure
Archiving artifacts
Sending artifact delta relative to PreCommit-YARN-Build #6742
Archived 15 artifacts
Archive block size is 32768
Received 54 blocks and 7299220 bytes
Compression is 19.5%
Took 2 sec
[description-setter] Could not determine description.
Recording test results
Email was triggered for: Failure
Sending email for trigger: Failure



###################################################################################
############################## FAILED TESTS (if any) ##############################
1 tests failed.
FAILED:  org.apache.hadoop.yarn.server.resourcemanager.scheduler.TestResourceUsage.testModifyAndRead[2]

Error Message:
expected:<1> but was:<-2147483647>

Stack Trace:
java.lang.AssertionError: expected:<1> but was:<-2147483647>
	at org.junit.Assert.fail(Assert.java:88)
	at org.junit.Assert.failNotEquals(Assert.java:743)
	at org.junit.Assert.assertEquals(Assert.java:118)
	at org.junit.Assert.assertEquals(Assert.java:555)
	at org.junit.Assert.assertEquals(Assert.java:542)
	at org.apache.hadoop.yarn.server.resourcemanager.scheduler.TestResourceUsage.check(TestResourceUsage.java:128)
	at org.apache.hadoop.yarn.server.resourcemanager.scheduler.TestResourceUsage.internalTestModifyAndRead(TestResourceUsage.java:116)
	at org.apache.hadoop.yarn.server.resourcemanager.scheduler.TestResourceUsage.testModifyAndRead(TestResourceUsage.java:135)



Mime
  • Unnamed multipart/mixed (inline, None, 0 bytes)
View raw message