hadoop-yarn-dev mailing list archives

Site index · List index
Message view « Date » · « Thread »
Top « Date » · « Thread »
From Apache Jenkins Server <jenk...@builds.apache.org>
Subject Build failed in Jenkins: Hadoop-Yarn-trunk #842
Date Wed, 18 Feb 2015 11:35:52 GMT
See <https://builds.apache.org/job/Hadoop-Yarn-trunk/842/changes>

Changes:

[ozawa] HADOOP-11600. Fix up source codes to be compiled with Guava 17.0. (ozawa)

[umamahesh] HDFS-7797. Add audit log for setQuota operation (Rakesh R via umamahesh)

[umamahesh] HDFS-4266. BKJM: Separate write and ack quorum (Rakesh R via umamahesh)

[stevel] HADOOP-11570. S3AInputStream.close() downloads the remaining bytes of the object
from S3. (Dan Hecht via stevel).

[aw] HDFS-7803. Wrong command mentioned in HDFSHighAvailabilityWithQJM documentation (Arshad
Mohammad via aw)

[aw] MAPREDUCE-6260. Convert site documentation to markdown (Masatake Iwasaki via aw)

[aw] HADOOP-11575. Daemon log documentation is misleading (Naganarasimha G R via aw)

[stevel] HADOOP-11522. Update S3A Documentation. (Thomas Demoor via stevel)

[kihwal] HDFS-7795. Show warning if not all favored nodes were chosen by namenode. Contributed
by Kihwal Lee.

[raviprak] HADOOP-11596. Allow smart-apply-patch.sh to add new files in binary git patches
(raviprak)

[stevel] HADOOP-11596 moving entry in CHANGES.TXT up to improvements there, as it wasn't in
2.7 & it was confusing diffs

[stevel] HADOOP-11521. Make connection timeout configurable in s3a. (Thomas Demoor via stevel)

[wheat9] HDFS-6662. WebHDFS cannot open a file if its path contains "%". Contributed by Gerson
Carlos.

[kasha] MAPREDUCE-6234. TestHighRamJob fails due to the change in MAPREDUCE-5785. (Masatake
Iwasaki via kasha)

[aajisaka] HDFS-7780. Update use of Iterator to Iterable in DataXceiverServer and SnapshotDiffInfo.
Contributed by Ray Chiang.

[kihwal] HADOOP-11295. RPC Server Reader thread can't shutdown if RPCCallQueue is full. Contributed
by Ming Ma.

[xgong] YARN-3207. Secondary filter matches entites which do not have the key

[ozawa] MAPREDUCE-4286. TestClientProtocolProviderImpls passes on failure conditions. Contributed
by Devaraj K.

[aw] HADOOP-11593. Convert site documentation from apt to markdown (stragglers) (Masatake
Iwasaki via aw)

[ozawa] HADOOP-11599. Client#getTimeout should use IPC_CLIENT_PING_DEFAULT when IPC_CLIENT_PING_KEY
is not configured. Contributed by zhihai xu.

------------------------------------------
[...truncated 8354 lines...]
Running org.apache.hadoop.yarn.server.resourcemanager.scheduler.capacity.TestLeafQueue
Tests run: 24, Failures: 0, Errors: 0, Skipped: 0, Time elapsed: 20.721 sec - in org.apache.hadoop.yarn.server.resourcemanager.scheduler.capacity.TestLeafQueue
Running org.apache.hadoop.yarn.server.resourcemanager.scheduler.capacity.TestQueueParsing
Tests run: 12, Failures: 0, Errors: 0, Skipped: 0, Time elapsed: 2.904 sec - in org.apache.hadoop.yarn.server.resourcemanager.scheduler.capacity.TestQueueParsing
Running org.apache.hadoop.yarn.server.resourcemanager.scheduler.capacity.TestParentQueue
Tests run: 9, Failures: 0, Errors: 0, Skipped: 0, Time elapsed: 3.765 sec - in org.apache.hadoop.yarn.server.resourcemanager.scheduler.capacity.TestParentQueue
Running org.apache.hadoop.yarn.server.resourcemanager.scheduler.capacity.TestApplicationLimits
Tests run: 5, Failures: 0, Errors: 0, Skipped: 0, Time elapsed: 2.711 sec - in org.apache.hadoop.yarn.server.resourcemanager.scheduler.capacity.TestApplicationLimits
Running org.apache.hadoop.yarn.server.resourcemanager.scheduler.capacity.TestCapacitySchedulerQueueACLs
Tests run: 1, Failures: 0, Errors: 0, Skipped: 0, Time elapsed: 52.275 sec - in org.apache.hadoop.yarn.server.resourcemanager.scheduler.capacity.TestCapacitySchedulerQueueACLs
Running org.apache.hadoop.yarn.server.resourcemanager.scheduler.capacity.TestQueueMappings
Tests run: 1, Failures: 0, Errors: 0, Skipped: 0, Time elapsed: 10.734 sec - in org.apache.hadoop.yarn.server.resourcemanager.scheduler.capacity.TestQueueMappings
Running org.apache.hadoop.yarn.server.resourcemanager.scheduler.capacity.TestReservationQueue
Tests run: 1, Failures: 0, Errors: 0, Skipped: 0, Time elapsed: 1.505 sec - in org.apache.hadoop.yarn.server.resourcemanager.scheduler.capacity.TestReservationQueue
Running org.apache.hadoop.yarn.server.resourcemanager.scheduler.capacity.TestReservations
Tests run: 9, Failures: 0, Errors: 0, Skipped: 0, Time elapsed: 4.021 sec - in org.apache.hadoop.yarn.server.resourcemanager.scheduler.capacity.TestReservations
Running org.apache.hadoop.yarn.server.resourcemanager.scheduler.capacity.TestCapacitySchedulerDynamicBehavior
Tests run: 4, Failures: 0, Errors: 0, Skipped: 0, Time elapsed: 8.605 sec - in org.apache.hadoop.yarn.server.resourcemanager.scheduler.capacity.TestCapacitySchedulerDynamicBehavior
Running org.apache.hadoop.yarn.server.resourcemanager.scheduler.capacity.TestCapacitySchedulerNodeLabelUpdate
Tests run: 1, Failures: 0, Errors: 0, Skipped: 0, Time elapsed: 7.19 sec - in org.apache.hadoop.yarn.server.resourcemanager.scheduler.capacity.TestCapacitySchedulerNodeLabelUpdate
Running org.apache.hadoop.yarn.server.resourcemanager.scheduler.capacity.TestCSQueueUtils
Tests run: 3, Failures: 0, Errors: 0, Skipped: 0, Time elapsed: 1.842 sec - in org.apache.hadoop.yarn.server.resourcemanager.scheduler.capacity.TestCSQueueUtils
Running org.apache.hadoop.yarn.server.resourcemanager.scheduler.capacity.TestCapacityScheduler
Tests run: 36, Failures: 0, Errors: 0, Skipped: 0, Time elapsed: 66.602 sec - in org.apache.hadoop.yarn.server.resourcemanager.scheduler.capacity.TestCapacityScheduler
Running org.apache.hadoop.yarn.server.resourcemanager.scheduler.TestQueueMetrics
Tests run: 7, Failures: 0, Errors: 0, Skipped: 0, Time elapsed: 2.736 sec - in org.apache.hadoop.yarn.server.resourcemanager.scheduler.TestQueueMetrics
Running org.apache.hadoop.yarn.server.resourcemanager.scheduler.TestSchedulerUtils
Tests run: 8, Failures: 0, Errors: 0, Skipped: 0, Time elapsed: 5.547 sec - in org.apache.hadoop.yarn.server.resourcemanager.scheduler.TestSchedulerUtils
Running org.apache.hadoop.yarn.server.resourcemanager.scheduler.TestSchedulerApplicationAttempt
Tests run: 1, Failures: 0, Errors: 0, Skipped: 0, Time elapsed: 0.961 sec - in org.apache.hadoop.yarn.server.resourcemanager.scheduler.TestSchedulerApplicationAttempt
Running org.apache.hadoop.yarn.server.resourcemanager.scheduler.fair.TestFairSchedulerConfiguration
Tests run: 5, Failures: 0, Errors: 0, Skipped: 0, Time elapsed: 0.506 sec - in org.apache.hadoop.yarn.server.resourcemanager.scheduler.fair.TestFairSchedulerConfiguration
Running org.apache.hadoop.yarn.server.resourcemanager.scheduler.fair.TestFairSchedulerPreemption
Tests run: 1, Failures: 0, Errors: 0, Skipped: 0, Time elapsed: 2.53 sec - in org.apache.hadoop.yarn.server.resourcemanager.scheduler.fair.TestFairSchedulerPreemption
Running org.apache.hadoop.yarn.server.resourcemanager.scheduler.fair.TestQueuePlacementPolicy
Tests run: 16, Failures: 0, Errors: 0, Skipped: 0, Time elapsed: 0.709 sec - in org.apache.hadoop.yarn.server.resourcemanager.scheduler.fair.TestQueuePlacementPolicy
Running org.apache.hadoop.yarn.server.resourcemanager.scheduler.fair.TestComputeFairShares
Tests run: 9, Failures: 0, Errors: 0, Skipped: 0, Time elapsed: 0.535 sec - in org.apache.hadoop.yarn.server.resourcemanager.scheduler.fair.TestComputeFairShares
Running org.apache.hadoop.yarn.server.resourcemanager.scheduler.fair.TestFSAppAttempt
Tests run: 4, Failures: 0, Errors: 0, Skipped: 0, Time elapsed: 2.335 sec - in org.apache.hadoop.yarn.server.resourcemanager.scheduler.fair.TestFSAppAttempt
Running org.apache.hadoop.yarn.server.resourcemanager.scheduler.fair.TestFairSchedulerFairShare
Tests run: 6, Failures: 0, Errors: 0, Skipped: 0, Time elapsed: 3.647 sec - in org.apache.hadoop.yarn.server.resourcemanager.scheduler.fair.TestFairSchedulerFairShare
Running org.apache.hadoop.yarn.server.resourcemanager.scheduler.fair.TestAllocationFileLoaderService
Tests run: 9, Failures: 0, Errors: 0, Skipped: 0, Time elapsed: 0.957 sec - in org.apache.hadoop.yarn.server.resourcemanager.scheduler.fair.TestAllocationFileLoaderService
Running org.apache.hadoop.yarn.server.resourcemanager.scheduler.fair.TestMaxRunningAppsEnforcer
Tests run: 6, Failures: 0, Errors: 0, Skipped: 0, Time elapsed: 1.471 sec - in org.apache.hadoop.yarn.server.resourcemanager.scheduler.fair.TestMaxRunningAppsEnforcer
Running org.apache.hadoop.yarn.server.resourcemanager.scheduler.fair.TestFairSchedulerEventLog
Tests run: 1, Failures: 0, Errors: 0, Skipped: 0, Time elapsed: 1.701 sec - in org.apache.hadoop.yarn.server.resourcemanager.scheduler.fair.TestFairSchedulerEventLog
Running org.apache.hadoop.yarn.server.resourcemanager.scheduler.fair.TestQueueManager
Tests run: 2, Failures: 0, Errors: 0, Skipped: 0, Time elapsed: 1.18 sec - in org.apache.hadoop.yarn.server.resourcemanager.scheduler.fair.TestQueueManager
Running org.apache.hadoop.yarn.server.resourcemanager.scheduler.fair.TestFairSchedulerQueueACLs
Tests run: 1, Failures: 0, Errors: 0, Skipped: 0, Time elapsed: 50.195 sec - in org.apache.hadoop.yarn.server.resourcemanager.scheduler.fair.TestFairSchedulerQueueACLs
Running org.apache.hadoop.yarn.server.resourcemanager.scheduler.fair.policies.TestDominantResourceFairnessPolicy
Tests run: 9, Failures: 0, Errors: 0, Skipped: 0, Time elapsed: 0.529 sec - in org.apache.hadoop.yarn.server.resourcemanager.scheduler.fair.policies.TestDominantResourceFairnessPolicy
Running org.apache.hadoop.yarn.server.resourcemanager.scheduler.fair.policies.TestEmptyQueues
Tests run: 3, Failures: 0, Errors: 0, Skipped: 0, Time elapsed: 0.524 sec - in org.apache.hadoop.yarn.server.resourcemanager.scheduler.fair.policies.TestEmptyQueues
Running org.apache.hadoop.yarn.server.resourcemanager.scheduler.fair.TestFairScheduler
Tests run: 82, Failures: 1, Errors: 0, Skipped: 0, Time elapsed: 9.613 sec <<< FAILURE!
- in org.apache.hadoop.yarn.server.resourcemanager.scheduler.fair.TestFairScheduler
testContinuousScheduling(org.apache.hadoop.yarn.server.resourcemanager.scheduler.fair.TestFairScheduler)
 Time elapsed: 0.59 sec  <<< FAILURE!
java.lang.AssertionError: expected:<2> but was:<1>
	at org.junit.Assert.fail(Assert.java:88)
	at org.junit.Assert.failNotEquals(Assert.java:743)
	at org.junit.Assert.assertEquals(Assert.java:118)
	at org.junit.Assert.assertEquals(Assert.java:555)
	at org.junit.Assert.assertEquals(Assert.java:542)
	at org.apache.hadoop.yarn.server.resourcemanager.scheduler.fair.TestFairScheduler.testContinuousScheduling(TestFairScheduler.java:3590)

Running org.apache.hadoop.yarn.server.resourcemanager.scheduler.fair.TestFSLeafQueue
Tests run: 4, Failures: 0, Errors: 0, Skipped: 0, Time elapsed: 2.845 sec - in org.apache.hadoop.yarn.server.resourcemanager.scheduler.fair.TestFSLeafQueue
Running org.apache.hadoop.yarn.server.resourcemanager.scheduler.fair.TestSchedulingPolicy
Tests run: 2, Failures: 0, Errors: 0, Skipped: 0, Time elapsed: 0.664 sec - in org.apache.hadoop.yarn.server.resourcemanager.scheduler.fair.TestSchedulingPolicy
Running org.apache.hadoop.yarn.server.resourcemanager.scheduler.fair.TestContinuousScheduling
Tests run: 1, Failures: 0, Errors: 0, Skipped: 0, Time elapsed: 1.953 sec - in org.apache.hadoop.yarn.server.resourcemanager.scheduler.fair.TestContinuousScheduling
Running org.apache.hadoop.yarn.server.resourcemanager.TestContainerResourceUsage
Tests run: 4, Failures: 0, Errors: 0, Skipped: 0, Time elapsed: 38.229 sec - in org.apache.hadoop.yarn.server.resourcemanager.TestContainerResourceUsage
Running org.apache.hadoop.yarn.server.resourcemanager.TestAppManager
Tests run: 12, Failures: 0, Errors: 0, Skipped: 0, Time elapsed: 6.184 sec - in org.apache.hadoop.yarn.server.resourcemanager.TestAppManager
Running org.apache.hadoop.yarn.server.resourcemanager.TestResourceManager
Tests run: 5, Failures: 0, Errors: 0, Skipped: 0, Time elapsed: 4.526 sec - in org.apache.hadoop.yarn.server.resourcemanager.TestResourceManager
Running org.apache.hadoop.yarn.server.resourcemanager.TestApplicationCleanup
Tests run: 6, Failures: 0, Errors: 0, Skipped: 0, Time elapsed: 44.44 sec - in org.apache.hadoop.yarn.server.resourcemanager.TestApplicationCleanup
Running org.apache.hadoop.yarn.server.resourcemanager.TestWorkPreservingRMRestart
Tests run: 36, Failures: 0, Errors: 0, Skipped: 0, Time elapsed: 314.58 sec - in org.apache.hadoop.yarn.server.resourcemanager.TestWorkPreservingRMRestart
Running org.apache.hadoop.yarn.server.resourcemanager.TestRMHA
Tests run: 8, Failures: 0, Errors: 0, Skipped: 0, Time elapsed: 32.083 sec - in org.apache.hadoop.yarn.server.resourcemanager.TestRMHA
Running org.apache.hadoop.yarn.server.resourcemanager.TestRMRestart
Tests run: 48, Failures: 0, Errors: 0, Skipped: 0, Time elapsed: 385.825 sec - in org.apache.hadoop.yarn.server.resourcemanager.TestRMRestart
Running org.apache.hadoop.yarn.server.resourcemanager.TestRMNodeTransitions
Tests run: 17, Failures: 0, Errors: 0, Skipped: 0, Time elapsed: 1.689 sec - in org.apache.hadoop.yarn.server.resourcemanager.TestRMNodeTransitions
Running org.apache.hadoop.yarn.server.resourcemanager.resourcetracker.TestNMExpiry
Tests run: 1, Failures: 0, Errors: 0, Skipped: 0, Time elapsed: 3.436 sec - in org.apache.hadoop.yarn.server.resourcemanager.resourcetracker.TestNMExpiry
Running org.apache.hadoop.yarn.server.resourcemanager.resourcetracker.TestNMReconnect
Tests run: 1, Failures: 0, Errors: 0, Skipped: 0, Time elapsed: 1.481 sec - in org.apache.hadoop.yarn.server.resourcemanager.resourcetracker.TestNMReconnect
Running org.apache.hadoop.yarn.server.resourcemanager.resourcetracker.TestRMNMRPCResponseId
Tests run: 1, Failures: 0, Errors: 0, Skipped: 0, Time elapsed: 1.355 sec - in org.apache.hadoop.yarn.server.resourcemanager.resourcetracker.TestRMNMRPCResponseId
Running org.apache.hadoop.yarn.server.resourcemanager.recovery.TestZKRMStateStore
Tests run: 4, Failures: 0, Errors: 0, Skipped: 0, Time elapsed: 8.602 sec - in org.apache.hadoop.yarn.server.resourcemanager.recovery.TestZKRMStateStore
Running org.apache.hadoop.yarn.server.resourcemanager.recovery.TestFSRMStateStore
Tests run: 3, Failures: 0, Errors: 0, Skipped: 0, Time elapsed: 17.716 sec - in org.apache.hadoop.yarn.server.resourcemanager.recovery.TestFSRMStateStore
Running org.apache.hadoop.yarn.server.resourcemanager.recovery.TestZKRMStateStoreZKClientConnections
Tests run: 7, Failures: 0, Errors: 0, Skipped: 0, Time elapsed: 5.481 sec - in org.apache.hadoop.yarn.server.resourcemanager.recovery.TestZKRMStateStoreZKClientConnections
Running org.apache.hadoop.yarn.server.resourcemanager.recovery.TestLeveldbRMStateStore
Tests run: 7, Failures: 0, Errors: 0, Skipped: 0, Time elapsed: 4.9 sec - in org.apache.hadoop.yarn.server.resourcemanager.recovery.TestLeveldbRMStateStore
Running org.apache.hadoop.yarn.server.resourcemanager.TestAMAuthorization
Tests run: 4, Failures: 0, Errors: 0, Skipped: 0, Time elapsed: 14.957 sec - in org.apache.hadoop.yarn.server.resourcemanager.TestAMAuthorization
Running org.apache.hadoop.yarn.server.resourcemanager.ahs.TestRMApplicationHistoryWriter
Tests run: 7, Failures: 0, Errors: 0, Skipped: 0, Time elapsed: 166.036 sec - in org.apache.hadoop.yarn.server.resourcemanager.ahs.TestRMApplicationHistoryWriter
Running org.apache.hadoop.yarn.server.resourcemanager.TestClusterMetrics
Tests run: 1, Failures: 0, Errors: 0, Skipped: 0, Time elapsed: 0.407 sec - in org.apache.hadoop.yarn.server.resourcemanager.TestClusterMetrics
Running org.apache.hadoop.yarn.server.resourcemanager.TestClientRMService
Tests run: 23, Failures: 0, Errors: 0, Skipped: 0, Time elapsed: 10.941 sec - in org.apache.hadoop.yarn.server.resourcemanager.TestClientRMService
Running org.apache.hadoop.yarn.server.resourcemanager.TestRM
Tests run: 22, Failures: 0, Errors: 0, Skipped: 0, Time elapsed: 170.707 sec - in org.apache.hadoop.yarn.server.resourcemanager.TestRM
Running org.apache.hadoop.yarn.server.resourcemanager.TestApplicationMasterService
Tests run: 5, Failures: 0, Errors: 0, Skipped: 0, Time elapsed: 42.451 sec - in org.apache.hadoop.yarn.server.resourcemanager.TestApplicationMasterService
Running org.apache.hadoop.yarn.server.resourcemanager.TestFifoScheduler
Tests run: 10, Failures: 0, Errors: 0, Skipped: 0, Time elapsed: 31.365 sec - in org.apache.hadoop.yarn.server.resourcemanager.TestFifoScheduler
Running org.apache.hadoop.yarn.server.resourcemanager.TestSubmitApplicationWithRMHA
Tests run: 6, Failures: 0, Errors: 0, Skipped: 0, Time elapsed: 11.765 sec - in org.apache.hadoop.yarn.server.resourcemanager.TestSubmitApplicationWithRMHA
Running org.apache.hadoop.yarn.server.resourcemanager.TestRMAuditLogger
Tests run: 3, Failures: 0, Errors: 0, Skipped: 0, Time elapsed: 1.184 sec - in org.apache.hadoop.yarn.server.resourcemanager.TestRMAuditLogger
Running org.apache.hadoop.yarn.server.resourcemanager.TestApplicationACLs
Tests run: 1, Failures: 0, Errors: 0, Skipped: 0, Time elapsed: 22.03 sec - in org.apache.hadoop.yarn.server.resourcemanager.TestApplicationACLs
Running org.apache.hadoop.yarn.server.resourcemanager.TestClientRMTokens
Tests run: 6, Failures: 0, Errors: 0, Skipped: 0, Time elapsed: 17.832 sec - in org.apache.hadoop.yarn.server.resourcemanager.TestClientRMTokens
Running org.apache.hadoop.yarn.server.resourcemanager.reservation.TestCapacityOverTimePolicy
Tests run: 8, Failures: 0, Errors: 0, Skipped: 0, Time elapsed: 3.421 sec - in org.apache.hadoop.yarn.server.resourcemanager.reservation.TestCapacityOverTimePolicy
Running org.apache.hadoop.yarn.server.resourcemanager.reservation.TestFairSchedulerPlanFollower
Tests run: 2, Failures: 0, Errors: 0, Skipped: 0, Time elapsed: 2.063 sec - in org.apache.hadoop.yarn.server.resourcemanager.reservation.TestFairSchedulerPlanFollower
Running org.apache.hadoop.yarn.server.resourcemanager.reservation.TestInMemoryPlan
Tests run: 8, Failures: 0, Errors: 0, Skipped: 0, Time elapsed: 0.815 sec - in org.apache.hadoop.yarn.server.resourcemanager.reservation.TestInMemoryPlan
Running org.apache.hadoop.yarn.server.resourcemanager.reservation.TestCapacityReservationSystem
Tests run: 2, Failures: 0, Errors: 0, Skipped: 0, Time elapsed: 2.039 sec - in org.apache.hadoop.yarn.server.resourcemanager.reservation.TestCapacityReservationSystem
Running org.apache.hadoop.yarn.server.resourcemanager.reservation.TestSimpleCapacityReplanner
Tests run: 1, Failures: 0, Errors: 0, Skipped: 0, Time elapsed: 0.802 sec - in org.apache.hadoop.yarn.server.resourcemanager.reservation.TestSimpleCapacityReplanner
Running org.apache.hadoop.yarn.server.resourcemanager.reservation.TestFairReservationSystem
Tests run: 2, Failures: 0, Errors: 0, Skipped: 0, Time elapsed: 1.687 sec - in org.apache.hadoop.yarn.server.resourcemanager.reservation.TestFairReservationSystem
Running org.apache.hadoop.yarn.server.resourcemanager.reservation.TestReservationInputValidator
Tests run: 23, Failures: 0, Errors: 0, Skipped: 0, Time elapsed: 0.86 sec - in org.apache.hadoop.yarn.server.resourcemanager.reservation.TestReservationInputValidator
Running org.apache.hadoop.yarn.server.resourcemanager.reservation.TestNoOverCommitPolicy
Tests run: 6, Failures: 0, Errors: 0, Skipped: 0, Time elapsed: 1.478 sec - in org.apache.hadoop.yarn.server.resourcemanager.reservation.TestNoOverCommitPolicy
Running org.apache.hadoop.yarn.server.resourcemanager.reservation.TestCapacitySchedulerPlanFollower
Tests run: 2, Failures: 0, Errors: 0, Skipped: 0, Time elapsed: 2.289 sec - in org.apache.hadoop.yarn.server.resourcemanager.reservation.TestCapacitySchedulerPlanFollower
Running org.apache.hadoop.yarn.server.resourcemanager.reservation.TestGreedyReservationAgent
Tests run: 9, Failures: 0, Errors: 0, Skipped: 0, Time elapsed: 1.216 sec - in org.apache.hadoop.yarn.server.resourcemanager.reservation.TestGreedyReservationAgent
Running org.apache.hadoop.yarn.server.resourcemanager.reservation.TestRLESparseResourceAllocation
Tests run: 4, Failures: 0, Errors: 0, Skipped: 0, Time elapsed: 0.545 sec - in org.apache.hadoop.yarn.server.resourcemanager.reservation.TestRLESparseResourceAllocation
Running org.apache.hadoop.yarn.server.resourcemanager.reservation.TestInMemoryReservationAllocation
Tests run: 5, Failures: 0, Errors: 0, Skipped: 0, Time elapsed: 0.548 sec - in org.apache.hadoop.yarn.server.resourcemanager.reservation.TestInMemoryReservationAllocation
Running org.apache.hadoop.yarn.server.resourcemanager.monitor.TestSchedulingMonitor
Tests run: 1, Failures: 0, Errors: 0, Skipped: 0, Time elapsed: 1.609 sec - in org.apache.hadoop.yarn.server.resourcemanager.monitor.TestSchedulingMonitor
Running org.apache.hadoop.yarn.server.resourcemanager.monitor.capacity.TestProportionalCapacityPreemptionPolicy
Tests run: 25, Failures: 0, Errors: 0, Skipped: 0, Time elapsed: 12.569 sec - in org.apache.hadoop.yarn.server.resourcemanager.monitor.capacity.TestProportionalCapacityPreemptionPolicy
Running org.apache.hadoop.yarn.server.resourcemanager.security.TestClientToAMTokens
Tests run: 4, Failures: 0, Errors: 0, Skipped: 0, Time elapsed: 15.872 sec - in org.apache.hadoop.yarn.server.resourcemanager.security.TestClientToAMTokens
Running org.apache.hadoop.yarn.server.resourcemanager.security.TestDelegationTokenRenewerLifecycle
Tests run: 1, Failures: 0, Errors: 0, Skipped: 0, Time elapsed: 0.806 sec - in org.apache.hadoop.yarn.server.resourcemanager.security.TestDelegationTokenRenewerLifecycle
Running org.apache.hadoop.yarn.server.resourcemanager.security.TestDelegationTokenRenewer
Tests run: 11, Failures: 0, Errors: 0, Skipped: 0, Time elapsed: 56.941 sec - in org.apache.hadoop.yarn.server.resourcemanager.security.TestDelegationTokenRenewer
Running org.apache.hadoop.yarn.server.resourcemanager.security.TestRMDelegationTokens
Tests run: 2, Failures: 0, Errors: 0, Skipped: 0, Time elapsed: 5.871 sec - in org.apache.hadoop.yarn.server.resourcemanager.security.TestRMDelegationTokens
Running org.apache.hadoop.yarn.server.resourcemanager.security.TestAMRMTokens
Tests run: 6, Failures: 0, Errors: 0, Skipped: 0, Time elapsed: 57.897 sec - in org.apache.hadoop.yarn.server.resourcemanager.security.TestAMRMTokens
Running org.apache.hadoop.yarn.server.resourcemanager.TestRMAdminService
Tests run: 15, Failures: 0, Errors: 0, Skipped: 0, Time elapsed: 9.65 sec - in org.apache.hadoop.yarn.server.resourcemanager.TestRMAdminService
Running org.apache.hadoop.yarn.server.resourcemanager.TestRMEmbeddedElector
Tests run: 1, Failures: 0, Errors: 0, Skipped: 0, Time elapsed: 3.259 sec - in org.apache.hadoop.yarn.server.resourcemanager.TestRMEmbeddedElector
Running org.apache.hadoop.yarn.server.resourcemanager.TestKillApplicationWithRMHA
Tests run: 4, Failures: 0, Errors: 0, Skipped: 0, Time elapsed: 26.363 sec - in org.apache.hadoop.yarn.server.resourcemanager.TestKillApplicationWithRMHA
Running org.apache.hadoop.yarn.server.resourcemanager.nodelabels.TestRMNodeLabelsManager
Tests run: 8, Failures: 0, Errors: 0, Skipped: 0, Time elapsed: 0.989 sec - in org.apache.hadoop.yarn.server.resourcemanager.nodelabels.TestRMNodeLabelsManager
Running org.apache.hadoop.yarn.server.resourcemanager.applicationsmanager.TestAMRMRPCResponseId
Tests run: 1, Failures: 0, Errors: 0, Skipped: 0, Time elapsed: 5.98 sec - in org.apache.hadoop.yarn.server.resourcemanager.applicationsmanager.TestAMRMRPCResponseId
Running org.apache.hadoop.yarn.server.resourcemanager.applicationsmanager.TestAMRMRPCNodeUpdates
Tests run: 1, Failures: 0, Errors: 0, Skipped: 0, Time elapsed: 10.006 sec - in org.apache.hadoop.yarn.server.resourcemanager.applicationsmanager.TestAMRMRPCNodeUpdates
Running org.apache.hadoop.yarn.server.resourcemanager.applicationsmanager.TestAMRestart
Tests run: 6, Failures: 0, Errors: 0, Skipped: 0, Time elapsed: 115.068 sec - in org.apache.hadoop.yarn.server.resourcemanager.applicationsmanager.TestAMRestart

Results :

Failed tests: 
  TestFairScheduler.testContinuousScheduling:3590 expected:<2> but was:<1>

Tests run: 1029, Failures: 1, Errors: 0, Skipped: 1

[INFO] ------------------------------------------------------------------------
[INFO] Reactor Summary:
[INFO] 
[INFO] hadoop-yarn ....................................... SUCCESS [  3.003 s]
[INFO] hadoop-yarn-api ................................... SUCCESS [03:01 min]
[INFO] hadoop-yarn-common ................................ SUCCESS [02:39 min]
[INFO] hadoop-yarn-server ................................ SUCCESS [  0.095 s]
[INFO] hadoop-yarn-server-common ......................... SUCCESS [ 40.370 s]
[INFO] hadoop-yarn-server-nodemanager .................... SUCCESS [06:04 min]
[INFO] hadoop-yarn-server-web-proxy ...................... SUCCESS [ 22.743 s]
[INFO] hadoop-yarn-server-applicationhistoryservice ...... SUCCESS [03:01 min]
[INFO] hadoop-yarn-server-resourcemanager ................ FAILURE [47:35 min]
[INFO] hadoop-yarn-server-tests .......................... SKIPPED
[INFO] hadoop-yarn-client ................................ SKIPPED
[INFO] hadoop-yarn-server-sharedcachemanager ............. SKIPPED
[INFO] hadoop-yarn-applications .......................... SKIPPED
[INFO] hadoop-yarn-applications-distributedshell ......... SKIPPED
[INFO] hadoop-yarn-applications-unmanaged-am-launcher .... SKIPPED
[INFO] hadoop-yarn-site .................................. SKIPPED
[INFO] hadoop-yarn-registry .............................. SKIPPED
[INFO] hadoop-yarn-project ............................... SKIPPED
[INFO] ------------------------------------------------------------------------
[INFO] BUILD FAILURE
[INFO] ------------------------------------------------------------------------
[INFO] Total time: 01:03 h
[INFO] Finished at: 2015-02-18T11:35:31+00:00
[INFO] Final Memory: 60M/713M
[INFO] ------------------------------------------------------------------------
[ERROR] Failed to execute goal org.apache.maven.plugins:maven-surefire-plugin:2.17:test (default-test)
on project hadoop-yarn-server-resourcemanager: There are test failures.
[ERROR] 
[ERROR] Please refer to <https://builds.apache.org/job/Hadoop-Yarn-trunk/ws/hadoop-yarn-project/hadoop-yarn/hadoop-yarn-server/hadoop-yarn-server-resourcemanager/target/surefire-reports>
for the individual test results.
[ERROR] -> [Help 1]
[ERROR] 
[ERROR] To see the full stack trace of the errors, re-run Maven with the -e switch.
[ERROR] Re-run Maven using the -X switch to enable full debug logging.
[ERROR] 
[ERROR] For more information about the errors and possible solutions, please read the following
articles:
[ERROR] [Help 1] http://cwiki.apache.org/confluence/display/MAVEN/MojoFailureException
[ERROR] 
[ERROR] After correcting the problems, you can resume the build with the command
[ERROR]   mvn <goals> -rf :hadoop-yarn-server-resourcemanager
Build step 'Execute shell' marked build as failure
Archiving artifacts
Recording test results
Updating HADOOP-11600
Updating HADOOP-11522
Updating HDFS-7795
Updating HADOOP-11521
Updating HDFS-7797
Updating HADOOP-11570
Updating HADOOP-11593
Updating HADOOP-11596
Updating HADOOP-11599
Updating MAPREDUCE-6234
Updating MAPREDUCE-4286
Updating MAPREDUCE-6260
Updating HADOOP-11575
Updating HDFS-7780
Updating HDFS-6662
Updating YARN-3207
Updating HDFS-4266
Updating HADOOP-11295
Updating MAPREDUCE-5785
Updating HDFS-7803

Mime
View raw message