hadoop-yarn-dev mailing list archives

Site index · List index
Message view « Date » · « Thread »
Top « Date » · « Thread »
From Apache Jenkins Server <jenk...@builds.apache.org>
Subject Failed: YARN-3094 PreCommit Build #6516
Date Thu, 05 Feb 2015 02:03:14 GMT
Jira: https://issues.apache.org/jira/browse/YARN-3094
Build: https://builds.apache.org/job/PreCommit-YARN-Build/6516/

###################################################################################
########################## LAST 60 LINES OF THE CONSOLE ###########################
[...truncated 3123 lines...]
    {color:green}+1 javac{color}.  The applied patch does not increase the total number of
javac compiler warnings.

    {color:green}+1 javadoc{color}.  There were no new javadoc warning messages.

    {color:green}+1 eclipse:eclipse{color}.  The patch built with eclipse:eclipse.

    {color:green}+1 findbugs{color}.  The patch does not introduce any new Findbugs (version
2.0.3) warnings.

    {color:green}+1 release audit{color}.  The applied patch does not increase the total number
of release audit warnings.

    {color:green}+1 core tests{color}.  The patch passed unit tests in .

Test results: https://builds.apache.org/job/PreCommit-YARN-Build/6516//testReport/
Console output: https://builds.apache.org/job/PreCommit-YARN-Build/6516//console

This message is automatically generated.


======================================================================
======================================================================
    Adding comment to Jira.
======================================================================
======================================================================


Comment added.
9add81a67e420ecf281c9473ecd2a3d132f561c3 logged out


======================================================================
======================================================================
    Finished build.
======================================================================
======================================================================


Archiving artifacts
Sending artifact delta relative to PreCommit-YARN-Build #6515
ERROR: Failed to archive {patchprocess/patchJavacWarnings.txt=patchprocess/patchJavacWarnings.txt,
patchprocess/trunkJavacWarnings.txt=patchprocess/trunkJavacWarnings.txt, patchprocess/patchJavadocWarnings.txt=patchprocess/patchJavadocWarnings.txt,
patchprocess/patchFindBugsOutput.txt=patchprocess/patchFindBugsOutput.txt, patchprocess/masterJavacWarnings.txt=patchprocess/masterJavacWarnings.txt,
patchprocess/trunkJavadocWarnings.txt=patchprocess/trunkJavadocWarnings.txt, patchprocess/patchReleaseAuditOutput.txt=patchprocess/patchReleaseAuditOutput.txt,
patchprocess/patchReleaseAuditWarnings.txt=patchprocess/patchReleaseAuditWarnings.txt, patchprocess/masterJavadocWarnings.txt=patchprocess/masterJavadocWarnings.txt,
patchprocess/filteredPatchJavacWarnings.txt=patchprocess/filteredPatchJavacWarnings.txt, patchprocess/patchEclipseOutput.txt=patchprocess/patchEclipseOutput.txt,
patchprocess/diffJavadocWarnings.txt=patchprocess/diffJavadocWarnings.txt, patchprocess/filteredmasterJavacWarnings.txt=patchprocess/filteredmasterJavacWarnings.txt,
patchprocess/filteredTrunkJavacWarnings.txt=patchprocess/filteredTrunkJavacWarnings.txt} due
to internal error; falling back to full archiving
java.lang.IllegalStateException: checksum mismatch after transfer (6577874794637500426 vs.
2360665305); /x1/jenkins/jenkins-home/jobs/PreCommit-YARN-Build/builds/2015-02-05_01-30-22/archive/patchprocess/patchFindBugsOutput.txt
may be corrupted
	at jsync.protocol.FileSequenceReader.read(FileSequenceReader.java:45)
	at com.cloudbees.jenkins.plugins.jsync.archiver.JSyncArtifactManager.remoteSync(JSyncArtifactManager.java:145)
	at com.cloudbees.jenkins.plugins.jsync.archiver.JSyncArtifactManager.archive(JSyncArtifactManager.java:68)
	at hudson.tasks.ArtifactArchiver.perform(ArtifactArchiver.java:140)
	at hudson.tasks.BuildStepMonitor$1.perform(BuildStepMonitor.java:20)
	at hudson.model.AbstractBuild$AbstractBuildExecution.perform(AbstractBuild.java:756)
	at hudson.model.AbstractBuild$AbstractBuildExecution.performAllBuildSteps(AbstractBuild.java:720)
	at hudson.model.Build$BuildExecution.post2(Build.java:182)
	at hudson.model.AbstractBuild$AbstractBuildExecution.post(AbstractBuild.java:669)
	at hudson.model.Run.execute(Run.java:1731)
	at hudson.model.FreeStyleBuild.run(FreeStyleBuild.java:43)
	at hudson.model.ResourceController.execute(ResourceController.java:88)
	at hudson.model.Executor.run(Executor.java:232)
Description set: YARN-3094
Recording test results
No test report files were found. Configuration error?
Build step 'Publish JUnit test result report' changed build result to FAILURE
Email was triggered for: Failure
Sending email for trigger: Failure



###################################################################################
############################## FAILED TESTS (if any) ##############################
No tests ran.
Mime
  • Unnamed multipart/mixed (inline, None, 0 bytes)
View raw message