hadoop-yarn-dev mailing list archives

Site index · List index
Message view « Date » · « Thread »
Top « Date » · « Thread »
From Apache Jenkins Server <jenk...@builds.apache.org>
Subject Failed: YARN-3195 PreCommit Build #6679
Date Fri, 20 Feb 2015 06:40:22 GMT
Jira: https://issues.apache.org/jira/browse/YARN-3195
Build: https://builds.apache.org/job/PreCommit-YARN-Build/6679/

###################################################################################
########################## LAST 60 LINES OF THE CONSOLE ###########################
[...truncated 3273 lines...]
    {color:red}-1 tests included{color}.  The patch doesn't appear to include any new or modified
tests.
                        Please justify why no new tests are needed for this patch.
                        Also please list what manual steps were performed to verify this patch.

    {color:green}+1 javac{color}.  The applied patch does not increase the total number of
javac compiler warnings.

    {color:green}+1 javadoc{color}.  There were no new javadoc warning messages.

    {color:green}+1 eclipse:eclipse{color}.  The patch built with eclipse:eclipse.

    {color:green}+1 findbugs{color}.  The patch does not introduce any new Findbugs (version
2.0.3) warnings.

    {color:green}+1 release audit{color}.  The applied patch does not increase the total number
of release audit warnings.

    {color:red}-1 core tests{color}.  The patch failed these unit tests in hadoop-yarn-project/hadoop-yarn/hadoop-yarn-client:

                  org.apache.hadoop.yarn.client.cli.TestLogsCLI
                  org.apache.hadoop.yarn.client.cli.TestYarnCLI

                                      The following test timeouts occurred in hadoop-yarn-project/hadoop-yarn/hadoop-yarn-client:

org.apache.hadoop.yarn.client.TestResourceTrackerOnHA

Test results: https://builds.apache.org/job/PreCommit-YARN-Build/6679//testReport/
Console output: https://builds.apache.org/job/PreCommit-YARN-Build/6679//console

This message is automatically generated.


======================================================================
======================================================================
    Adding comment to Jira.
======================================================================
======================================================================


Comment added.
ae5383c81757478d3e3fa5cb9da9ff3459bd085c logged out


======================================================================
======================================================================
    Finished build.
======================================================================
======================================================================


Build step 'Execute shell' marked build as failure
Archiving artifacts
Sending artifact delta relative to PreCommit-YARN-Build #6666
Archived 15 artifacts
Archive block size is 32768
Received 200 blocks and 2238983 bytes
Compression is 74.5%
Took 1.3 sec
[description-setter] Could not determine description.
Recording test results
Email was triggered for: Failure
Sending email for trigger: Failure



###################################################################################
############################## FAILED TESTS (if any) ##############################
3 tests failed.
FAILED:  org.apache.hadoop.yarn.client.cli.TestLogsCLI.testHelpMessage

Error Message:
expected:<...ess is specified)
 -[]nodeAddress <Node Ad...> but was:<...ess is specified)
 -[help                           Displays help for all commands.
 -]nodeAddress <Node Ad...>

Stack Trace:
org.junit.ComparisonFailure: expected:<...ess is specified)
 -[]nodeAddress <Node Ad...> but was:<...ess is specified)
 -[help                           Displays help for all commands.
 -]nodeAddress <Node Ad...>
	at org.junit.Assert.assertEquals(Assert.java:115)
	at org.junit.Assert.assertEquals(Assert.java:144)
	at org.apache.hadoop.yarn.client.cli.TestLogsCLI.testHelpMessage(TestLogsCLI.java:157)


FAILED:  org.apache.hadoop.yarn.client.cli.TestYarnCLI.testMissingArguments

Error Message:
expected:<...o list all nodes.
 -[]list              Li...> but was:<...o list all nodes.
 -[help              Displays help for all commands.
 -]list              Li...>

Stack Trace:
org.junit.ComparisonFailure: expected:<...o list all nodes.
 -[]list              Li...> but was:<...o list all nodes.
 -[help              Displays help for all commands.
 -]list              Li...>
	at org.junit.Assert.assertEquals(Assert.java:115)
	at org.junit.Assert.assertEquals(Assert.java:144)
	at org.apache.hadoop.yarn.client.cli.TestYarnCLI.testMissingArguments(TestYarnCLI.java:1250)


FAILED:  org.apache.hadoop.yarn.client.cli.TestYarnCLI.testNodesHelpCommand

Error Message:
expected:<...o list all nodes.
 -[]list              Li...> but was:<...o list all nodes.
 -[help              Displays help for all commands.
 -]list              Li...>

Stack Trace:
org.junit.ComparisonFailure: expected:<...o list all nodes.
 -[]list              Li...> but was:<...o list all nodes.
 -[help              Displays help for all commands.
 -]list              Li...>
	at org.junit.Assert.assertEquals(Assert.java:115)
	at org.junit.Assert.assertEquals(Assert.java:144)
	at org.apache.hadoop.yarn.client.cli.TestYarnCLI.testNodesHelpCommand(TestYarnCLI.java:797)



Mime
  • Unnamed multipart/mixed (inline, None, 0 bytes)
View raw message