hadoop-yarn-dev mailing list archives

Site index · List index
Message view « Date » · « Thread »
Top « Date » · « Thread »
From Apache Jenkins Server <jenk...@builds.apache.org>
Subject Failed: YARN-2807 PreCommit Build #6265
Date Wed, 07 Jan 2015 06:43:49 GMT
Jira: https://issues.apache.org/jira/browse/YARN-2807
Build: https://builds.apache.org/job/PreCommit-YARN-Build/6265/

###################################################################################
########################## LAST 60 LINES OF THE CONSOLE ###########################
[...truncated 4150 lines...]

{color:red}-1 overall{color}.  Here are the results of testing the latest attachment 
  http://issues.apache.org/jira/secure/attachment/12690300/YARN-2807.2.patch
  against trunk revision 788ee35.

    {color:green}+1 @author{color}.  The patch does not contain any @author tags.

    {color:green}+0 tests included{color}.  The patch appears to be a documentation patch
that doesn't require tests.

    {color:green}+1 javac{color}.  The applied patch does not increase the total number of
javac compiler warnings.

    {color:green}+1 javadoc{color}.  There were no new javadoc warning messages.

    {color:green}+1 eclipse:eclipse{color}.  The patch built with eclipse:eclipse.

    {color:green}+1 findbugs{color}.  The patch does not introduce any new Findbugs (version
2.0.3) warnings.

    {color:green}+1 release audit{color}.  The applied patch does not increase the total number
of release audit warnings.

    {color:red}-1 core tests{color}.  The patch failed these unit tests in hadoop-common-project/hadoop-common:

                  org.apache.hadoop.security.ssl.TestReloadingX509TrustManager

Test results: https://builds.apache.org/job/PreCommit-YARN-Build/6265//testReport/
Console output: https://builds.apache.org/job/PreCommit-YARN-Build/6265//console

This message is automatically generated.


======================================================================
======================================================================
    Adding comment to Jira.
======================================================================
======================================================================


Comment added.
5ee8c63bb1fc8213e15c6d6dd4f61c8aae5fb1be logged out


======================================================================
======================================================================
    Finished build.
======================================================================
======================================================================


Build step 'Execute shell' marked build as failure
Archiving artifacts
Sending artifact delta relative to PreCommit-YARN-Build #6051
Archived 15 artifacts
Archive block size is 32768
Received 128 blocks and 5186426 bytes
Compression is 44.7%
Took 4.7 sec
[description-setter] Could not determine description.
Recording test results
Email was triggered for: Failure
Sending email for trigger: Failure



###################################################################################
############################## FAILED TESTS (if any) ##############################
1 tests failed.
FAILED:  org.apache.hadoop.security.ssl.TestReloadingX509TrustManager.testReload

Error Message:
expected:<2> but was:<1>

Stack Trace:
java.lang.AssertionError: expected:<2> but was:<1>
	at org.junit.Assert.fail(Assert.java:88)
	at org.junit.Assert.failNotEquals(Assert.java:743)
	at org.junit.Assert.assertEquals(Assert.java:118)
	at org.junit.Assert.assertEquals(Assert.java:555)
	at org.junit.Assert.assertEquals(Assert.java:542)
	at org.apache.hadoop.security.ssl.TestReloadingX509TrustManager.testReload(TestReloadingX509TrustManager.java:112)



Mime
  • Unnamed multipart/mixed (inline, None, 0 bytes)
View raw message