hadoop-yarn-dev mailing list archives

Site index · List index
Message view « Date » · « Thread »
Top « Date » · « Thread »
From Apache Jenkins Server <jenk...@builds.apache.org>
Subject Failed: YARN-2807 PreCommit Build #6299
Date Sat, 10 Jan 2015 04:04:05 GMT
Jira: https://issues.apache.org/jira/browse/YARN-2807
Build: https://builds.apache.org/job/PreCommit-YARN-Build/6299/

###################################################################################
########################## LAST 60 LINES OF THE CONSOLE ###########################
[...truncated 3022 lines...]
awk: cannot open /home/jenkins/jenkins-slave/workspace/PreCommit-YARN-Build/../patchprocess/testrun_hadoop-common.txt
(No such file or directory)
/home/jenkins/jenkins-slave/workspace/PreCommit-YARN-Build




{color:red}-1 overall{color}.  Here are the results of testing the latest attachment 
  http://issues.apache.org/jira/secure/attachment/12691468/YARN-2807.4.patch
  against trunk revision a260406.

    {color:green}+1 @author{color}.  The patch does not contain any @author tags.

    {color:green}+0 tests included{color}.  The patch appears to be a documentation patch
that doesn't require tests.

    {color:green}+1 javac{color}.  The applied patch does not increase the total number of
javac compiler warnings.

    {color:green}+1 javadoc{color}.  There were no new javadoc warning messages.

    {color:green}+1 eclipse:eclipse{color}.  The patch built with eclipse:eclipse.

    {color:green}+1 findbugs{color}.  The patch does not introduce any new Findbugs (version
2.0.3) warnings.

    {color:green}+1 release audit{color}.  The applied patch does not increase the total number
of release audit warnings.

    {color:red}-1 core tests{color}.  The patch failed these unit tests in hadoop-common-project/hadoop-common:

                  org.apache.hadoop.ha.TestZKFailoverControllerStress
                  org.apache.hadoop.metrics2.impl.TestMetricsSystemImpl

Test results: https://builds.apache.org/job/PreCommit-YARN-Build/6299//testReport/
Console output: https://builds.apache.org/job/PreCommit-YARN-Build/6299//console

This message is automatically generated.


======================================================================
======================================================================
    Adding comment to Jira.
======================================================================
======================================================================


Comment added.
a57689d55b88a8da81ea42c402c3ca1a3fdc720f logged out


======================================================================
======================================================================
    Finished build.
======================================================================
======================================================================


Build step 'Execute shell' marked build as failure
Archiving artifacts
[description-setter] Could not determine description.
Recording test results
Email was triggered for: Failure
Sending email for trigger: Failure



###################################################################################
############################## FAILED TESTS (if any) ##############################
2 tests failed.
FAILED:  org.apache.hadoop.ha.TestZKFailoverControllerStress.testExpireBackAndForth

Error Message:
KeeperErrorCode = NoNode

Stack Trace:
org.apache.zookeeper.KeeperException$NoNodeException: KeeperErrorCode = NoNode
	at org.apache.zookeeper.server.DataTree.getData(DataTree.java:648)
	at org.apache.zookeeper.server.ZKDatabase.getData(ZKDatabase.java:371)
	at org.apache.hadoop.ha.MiniZKFCCluster.expireActiveLockHolder(MiniZKFCCluster.java:199)
	at org.apache.hadoop.ha.MiniZKFCCluster.expireAndVerifyFailover(MiniZKFCCluster.java:234)
	at org.apache.hadoop.ha.TestZKFailoverControllerStress.testExpireBackAndForth(TestZKFailoverControllerStress.java:79)


FAILED:  org.apache.hadoop.metrics2.impl.TestMetricsSystemImpl.testMultiThreadedPublish

Error Message:
Metric not collected!
Metric not collected!
Passed
Metric not collected!
Metric not collected!
Metric not collected!
Metric not collected!
Metric not collected!
Metric not collected!
Passed

Stack Trace:
java.lang.AssertionError: Metric not collected!
Metric not collected!
Passed
Metric not collected!
Metric not collected!
Metric not collected!
Metric not collected!
Metric not collected!
Metric not collected!
Passed
	at org.junit.Assert.fail(Assert.java:88)
	at org.junit.Assert.assertTrue(Assert.java:41)
	at org.apache.hadoop.metrics2.impl.TestMetricsSystemImpl.testMultiThreadedPublish(TestMetricsSystemImpl.java:235)



Mime
  • Unnamed multipart/mixed (inline, None, 0 bytes)
View raw message