hadoop-yarn-dev mailing list archives

Site index · List index
Message view « Date » · « Thread »
Top « Date » · « Thread »
From Apache Jenkins Server <jenk...@builds.apache.org>
Subject Failed: YARN-2637 PreCommit Build #6277
Date Thu, 08 Jan 2015 04:00:21 GMT
Jira: https://issues.apache.org/jira/browse/YARN-2637
Build: https://builds.apache.org/job/PreCommit-YARN-Build/6277/

###################################################################################
########################## LAST 60 LINES OF THE CONSOLE ###########################
[...truncated 3407 lines...]
  http://issues.apache.org/jira/secure/attachment/12690699/YARN-2637.31.patch
  against trunk revision ef237bd.

    {color:green}+1 @author{color}.  The patch does not contain any @author tags.

    {color:green}+1 tests included{color}.  The patch appears to include 9 new or modified
test files.

    {color:green}+1 javac{color}.  The applied patch does not increase the total number of
javac compiler warnings.

    {color:green}+1 javadoc{color}.  There were no new javadoc warning messages.

    {color:green}+1 eclipse:eclipse{color}.  The patch built with eclipse:eclipse.

    {color:green}+1 findbugs{color}.  The patch does not introduce any new Findbugs (version
2.0.3) warnings.

    {color:green}+1 release audit{color}.  The applied patch does not increase the total number
of release audit warnings.

    {color:red}-1 core tests{color}.  The patch failed these unit tests in hadoop-yarn-project/hadoop-yarn/hadoop-yarn-server/hadoop-yarn-server-resourcemanager:

                  org.apache.hadoop.yarn.server.resourcemanager.webapp.TestRMWebServicesCapacitySched
                  org.apache.hadoop.yarn.server.resourcemanager.scheduler.capacity.TestLeafQueue
                  org.apache.hadoop.yarn.server.resourcemanager.scheduler.capacity.TestApplicationLimits

Test results: https://builds.apache.org/job/PreCommit-YARN-Build/6277//testReport/
Console output: https://builds.apache.org/job/PreCommit-YARN-Build/6277//console

This message is automatically generated.


======================================================================
======================================================================
    Adding comment to Jira.
======================================================================
======================================================================


Comment added.
addb1fa0111f875513396a7d45c6122571054430 logged out


======================================================================
======================================================================
    Finished build.
======================================================================
======================================================================


Build step 'Execute shell' marked build as failure
Archiving artifacts
Sending artifact delta relative to PreCommit-YARN-Build #6051
Archived 15 artifacts
Archive block size is 32768
Received 39 blocks and 7591478 bytes
Compression is 14.4%
Took 1.6 sec
[description-setter] Could not determine description.
Recording test results
Email was triggered for: Failure
Sending email for trigger: Failure



###################################################################################
############################## FAILED TESTS (if any) ##############################
7 tests failed.
FAILED:  org.apache.hadoop.yarn.server.resourcemanager.scheduler.capacity.TestApplicationLimits.testActiveApplicationLimits

Error Message:
expected:<2> but was:<3>

Stack Trace:
java.lang.AssertionError: expected:<2> but was:<3>
	at org.junit.Assert.fail(Assert.java:88)
	at org.junit.Assert.failNotEquals(Assert.java:743)
	at org.junit.Assert.assertEquals(Assert.java:118)
	at org.junit.Assert.assertEquals(Assert.java:555)
	at org.junit.Assert.assertEquals(Assert.java:542)
	at org.apache.hadoop.yarn.server.resourcemanager.scheduler.capacity.TestApplicationLimits.testActiveApplicationLimits(TestApplicationLimits.java:189)


FAILED:  org.apache.hadoop.yarn.server.resourcemanager.scheduler.capacity.TestApplicationLimits.testActiveLimitsWithKilledApps

Error Message:
expected:<2> but was:<3>

Stack Trace:
java.lang.AssertionError: expected:<2> but was:<3>
	at org.junit.Assert.fail(Assert.java:88)
	at org.junit.Assert.failNotEquals(Assert.java:743)
	at org.junit.Assert.assertEquals(Assert.java:118)
	at org.junit.Assert.assertEquals(Assert.java:555)
	at org.junit.Assert.assertEquals(Assert.java:542)
	at org.apache.hadoop.yarn.server.resourcemanager.scheduler.capacity.TestApplicationLimits.testActiveLimitsWithKilledApps(TestApplicationLimits.java:430)


FAILED:  org.apache.hadoop.yarn.server.resourcemanager.scheduler.capacity.TestLeafQueue.testActivateApplicationByUpdatingClusterResource

Error Message:
expected:<2> but was:<3>

Stack Trace:
java.lang.AssertionError: expected:<2> but was:<3>
	at org.junit.Assert.fail(Assert.java:88)
	at org.junit.Assert.failNotEquals(Assert.java:743)
	at org.junit.Assert.assertEquals(Assert.java:118)
	at org.junit.Assert.assertEquals(Assert.java:555)
	at org.junit.Assert.assertEquals(Assert.java:542)
	at org.apache.hadoop.yarn.server.resourcemanager.scheduler.capacity.TestLeafQueue.testActivateApplicationByUpdatingClusterResource(TestLeafQueue.java:2026)


FAILED:  org.apache.hadoop.yarn.server.resourcemanager.scheduler.capacity.TestLeafQueue.testActivateApplicationAfterQueueRefresh

Error Message:
expected:<2> but was:<3>

Stack Trace:
java.lang.AssertionError: expected:<2> but was:<3>
	at org.junit.Assert.fail(Assert.java:88)
	at org.junit.Assert.failNotEquals(Assert.java:743)
	at org.junit.Assert.assertEquals(Assert.java:118)
	at org.junit.Assert.assertEquals(Assert.java:555)
	at org.junit.Assert.assertEquals(Assert.java:542)
	at org.apache.hadoop.yarn.server.resourcemanager.scheduler.capacity.TestLeafQueue.testActivateApplicationAfterQueueRefresh(TestLeafQueue.java:1948)


FAILED:  org.apache.hadoop.yarn.server.resourcemanager.webapp.TestRMWebServicesCapacitySched.testClusterScheduler

Error Message:
incorrect number of elements expected:<23> but was:<21>

Stack Trace:
java.lang.AssertionError: incorrect number of elements expected:<23> but was:<21>
	at org.junit.Assert.fail(Assert.java:88)
	at org.junit.Assert.failNotEquals(Assert.java:743)
	at org.junit.Assert.assertEquals(Assert.java:118)
	at org.junit.Assert.assertEquals(Assert.java:555)
	at org.apache.hadoop.yarn.server.resourcemanager.webapp.TestRMWebServicesCapacitySched.verifySubQueue(TestRMWebServicesCapacitySched.java:353)
	at org.apache.hadoop.yarn.server.resourcemanager.webapp.TestRMWebServicesCapacitySched.verifySubQueue(TestRMWebServicesCapacitySched.java:374)
	at org.apache.hadoop.yarn.server.resourcemanager.webapp.TestRMWebServicesCapacitySched.verifySubQueue(TestRMWebServicesCapacitySched.java:374)
	at org.apache.hadoop.yarn.server.resourcemanager.webapp.TestRMWebServicesCapacitySched.verifyClusterScheduler(TestRMWebServicesCapacitySched.java:330)
	at org.apache.hadoop.yarn.server.resourcemanager.webapp.TestRMWebServicesCapacitySched.testClusterScheduler(TestRMWebServicesCapacitySched.java:178)


FAILED:  org.apache.hadoop.yarn.server.resourcemanager.webapp.TestRMWebServicesCapacitySched.testClusterSchedulerDefault

Error Message:
incorrect number of elements expected:<23> but was:<21>

Stack Trace:
java.lang.AssertionError: incorrect number of elements expected:<23> but was:<21>
	at org.junit.Assert.fail(Assert.java:88)
	at org.junit.Assert.failNotEquals(Assert.java:743)
	at org.junit.Assert.assertEquals(Assert.java:118)
	at org.junit.Assert.assertEquals(Assert.java:555)
	at org.apache.hadoop.yarn.server.resourcemanager.webapp.TestRMWebServicesCapacitySched.verifySubQueue(TestRMWebServicesCapacitySched.java:353)
	at org.apache.hadoop.yarn.server.resourcemanager.webapp.TestRMWebServicesCapacitySched.verifySubQueue(TestRMWebServicesCapacitySched.java:374)
	at org.apache.hadoop.yarn.server.resourcemanager.webapp.TestRMWebServicesCapacitySched.verifySubQueue(TestRMWebServicesCapacitySched.java:374)
	at org.apache.hadoop.yarn.server.resourcemanager.webapp.TestRMWebServicesCapacitySched.verifyClusterScheduler(TestRMWebServicesCapacitySched.java:330)
	at org.apache.hadoop.yarn.server.resourcemanager.webapp.TestRMWebServicesCapacitySched.testClusterSchedulerDefault(TestRMWebServicesCapacitySched.java:199)


FAILED:  org.apache.hadoop.yarn.server.resourcemanager.webapp.TestRMWebServicesCapacitySched.testClusterSchedulerSlash

Error Message:
incorrect number of elements expected:<23> but was:<21>

Stack Trace:
java.lang.AssertionError: incorrect number of elements expected:<23> but was:<21>
	at org.junit.Assert.fail(Assert.java:88)
	at org.junit.Assert.failNotEquals(Assert.java:743)
	at org.junit.Assert.assertEquals(Assert.java:118)
	at org.junit.Assert.assertEquals(Assert.java:555)
	at org.apache.hadoop.yarn.server.resourcemanager.webapp.TestRMWebServicesCapacitySched.verifySubQueue(TestRMWebServicesCapacitySched.java:353)
	at org.apache.hadoop.yarn.server.resourcemanager.webapp.TestRMWebServicesCapacitySched.verifySubQueue(TestRMWebServicesCapacitySched.java:374)
	at org.apache.hadoop.yarn.server.resourcemanager.webapp.TestRMWebServicesCapacitySched.verifySubQueue(TestRMWebServicesCapacitySched.java:374)
	at org.apache.hadoop.yarn.server.resourcemanager.webapp.TestRMWebServicesCapacitySched.verifyClusterScheduler(TestRMWebServicesCapacitySched.java:330)
	at org.apache.hadoop.yarn.server.resourcemanager.webapp.TestRMWebServicesCapacitySched.testClusterSchedulerSlash(TestRMWebServicesCapacitySched.java:189)



Mime
  • Unnamed multipart/mixed (inline, None, 0 bytes)
View raw message