hadoop-yarn-dev mailing list archives

Site index · List index
Message view « Date » · « Thread »
Top « Date » · « Thread »
From Apache Jenkins Server <jenk...@builds.apache.org>
Subject Failed: YARN-1983 PreCommit Build #6474
Date Sat, 31 Jan 2015 06:13:31 GMT
Jira: https://issues.apache.org/jira/browse/YARN-1983
Build: https://builds.apache.org/job/PreCommit-YARN-Build/6474/

###################################################################################
########################## LAST 60 LINES OF THE CONSOLE ###########################
[...truncated 3736 lines...]
{color:red}-1 overall{color}.  Here are the results of testing the latest attachment 
  http://issues.apache.org/jira/secure/attachment/12695731/YARN-1983.2.patch
  against trunk revision 26c2de3.

    {color:green}+1 @author{color}.  The patch does not contain any @author tags.

    {color:green}+1 tests included{color}.  The patch appears to include 10 new or modified
test files.

    {color:green}+1 javac{color}.  The applied patch does not increase the total number of
javac compiler warnings.

    {color:green}+1 javadoc{color}.  There were no new javadoc warning messages.

    {color:green}+1 eclipse:eclipse{color}.  The patch built with eclipse:eclipse.

    {color:green}+1 findbugs{color}.  The patch does not introduce any new Findbugs (version
2.0.3) warnings.

        {color:red}-1 release audit{color}.  The applied patch generated 1 release audit warnings.

    {color:red}-1 core tests{color}.  The patch failed these unit tests in hadoop-yarn-project/hadoop-yarn/hadoop-yarn-api
hadoop-yarn-project/hadoop-yarn/hadoop-yarn-common hadoop-yarn-project/hadoop-yarn/hadoop-yarn-server/hadoop-yarn-server-nodemanager:

                  org.apache.hadoop.yarn.server.nodemanager.containermanager.monitor.TestContainersMonitor

Test results: https://builds.apache.org/job/PreCommit-YARN-Build/6474//testReport/
Release audit warnings: https://builds.apache.org/job/PreCommit-YARN-Build/6474//artifact/patchprocess/patchReleaseAuditProblems.txt
Console output: https://builds.apache.org/job/PreCommit-YARN-Build/6474//console

This message is automatically generated.


======================================================================
======================================================================
    Adding comment to Jira.
======================================================================
======================================================================


Comment added.
38565934e27aefce3b149496d38419f6f8fe62c6 logged out


======================================================================
======================================================================
    Finished build.
======================================================================
======================================================================


Build step 'Execute shell' marked build as failure
Archiving artifacts
Sending artifact delta relative to PreCommit-YARN-Build #6454
Archived 26 artifacts
Archive block size is 32768
Received 131 blocks and 4519615 bytes
Compression is 48.7%
Took 1.2 sec
[description-setter] Could not determine description.
Recording test results
Email was triggered for: Failure
Sending email for trigger: Failure



###################################################################################
############################## FAILED TESTS (if any) ##############################
1 tests failed.
FAILED:  org.apache.hadoop.yarn.server.nodemanager.containermanager.monitor.TestContainersMonitor.testContainerKillOnMemoryOverflow

Error Message:
Should never call this

Stack Trace:
org.apache.hadoop.yarn.exceptions.YarnRuntimeException: Should never call this
	at org.apache.hadoop.yarn.server.nodemanager.CompositeContainerExecutor.signalContainer(CompositeContainerExecutor.java:125)
	at org.apache.hadoop.yarn.server.nodemanager.containermanager.monitor.TestContainersMonitor.testContainerKillOnMemoryOverflow(TestContainersMonitor.java:291)



Mime
  • Unnamed multipart/mixed (inline, None, 0 bytes)
View raw message