hadoop-yarn-dev mailing list archives

Site index · List index
Message view « Date » · « Thread »
Top « Date » · « Thread »
From Apache Jenkins Server <jenk...@builds.apache.org>
Subject Failed: YARN-3021 PreCommit Build #6398
Date Fri, 23 Jan 2015 19:19:12 GMT
Jira: https://issues.apache.org/jira/browse/YARN-3021
Build: https://builds.apache.org/job/PreCommit-YARN-Build/6398/

###################################################################################
########################## LAST 60 LINES OF THE CONSOLE ###########################
[...truncated 4997 lines...]

    {color:green}+1 @author{color}.  The patch does not contain any @author tags.

    {color:green}+1 tests included{color}.  The patch appears to include 1 new or modified
test files.

    {color:green}+1 javac{color}.  The applied patch does not increase the total number of
javac compiler warnings.

    {color:green}+1 javadoc{color}.  There were no new javadoc warning messages.

    {color:green}+1 eclipse:eclipse{color}.  The patch built with eclipse:eclipse.

    {color:red}-1 findbugs{color}.  The patch appears to introduce 13 new Findbugs (version
2.0.3) warnings.

    {color:green}+1 release audit{color}.  The applied patch does not increase the total number
of release audit warnings.

    {color:red}-1 core tests{color}.  The patch failed these unit tests in hadoop-mapreduce-project/hadoop-mapreduce-client/hadoop-mapreduce-client-core
hadoop-mapreduce-project/hadoop-mapreduce-client/hadoop-mapreduce-client-jobclient hadoop-yarn-project/hadoop-yarn/hadoop-yarn-api
hadoop-yarn-project/hadoop-yarn/hadoop-yarn-common hadoop-yarn-project/hadoop-yarn/hadoop-yarn-server/hadoop-yarn-server-resourcemanager:

                  org.apache.hadoop.mapreduce.TestLargeSort
                  org.apache.hadoop.conf.TestJobConf
                  org.apache.hadoop.yarn.server.resourcemanager.recovery.TestFSRMStateStore
                  org.apache.hadoop.yarn.server.resourcemanager.TestRM

Test results: https://builds.apache.org/job/PreCommit-YARN-Build/6398//testReport/
Findbugs warnings: https://builds.apache.org/job/PreCommit-YARN-Build/6398//artifact/patchprocess/newPatchFindbugsWarningshadoop-mapreduce-client-core.html
Console output: https://builds.apache.org/job/PreCommit-YARN-Build/6398//console

This message is automatically generated.


======================================================================
======================================================================
    Adding comment to Jira.
======================================================================
======================================================================


Comment added.
13f9899c6b6510a497e39b5c153d03bcd42d7f04 logged out


======================================================================
======================================================================
    Finished build.
======================================================================
======================================================================


Build step 'Execute shell' marked build as failure
Archiving artifacts
Sending artifact delta relative to PreCommit-YARN-Build #6394
Archived 35 artifacts
Archive block size is 32768
Received 49 blocks and 8447137 bytes
Compression is 16.0%
Took 1.9 sec
[description-setter] Could not determine description.
Recording test results
Email was triggered for: Failure
Sending email for trigger: Failure



###################################################################################
############################## FAILED TESTS (if any) ##############################
4 tests failed.
FAILED:  org.apache.hadoop.conf.TestJobConf.testNegativeValueForTaskVmem

Error Message:
expected:<1024> but was:<-1>

Stack Trace:
java.lang.AssertionError: expected:<1024> but was:<-1>
	at org.junit.Assert.fail(Assert.java:88)
	at org.junit.Assert.failNotEquals(Assert.java:743)
	at org.junit.Assert.assertEquals(Assert.java:118)
	at org.junit.Assert.assertEquals(Assert.java:555)
	at org.junit.Assert.assertEquals(Assert.java:542)
	at org.apache.hadoop.conf.TestJobConf.testNegativeValueForTaskVmem(TestJobConf.java:111)


FAILED:  org.apache.hadoop.mapreduce.TestLargeSort.testLargeSort

Error Message:
Large sort failed for 128 expected:<0> but was:<1>

Stack Trace:
java.lang.AssertionError: Large sort failed for 128 expected:<0> but was:<1>
	at org.junit.Assert.fail(Assert.java:88)
	at org.junit.Assert.failNotEquals(Assert.java:743)
	at org.junit.Assert.assertEquals(Assert.java:118)
	at org.junit.Assert.assertEquals(Assert.java:555)
	at org.apache.hadoop.mapreduce.TestLargeSort.testLargeSort(TestLargeSort.java:61)


REGRESSION:  org.apache.hadoop.yarn.server.resourcemanager.TestRM.testAppOnMultiNode[1]

Error Message:
test timed out after 30000 milliseconds

Stack Trace:
java.lang.Exception: test timed out after 30000 milliseconds
	at java.net.Inet4AddressImpl.lookupAllHostAddr(Native Method)
	at java.net.InetAddress$1.lookupAllHostAddr(InetAddress.java:901)
	at java.net.InetAddress.getAddressesFromNameService(InetAddress.java:1293)
	at java.net.InetAddress.getAllByName0(InetAddress.java:1246)
	at java.net.InetAddress.getAllByName(InetAddress.java:1162)
	at java.net.InetAddress.getAllByName(InetAddress.java:1098)
	at java.net.InetAddress.getByName(InetAddress.java:1048)
	at org.apache.hadoop.net.NetUtils.normalizeHostName(NetUtils.java:562)
	at org.apache.hadoop.yarn.server.resourcemanager.NodesListManager.isValidNode(NodesListManager.java:147)
	at org.apache.hadoop.yarn.server.resourcemanager.ResourceTrackerService.nodeHeartbeat(ResourceTrackerService.java:364)
	at org.apache.hadoop.yarn.server.resourcemanager.MockNM.nodeHeartbeat(MockNM.java:174)
	at org.apache.hadoop.yarn.server.resourcemanager.MockNM.nodeHeartbeat(MockNM.java:132)
	at org.apache.hadoop.yarn.server.resourcemanager.TestRM.testAppOnMultiNode(TestRM.java:187)


REGRESSION:  org.apache.hadoop.yarn.server.resourcemanager.recovery.TestFSRMStateStore.testFSRMStateStoreClientRetry

Error Message:
null

Stack Trace:
java.lang.AssertionError: null
	at org.junit.Assert.fail(Assert.java:86)
	at org.junit.Assert.assertTrue(Assert.java:41)
	at org.junit.Assert.assertFalse(Assert.java:64)
	at org.junit.Assert.assertFalse(Assert.java:74)
	at org.apache.hadoop.yarn.server.resourcemanager.recovery.TestFSRMStateStore.testFSRMStateStoreClientRetry(TestFSRMStateStore.java:289)



Mime
  • Unnamed multipart/mixed (inline, None, 0 bytes)
View raw message