hadoop-yarn-dev mailing list archives

Site index · List index
Message view « Date » · « Thread »
Top « Date » · « Thread »
From Apache Jenkins Server <jenk...@builds.apache.org>
Subject Hadoop-Yarn-trunk - Build # 821 - Still Failing
Date Wed, 28 Jan 2015 11:35:48 GMT
See https://builds.apache.org/job/Hadoop-Yarn-trunk/821/

###################################################################################
########################## LAST 60 LINES OF THE CONSOLE ###########################
[...truncated 8290 lines...]
[INFO] 
[INFO] hadoop-yarn ....................................... SUCCESS [  3.070 s]
[INFO] hadoop-yarn-api ................................... SUCCESS [03:01 min]
[INFO] hadoop-yarn-common ................................ SUCCESS [02:39 min]
[INFO] hadoop-yarn-server ................................ SUCCESS [  0.088 s]
[INFO] hadoop-yarn-server-common ......................... SUCCESS [ 41.213 s]
[INFO] hadoop-yarn-server-nodemanager .................... SUCCESS [06:10 min]
[INFO] hadoop-yarn-server-web-proxy ...................... SUCCESS [ 21.209 s]
[INFO] hadoop-yarn-server-applicationhistoryservice ...... SUCCESS [02:58 min]
[INFO] hadoop-yarn-server-resourcemanager ................ FAILURE [47:44 min]
[INFO] hadoop-yarn-server-tests .......................... SKIPPED
[INFO] hadoop-yarn-client ................................ SKIPPED
[INFO] hadoop-yarn-server-sharedcachemanager ............. SKIPPED
[INFO] hadoop-yarn-applications .......................... SKIPPED
[INFO] hadoop-yarn-applications-distributedshell ......... SKIPPED
[INFO] hadoop-yarn-applications-unmanaged-am-launcher .... SKIPPED
[INFO] hadoop-yarn-site .................................. SKIPPED
[INFO] hadoop-yarn-registry .............................. SKIPPED
[INFO] hadoop-yarn-project ............................... SKIPPED
[INFO] ------------------------------------------------------------------------
[INFO] BUILD FAILURE
[INFO] ------------------------------------------------------------------------
[INFO] Total time: 01:03 h
[INFO] Finished at: 2015-01-28T11:35:35+00:00
[INFO] Final Memory: 58M/699M
[INFO] ------------------------------------------------------------------------
[ERROR] Failed to execute goal org.apache.maven.plugins:maven-surefire-plugin:2.17:test (default-test)
on project hadoop-yarn-server-resourcemanager: There are test failures.
[ERROR] 
[ERROR] Please refer to /home/jenkins/jenkins-slave/workspace/Hadoop-Yarn-trunk/hadoop-yarn-project/hadoop-yarn/hadoop-yarn-server/hadoop-yarn-server-resourcemanager/target/surefire-reports
for the individual test results.
[ERROR] -> [Help 1]
[ERROR] 
[ERROR] To see the full stack trace of the errors, re-run Maven with the -e switch.
[ERROR] Re-run Maven using the -X switch to enable full debug logging.
[ERROR] 
[ERROR] For more information about the errors and possible solutions, please read the following
articles:
[ERROR] [Help 1] http://cwiki.apache.org/confluence/display/MAVEN/MojoFailureException
[ERROR] 
[ERROR] After correcting the problems, you can resume the build with the command
[ERROR]   mvn <goals> -rf :hadoop-yarn-server-resourcemanager
Build step 'Execute shell' marked build as failure
Archiving artifacts
Recording test results
Updating HDFS-3689
Updating YARN-3086
Updating YARN-2932
Updating HDFS-7683
Updating HDFS-49
Updating HADOOP-11469
Updating YARN-2897
Updating HDFS-7566
Updating YARN-3011
Updating HADOOP-10626
Updating HDFS-7675
Updating HADOOP-4297
Updating HDFS-7677
Updating YARN-3028
Sending e-mails to: yarn-dev@hadoop.apache.org
Email was triggered for: Failure
Sending email for trigger: Failure



###################################################################################
############################## FAILED TESTS (if any) ##############################
1 tests failed.
FAILED:  org.apache.hadoop.yarn.server.resourcemanager.recovery.TestFSRMStateStore.testFSRMStateStoreClientRetry

Error Message:
null

Stack Trace:
java.lang.AssertionError: null
	at org.junit.Assert.fail(Assert.java:86)
	at org.junit.Assert.assertTrue(Assert.java:41)
	at org.junit.Assert.assertFalse(Assert.java:64)
	at org.junit.Assert.assertFalse(Assert.java:74)
	at org.apache.hadoop.yarn.server.resourcemanager.recovery.TestFSRMStateStore.testFSRMStateStoreClientRetry(TestFSRMStateStore.java:289)



Mime
  • Unnamed multipart/mixed (inline, None, 0 bytes)
View raw message