hadoop-yarn-dev mailing list archives

Site index · List index
Message view « Date » · « Thread »
Top « Date » · « Thread »
From Apache Jenkins Server <jenk...@builds.apache.org>
Subject Hadoop-Yarn-trunk-Java8 - Build # 54 - Still Failing
Date Sat, 27 Dec 2014 11:31:16 GMT
See https://builds.apache.org/job/Hadoop-Yarn-trunk-Java8/54/

###################################################################################
########################## LAST 60 LINES OF THE CONSOLE ###########################
[...truncated 4728 lines...]
     [java] # Problematic frame:
     [java] # C  [libc.so.6+0x150c99]  __nss_hosts_lookup+0x18ed9
     [java] #
     [java] # Failed to write core dump. Core dumps have been disabled. To enable core dumping,
try "ulimit -c unlimited" before starting Java again
     [java] #
     [java] # An error report file with more information is saved as:
     [java] # /home/jenkins/jenkins-slave/workspace/Hadoop-Yarn-trunk-Java8/hadoop-yarn-project/hs_err_pid3660.log
     [java] #
     [java] # If you would like to submit a bug report, please visit:
     [java] #   http://bugreport.sun.com/bugreport/crash.jsp
     [java] # The crash happened outside the Java Virtual Machine in native code.
     [java] # See problematic frame for where to report the bug.
     [java] #
[INFO] ------------------------------------------------------------------------
[INFO] Reactor Summary:
[INFO] 
[INFO] hadoop-yarn ....................................... SUCCESS [  2.561 s]
[INFO] hadoop-yarn-api ................................... SUCCESS [ 53.575 s]
[INFO] hadoop-yarn-common ................................ SUCCESS [01:59 min]
[INFO] hadoop-yarn-server ................................ SUCCESS [  0.067 s]
[INFO] hadoop-yarn-server-common ......................... SUCCESS [ 32.780 s]
[INFO] hadoop-yarn-server-nodemanager .................... SUCCESS [06:06 min]
[INFO] hadoop-yarn-server-web-proxy ...................... SUCCESS [ 14.108 s]
[INFO] hadoop-yarn-server-applicationhistoryservice ...... SUCCESS [02:46 min]
[INFO] hadoop-yarn-server-resourcemanager ................ FAILURE [46:26 min]
[INFO] hadoop-yarn-server-tests .......................... SKIPPED
[INFO] hadoop-yarn-client ................................ SKIPPED
[INFO] hadoop-yarn-server-sharedcachemanager ............. SKIPPED
[INFO] hadoop-yarn-applications .......................... SKIPPED
[INFO] hadoop-yarn-applications-distributedshell ......... SKIPPED
[INFO] hadoop-yarn-applications-unmanaged-am-launcher .... SKIPPED
[INFO] hadoop-yarn-site .................................. SKIPPED
[INFO] hadoop-yarn-registry .............................. SKIPPED
[INFO] hadoop-yarn-project ............................... SKIPPED
[INFO] ------------------------------------------------------------------------
[INFO] BUILD FAILURE
[INFO] ------------------------------------------------------------------------
[INFO] Total time: 59:03 min
[INFO] Finished at: 2014-12-27T11:30:56+00:00
[INFO] Final Memory: 78M/925M
[INFO] ------------------------------------------------------------------------
[ERROR] Failed to execute goal org.codehaus.mojo:findbugs-maven-plugin:3.0.0:findbugs (default-cli)
on project hadoop-yarn-server-resourcemanager: Execution default-cli of goal org.codehaus.mojo:findbugs-maven-plugin:3.0.0:findbugs
failed: Java returned: 134 -> [Help 1]
[ERROR] 
[ERROR] To see the full stack trace of the errors, re-run Maven with the -e switch.
[ERROR] Re-run Maven using the -X switch to enable full debug logging.
[ERROR] 
[ERROR] For more information about the errors and possible solutions, please read the following
articles:
[ERROR] [Help 1] http://cwiki.apache.org/confluence/display/MAVEN/PluginExecutionException
[ERROR] 
[ERROR] After correcting the problems, you can resume the build with the command
[ERROR]   mvn <goals> -rf :hadoop-yarn-server-resourcemanager
Build step 'Execute shell' marked build as failure
Archiving artifacts
Recording test results
Updating YARN-2992
Updating YARN-2993
Sending e-mails to: yarn-dev@hadoop.apache.org
Email was triggered for: Failure
Sending email for trigger: Failure



###################################################################################
############################## FAILED TESTS (if any) ##############################
All tests passed
Mime
  • Unnamed multipart/mixed (inline, None, 0 bytes)
View raw message