hadoop-yarn-dev mailing list archives

Site index · List index
Message view « Date » · « Thread »
Top « Date » · « Thread »
From Apache Jenkins Server <jenk...@builds.apache.org>
Subject Failed: YARN-2423 PreCommit Build #6128
Date Wed, 17 Dec 2014 00:28:43 GMT
Jira: https://issues.apache.org/jira/browse/YARN-2423
Build: https://builds.apache.org/job/PreCommit-YARN-Build/6128/

###################################################################################
########################## LAST 60 LINES OF THE CONSOLE ###########################
[...truncated 3571 lines...]
  http://issues.apache.org/jira/secure/attachment/12687613/YARN-2423.004.patch
  against trunk revision e996a1b.

    {color:green}+1 @author{color}.  The patch does not contain any @author tags.

    {color:green}+1 tests included{color}.  The patch appears to include 3 new or modified
test files.

    {color:green}+1 javac{color}.  The applied patch does not increase the total number of
javac compiler warnings.

    {color:green}+1 javadoc{color}.  There were no new javadoc warning messages.

    {color:green}+1 eclipse:eclipse{color}.  The patch built with eclipse:eclipse.

    {color:red}-1 findbugs{color}.  The patch appears to introduce 36 new Findbugs (version
2.0.3) warnings.

    {color:green}+1 release audit{color}.  The applied patch does not increase the total number
of release audit warnings.

    {color:red}-1 core tests{color}.  The patch failed these unit tests in hadoop-yarn-project/hadoop-yarn/hadoop-yarn-common
hadoop-yarn-project/hadoop-yarn/hadoop-yarn-server/hadoop-yarn-server-applicationhistoryservice:

                  org.apache.hadoop.yarn.client.api.impl.TestTimelineClient

Test results: https://builds.apache.org/job/PreCommit-YARN-Build/6128//testReport/
Findbugs warnings: https://builds.apache.org/job/PreCommit-YARN-Build/6128//artifact/patchprocess/newPatchFindbugsWarningshadoop-yarn-server-applicationhistoryservice.html
Findbugs warnings: https://builds.apache.org/job/PreCommit-YARN-Build/6128//artifact/patchprocess/newPatchFindbugsWarningshadoop-yarn-common.html
Console output: https://builds.apache.org/job/PreCommit-YARN-Build/6128//console

This message is automatically generated.


======================================================================
======================================================================
    Adding comment to Jira.
======================================================================
======================================================================


Comment added.
47381ecbec7aacb7f40a6226310a186954a6f2d1 logged out


======================================================================
======================================================================
    Finished build.
======================================================================
======================================================================


Build step 'Execute shell' marked build as failure
Archiving artifacts
Sending artifact delta relative to PreCommit-YARN-Build #6051
Archived 20 artifacts
Archive block size is 32768
Received 156 blocks and 3961053 bytes
Compression is 56.3%
Took 1.4 sec
[description-setter] Could not determine description.
Recording test results
Email was triggered for: Failure
Sending email for trigger: Failure



###################################################################################
############################## FAILED TESTS (if any) ##############################
10 tests failed.
FAILED:  org.apache.hadoop.yarn.client.api.impl.TestTimelineClient.testDelegationTokenOperationsRetry

Error Message:
Can't get Kerberos realm

Stack Trace:
java.lang.IllegalArgumentException: Can't get Kerberos realm
	at sun.security.krb5.Config.getRealmFromDNS(Config.java:1277)
	at sun.security.krb5.Config.getDefaultRealm(Config.java:1162)
	at sun.reflect.NativeMethodAccessorImpl.invoke0(Native Method)
	at sun.reflect.NativeMethodAccessorImpl.invoke(NativeMethodAccessorImpl.java:57)
	at sun.reflect.DelegatingMethodAccessorImpl.invoke(DelegatingMethodAccessorImpl.java:43)
	at java.lang.reflect.Method.invoke(Method.java:606)
	at org.apache.hadoop.security.authentication.util.KerberosUtil.getDefaultRealm(KerberosUtil.java:84)
	at org.apache.hadoop.security.HadoopKerberosName.setConfiguration(HadoopKerberosName.java:63)
	at org.apache.hadoop.security.UserGroupInformation.initialize(UserGroupInformation.java:276)
	at org.apache.hadoop.security.UserGroupInformation.setConfiguration(UserGroupInformation.java:322)
	at org.apache.hadoop.yarn.client.api.impl.TestTimelineClient.testDelegationTokenOperationsRetry(TestTimelineClient.java:231)


FAILED:  org.apache.hadoop.yarn.client.api.impl.TestTimelineClient.testGetEntityNotFound

Error Message:
Failed to login

Stack Trace:
org.apache.hadoop.yarn.exceptions.YarnRuntimeException: Failed to login
	at sun.security.krb5.Config.getRealmFromDNS(Config.java:1277)
	at sun.security.krb5.Config.getDefaultRealm(Config.java:1162)
	at sun.security.krb5.PrincipalName.<init>(PrincipalName.java:365)
	at com.sun.security.auth.module.Krb5LoginModule.attemptAuthentication(Krb5LoginModule.java:616)
	at com.sun.security.auth.module.Krb5LoginModule.login(Krb5LoginModule.java:584)
	at sun.reflect.NativeMethodAccessorImpl.invoke0(Native Method)
	at sun.reflect.NativeMethodAccessorImpl.invoke(NativeMethodAccessorImpl.java:57)
	at sun.reflect.DelegatingMethodAccessorImpl.invoke(DelegatingMethodAccessorImpl.java:43)
	at java.lang.reflect.Method.invoke(Method.java:606)
	at javax.security.auth.login.LoginContext.invoke(LoginContext.java:762)
	at javax.security.auth.login.LoginContext.access$000(LoginContext.java:203)
	at javax.security.auth.login.LoginContext$4.run(LoginContext.java:690)
	at javax.security.auth.login.LoginContext$4.run(LoginContext.java:688)
	at java.security.AccessController.doPrivileged(Native Method)
	at javax.security.auth.login.LoginContext.invokePriv(LoginContext.java:687)
	at javax.security.auth.login.LoginContext.login(LoginContext.java:595)
	at org.apache.hadoop.security.UserGroupInformation.loginUserFromKeytab(UserGroupInformation.java:965)
	at org.apache.hadoop.security.SecurityUtil.login(SecurityUtil.java:245)
	at org.apache.hadoop.yarn.server.applicationhistoryservice.ApplicationHistoryServer.doSecureLogin(ApplicationHistoryServer.java:284)
	at org.apache.hadoop.yarn.server.applicationhistoryservice.ApplicationHistoryServer.serviceStart(ApplicationHistoryServer.java:105)
	at org.apache.hadoop.service.AbstractService.start(AbstractService.java:193)
	at org.apache.hadoop.yarn.client.api.impl.TestTimelineClient.testGetEntityNotFound(TestTimelineClient.java:323)


FAILED:  org.apache.hadoop.yarn.client.api.impl.TestTimelineClient.testGetEntities

Error Message:
Failed to login

Stack Trace:
org.apache.hadoop.yarn.exceptions.YarnRuntimeException: Failed to login
	at sun.security.krb5.Config.getRealmFromDNS(Config.java:1277)
	at sun.security.krb5.Config.getDefaultRealm(Config.java:1162)
	at sun.security.krb5.PrincipalName.<init>(PrincipalName.java:365)
	at com.sun.security.auth.module.Krb5LoginModule.attemptAuthentication(Krb5LoginModule.java:616)
	at com.sun.security.auth.module.Krb5LoginModule.login(Krb5LoginModule.java:584)
	at sun.reflect.NativeMethodAccessorImpl.invoke0(Native Method)
	at sun.reflect.NativeMethodAccessorImpl.invoke(NativeMethodAccessorImpl.java:57)
	at sun.reflect.DelegatingMethodAccessorImpl.invoke(DelegatingMethodAccessorImpl.java:43)
	at java.lang.reflect.Method.invoke(Method.java:606)
	at javax.security.auth.login.LoginContext.invoke(LoginContext.java:762)
	at javax.security.auth.login.LoginContext.access$000(LoginContext.java:203)
	at javax.security.auth.login.LoginContext$4.run(LoginContext.java:690)
	at javax.security.auth.login.LoginContext$4.run(LoginContext.java:688)
	at java.security.AccessController.doPrivileged(Native Method)
	at javax.security.auth.login.LoginContext.invokePriv(LoginContext.java:687)
	at javax.security.auth.login.LoginContext.login(LoginContext.java:595)
	at org.apache.hadoop.security.UserGroupInformation.loginUserFromKeytab(UserGroupInformation.java:965)
	at org.apache.hadoop.security.SecurityUtil.login(SecurityUtil.java:245)
	at org.apache.hadoop.yarn.server.applicationhistoryservice.ApplicationHistoryServer.doSecureLogin(ApplicationHistoryServer.java:284)
	at org.apache.hadoop.yarn.server.applicationhistoryservice.ApplicationHistoryServer.serviceStart(ApplicationHistoryServer.java:105)
	at org.apache.hadoop.service.AbstractService.start(AbstractService.java:193)
	at org.apache.hadoop.yarn.client.api.impl.TestTimelineClient.testGetEntities(TestTimelineClient.java:342)


FAILED:  org.apache.hadoop.yarn.client.api.impl.TestTimelineClient.testGetEntitiesNotFound

Error Message:
Failed to login

Stack Trace:
org.apache.hadoop.yarn.exceptions.YarnRuntimeException: Failed to login
	at sun.security.krb5.Config.getRealmFromDNS(Config.java:1277)
	at sun.security.krb5.Config.getDefaultRealm(Config.java:1162)
	at sun.security.krb5.PrincipalName.<init>(PrincipalName.java:365)
	at com.sun.security.auth.module.Krb5LoginModule.attemptAuthentication(Krb5LoginModule.java:616)
	at com.sun.security.auth.module.Krb5LoginModule.login(Krb5LoginModule.java:584)
	at sun.reflect.NativeMethodAccessorImpl.invoke0(Native Method)
	at sun.reflect.NativeMethodAccessorImpl.invoke(NativeMethodAccessorImpl.java:57)
	at sun.reflect.DelegatingMethodAccessorImpl.invoke(DelegatingMethodAccessorImpl.java:43)
	at java.lang.reflect.Method.invoke(Method.java:606)
	at javax.security.auth.login.LoginContext.invoke(LoginContext.java:762)
	at javax.security.auth.login.LoginContext.access$000(LoginContext.java:203)
	at javax.security.auth.login.LoginContext$4.run(LoginContext.java:690)
	at javax.security.auth.login.LoginContext$4.run(LoginContext.java:688)
	at java.security.AccessController.doPrivileged(Native Method)
	at javax.security.auth.login.LoginContext.invokePriv(LoginContext.java:687)
	at javax.security.auth.login.LoginContext.login(LoginContext.java:595)
	at org.apache.hadoop.security.UserGroupInformation.loginUserFromKeytab(UserGroupInformation.java:965)
	at org.apache.hadoop.security.SecurityUtil.login(SecurityUtil.java:245)
	at org.apache.hadoop.yarn.server.applicationhistoryservice.ApplicationHistoryServer.doSecureLogin(ApplicationHistoryServer.java:284)
	at org.apache.hadoop.yarn.server.applicationhistoryservice.ApplicationHistoryServer.serviceStart(ApplicationHistoryServer.java:105)
	at org.apache.hadoop.service.AbstractService.start(AbstractService.java:193)
	at org.apache.hadoop.yarn.client.api.impl.TestTimelineClient.testGetEntitiesNotFound(TestTimelineClient.java:460)


FAILED:  org.apache.hadoop.yarn.client.api.impl.TestTimelineClient.testGetDomainsNotFound

Error Message:
Failed to login

Stack Trace:
org.apache.hadoop.yarn.exceptions.YarnRuntimeException: Failed to login
	at sun.security.krb5.Config.getRealmFromDNS(Config.java:1277)
	at sun.security.krb5.Config.getDefaultRealm(Config.java:1162)
	at sun.security.krb5.PrincipalName.<init>(PrincipalName.java:365)
	at com.sun.security.auth.module.Krb5LoginModule.attemptAuthentication(Krb5LoginModule.java:616)
	at com.sun.security.auth.module.Krb5LoginModule.login(Krb5LoginModule.java:584)
	at sun.reflect.NativeMethodAccessorImpl.invoke0(Native Method)
	at sun.reflect.NativeMethodAccessorImpl.invoke(NativeMethodAccessorImpl.java:57)
	at sun.reflect.DelegatingMethodAccessorImpl.invoke(DelegatingMethodAccessorImpl.java:43)
	at java.lang.reflect.Method.invoke(Method.java:606)
	at javax.security.auth.login.LoginContext.invoke(LoginContext.java:762)
	at javax.security.auth.login.LoginContext.access$000(LoginContext.java:203)
	at javax.security.auth.login.LoginContext$4.run(LoginContext.java:690)
	at javax.security.auth.login.LoginContext$4.run(LoginContext.java:688)
	at java.security.AccessController.doPrivileged(Native Method)
	at javax.security.auth.login.LoginContext.invokePriv(LoginContext.java:687)
	at javax.security.auth.login.LoginContext.login(LoginContext.java:595)
	at org.apache.hadoop.security.UserGroupInformation.loginUserFromKeytab(UserGroupInformation.java:965)
	at org.apache.hadoop.security.SecurityUtil.login(SecurityUtil.java:245)
	at org.apache.hadoop.yarn.server.applicationhistoryservice.ApplicationHistoryServer.doSecureLogin(ApplicationHistoryServer.java:284)
	at org.apache.hadoop.yarn.server.applicationhistoryservice.ApplicationHistoryServer.serviceStart(ApplicationHistoryServer.java:105)
	at org.apache.hadoop.service.AbstractService.start(AbstractService.java:193)
	at org.apache.hadoop.yarn.client.api.impl.TestTimelineClient.testGetDomainsNotFound(TestTimelineClient.java:651)


FAILED:  org.apache.hadoop.yarn.client.api.impl.TestTimelineClient.testGetDomainNotFound

Error Message:
Failed to login

Stack Trace:
org.apache.hadoop.yarn.exceptions.YarnRuntimeException: Failed to login
	at sun.security.krb5.Config.getRealmFromDNS(Config.java:1277)
	at sun.security.krb5.Config.getDefaultRealm(Config.java:1162)
	at sun.security.krb5.PrincipalName.<init>(PrincipalName.java:365)
	at com.sun.security.auth.module.Krb5LoginModule.attemptAuthentication(Krb5LoginModule.java:616)
	at com.sun.security.auth.module.Krb5LoginModule.login(Krb5LoginModule.java:584)
	at sun.reflect.NativeMethodAccessorImpl.invoke0(Native Method)
	at sun.reflect.NativeMethodAccessorImpl.invoke(NativeMethodAccessorImpl.java:57)
	at sun.reflect.DelegatingMethodAccessorImpl.invoke(DelegatingMethodAccessorImpl.java:43)
	at java.lang.reflect.Method.invoke(Method.java:606)
	at javax.security.auth.login.LoginContext.invoke(LoginContext.java:762)
	at javax.security.auth.login.LoginContext.access$000(LoginContext.java:203)
	at javax.security.auth.login.LoginContext$4.run(LoginContext.java:690)
	at javax.security.auth.login.LoginContext$4.run(LoginContext.java:688)
	at java.security.AccessController.doPrivileged(Native Method)
	at javax.security.auth.login.LoginContext.invokePriv(LoginContext.java:687)
	at javax.security.auth.login.LoginContext.login(LoginContext.java:595)
	at org.apache.hadoop.security.UserGroupInformation.loginUserFromKeytab(UserGroupInformation.java:965)
	at org.apache.hadoop.security.SecurityUtil.login(SecurityUtil.java:245)
	at org.apache.hadoop.yarn.server.applicationhistoryservice.ApplicationHistoryServer.doSecureLogin(ApplicationHistoryServer.java:284)
	at org.apache.hadoop.yarn.server.applicationhistoryservice.ApplicationHistoryServer.serviceStart(ApplicationHistoryServer.java:105)
	at org.apache.hadoop.service.AbstractService.start(AbstractService.java:193)
	at org.apache.hadoop.yarn.client.api.impl.TestTimelineClient.testGetDomainNotFound(TestTimelineClient.java:604)


FAILED:  org.apache.hadoop.yarn.client.api.impl.TestTimelineClient.testGetEventsNotFound

Error Message:
Failed to login

Stack Trace:
org.apache.hadoop.yarn.exceptions.YarnRuntimeException: Failed to login
	at sun.security.krb5.Config.getRealmFromDNS(Config.java:1277)
	at sun.security.krb5.Config.getDefaultRealm(Config.java:1162)
	at sun.security.krb5.PrincipalName.<init>(PrincipalName.java:365)
	at com.sun.security.auth.module.Krb5LoginModule.attemptAuthentication(Krb5LoginModule.java:616)
	at com.sun.security.auth.module.Krb5LoginModule.login(Krb5LoginModule.java:584)
	at sun.reflect.NativeMethodAccessorImpl.invoke0(Native Method)
	at sun.reflect.NativeMethodAccessorImpl.invoke(NativeMethodAccessorImpl.java:57)
	at sun.reflect.DelegatingMethodAccessorImpl.invoke(DelegatingMethodAccessorImpl.java:43)
	at java.lang.reflect.Method.invoke(Method.java:606)
	at javax.security.auth.login.LoginContext.invoke(LoginContext.java:762)
	at javax.security.auth.login.LoginContext.access$000(LoginContext.java:203)
	at javax.security.auth.login.LoginContext$4.run(LoginContext.java:690)
	at javax.security.auth.login.LoginContext$4.run(LoginContext.java:688)
	at java.security.AccessController.doPrivileged(Native Method)
	at javax.security.auth.login.LoginContext.invokePriv(LoginContext.java:687)
	at javax.security.auth.login.LoginContext.login(LoginContext.java:595)
	at org.apache.hadoop.security.UserGroupInformation.loginUserFromKeytab(UserGroupInformation.java:965)
	at org.apache.hadoop.security.SecurityUtil.login(SecurityUtil.java:245)
	at org.apache.hadoop.yarn.server.applicationhistoryservice.ApplicationHistoryServer.doSecureLogin(ApplicationHistoryServer.java:284)
	at org.apache.hadoop.yarn.server.applicationhistoryservice.ApplicationHistoryServer.serviceStart(ApplicationHistoryServer.java:105)
	at org.apache.hadoop.service.AbstractService.start(AbstractService.java:193)
	at org.apache.hadoop.yarn.client.api.impl.TestTimelineClient.testGetEventsNotFound(TestTimelineClient.java:573)


FAILED:  org.apache.hadoop.yarn.client.api.impl.TestTimelineClient.testGetDomain

Error Message:
Failed to login

Stack Trace:
org.apache.hadoop.yarn.exceptions.YarnRuntimeException: Failed to login
	at sun.security.krb5.Config.getRealmFromDNS(Config.java:1277)
	at sun.security.krb5.Config.getDefaultRealm(Config.java:1162)
	at sun.security.krb5.PrincipalName.<init>(PrincipalName.java:365)
	at com.sun.security.auth.module.Krb5LoginModule.attemptAuthentication(Krb5LoginModule.java:616)
	at com.sun.security.auth.module.Krb5LoginModule.login(Krb5LoginModule.java:584)
	at sun.reflect.NativeMethodAccessorImpl.invoke0(Native Method)
	at sun.reflect.NativeMethodAccessorImpl.invoke(NativeMethodAccessorImpl.java:57)
	at sun.reflect.DelegatingMethodAccessorImpl.invoke(DelegatingMethodAccessorImpl.java:43)
	at java.lang.reflect.Method.invoke(Method.java:606)
	at javax.security.auth.login.LoginContext.invoke(LoginContext.java:762)
	at javax.security.auth.login.LoginContext.access$000(LoginContext.java:203)
	at javax.security.auth.login.LoginContext$4.run(LoginContext.java:690)
	at javax.security.auth.login.LoginContext$4.run(LoginContext.java:688)
	at java.security.AccessController.doPrivileged(Native Method)
	at javax.security.auth.login.LoginContext.invokePriv(LoginContext.java:687)
	at javax.security.auth.login.LoginContext.login(LoginContext.java:595)
	at org.apache.hadoop.security.UserGroupInformation.loginUserFromKeytab(UserGroupInformation.java:965)
	at org.apache.hadoop.security.SecurityUtil.login(SecurityUtil.java:245)
	at org.apache.hadoop.yarn.server.applicationhistoryservice.ApplicationHistoryServer.doSecureLogin(ApplicationHistoryServer.java:284)
	at org.apache.hadoop.yarn.server.applicationhistoryservice.ApplicationHistoryServer.serviceStart(ApplicationHistoryServer.java:105)
	at org.apache.hadoop.service.AbstractService.start(AbstractService.java:193)
	at org.apache.hadoop.yarn.client.api.impl.TestTimelineClient.testGetDomain(TestTimelineClient.java:588)


FAILED:  org.apache.hadoop.yarn.client.api.impl.TestTimelineClient.testGetEntity

Error Message:
Failed to login

Stack Trace:
org.apache.hadoop.yarn.exceptions.YarnRuntimeException: Failed to login
	at sun.security.krb5.Config.getRealmFromDNS(Config.java:1277)
	at sun.security.krb5.Config.getDefaultRealm(Config.java:1162)
	at sun.security.krb5.PrincipalName.<init>(PrincipalName.java:365)
	at com.sun.security.auth.module.Krb5LoginModule.attemptAuthentication(Krb5LoginModule.java:616)
	at com.sun.security.auth.module.Krb5LoginModule.login(Krb5LoginModule.java:584)
	at sun.reflect.NativeMethodAccessorImpl.invoke0(Native Method)
	at sun.reflect.NativeMethodAccessorImpl.invoke(NativeMethodAccessorImpl.java:57)
	at sun.reflect.DelegatingMethodAccessorImpl.invoke(DelegatingMethodAccessorImpl.java:43)
	at java.lang.reflect.Method.invoke(Method.java:606)
	at javax.security.auth.login.LoginContext.invoke(LoginContext.java:762)
	at javax.security.auth.login.LoginContext.access$000(LoginContext.java:203)
	at javax.security.auth.login.LoginContext$4.run(LoginContext.java:690)
	at javax.security.auth.login.LoginContext$4.run(LoginContext.java:688)
	at java.security.AccessController.doPrivileged(Native Method)
	at javax.security.auth.login.LoginContext.invokePriv(LoginContext.java:687)
	at javax.security.auth.login.LoginContext.login(LoginContext.java:595)
	at org.apache.hadoop.security.UserGroupInformation.loginUserFromKeytab(UserGroupInformation.java:965)
	at org.apache.hadoop.security.SecurityUtil.login(SecurityUtil.java:245)
	at org.apache.hadoop.yarn.server.applicationhistoryservice.ApplicationHistoryServer.doSecureLogin(ApplicationHistoryServer.java:284)
	at org.apache.hadoop.yarn.server.applicationhistoryservice.ApplicationHistoryServer.serviceStart(ApplicationHistoryServer.java:105)
	at org.apache.hadoop.service.AbstractService.start(AbstractService.java:193)
	at org.apache.hadoop.yarn.client.api.impl.TestTimelineClient.testGetEntity(TestTimelineClient.java:283)


FAILED:  org.apache.hadoop.yarn.client.api.impl.TestTimelineClient.testGetEvents

Error Message:
Failed to login

Stack Trace:
org.apache.hadoop.yarn.exceptions.YarnRuntimeException: Failed to login
	at sun.security.krb5.Config.getRealmFromDNS(Config.java:1277)
	at sun.security.krb5.Config.getDefaultRealm(Config.java:1162)
	at sun.security.krb5.PrincipalName.<init>(PrincipalName.java:365)
	at com.sun.security.auth.module.Krb5LoginModule.attemptAuthentication(Krb5LoginModule.java:616)
	at com.sun.security.auth.module.Krb5LoginModule.login(Krb5LoginModule.java:584)
	at sun.reflect.NativeMethodAccessorImpl.invoke0(Native Method)
	at sun.reflect.NativeMethodAccessorImpl.invoke(NativeMethodAccessorImpl.java:57)
	at sun.reflect.DelegatingMethodAccessorImpl.invoke(DelegatingMethodAccessorImpl.java:43)
	at java.lang.reflect.Method.invoke(Method.java:606)
	at javax.security.auth.login.LoginContext.invoke(LoginContext.java:762)
	at javax.security.auth.login.LoginContext.access$000(LoginContext.java:203)
	at javax.security.auth.login.LoginContext$4.run(LoginContext.java:690)
	at javax.security.auth.login.LoginContext$4.run(LoginContext.java:688)
	at java.security.AccessController.doPrivileged(Native Method)
	at javax.security.auth.login.LoginContext.invokePriv(LoginContext.java:687)
	at javax.security.auth.login.LoginContext.login(LoginContext.java:595)
	at org.apache.hadoop.security.UserGroupInformation.loginUserFromKeytab(UserGroupInformation.java:965)
	at org.apache.hadoop.security.SecurityUtil.login(SecurityUtil.java:245)
	at org.apache.hadoop.yarn.server.applicationhistoryservice.ApplicationHistoryServer.doSecureLogin(ApplicationHistoryServer.java:284)
	at org.apache.hadoop.yarn.server.applicationhistoryservice.ApplicationHistoryServer.serviceStart(ApplicationHistoryServer.java:105)
	at org.apache.hadoop.service.AbstractService.start(AbstractService.java:193)
	at org.apache.hadoop.yarn.client.api.impl.TestTimelineClient.testGetEvents(TestTimelineClient.java:475)



Mime
  • Unnamed multipart/mixed (inline, None, 0 bytes)
View raw message