hadoop-yarn-dev mailing list archives

Site index · List index
Message view « Date » · « Thread »
Top « Date » · « Thread »
From Apache Jenkins Server <jenk...@builds.apache.org>
Subject Failed: YARN-2919 PreCommit Build #6069
Date Wed, 10 Dec 2014 08:03:20 GMT
Jira: https://issues.apache.org/jira/browse/YARN-2919
Build: https://builds.apache.org/job/PreCommit-YARN-Build/6069/

###################################################################################
########################## LAST 60 LINES OF THE CONSOLE ###########################
[...truncated 7118 lines...]

    {color:green}+1 @author{color}.  The patch does not contain any @author tags.

    {color:red}-1 tests included{color}.  The patch doesn't appear to include any new or modified
tests.
                        Please justify why no new tests are needed for this patch.
                        Also please list what manual steps were performed to verify this patch.

    {color:green}+1 javac{color}.  The applied patch does not increase the total number of
javac compiler warnings.

    {color:green}+1 javadoc{color}.  There were no new javadoc warning messages.

    {color:green}+1 eclipse:eclipse{color}.  The patch built with eclipse:eclipse.

    {color:red}-1 findbugs{color}.  The patch appears to introduce 15 new Findbugs (version
2.0.3) warnings.

    {color:green}+1 release audit{color}.  The applied patch does not increase the total number
of release audit warnings.

    {color:red}-1 core tests{color}.  The patch failed these unit tests in hadoop-yarn-project/hadoop-yarn/hadoop-yarn-server/hadoop-yarn-server-resourcemanager:

                  org.apache.hadoop.yarn.server.resourcemanager.TestWorkPreservingRMRestart
                  org.apache.hadoop.yarn.server.resourcemanager.TestRM

Test results: https://builds.apache.org/job/PreCommit-YARN-Build/6069//testReport/
Findbugs warnings: https://builds.apache.org/job/PreCommit-YARN-Build/6069//artifact/patchprocess/newPatchFindbugsWarningshadoop-yarn-server-resourcemanager.html
Console output: https://builds.apache.org/job/PreCommit-YARN-Build/6069//console

This message is automatically generated.


======================================================================
======================================================================
    Adding comment to Jira.
======================================================================
======================================================================


Comment added.
79cebae7051662eb0350af741caf0589d3b3476d logged out


======================================================================
======================================================================
    Finished build.
======================================================================
======================================================================


Build step 'Execute shell' marked build as failure
Archiving artifacts
Sending artifact delta relative to PreCommit-YARN-Build #6051
Archived 15 artifacts
Archive block size is 32768
Received 171 blocks and 3519585 bytes
Compression is 61.4%
Took 1.4 sec
[description-setter] Could not determine description.
Recording test results
Email was triggered for: Failure
Sending email for trigger: Failure



###################################################################################
############################## FAILED TESTS (if any) ##############################
6 tests failed.
FAILED:  org.apache.hadoop.yarn.server.resourcemanager.TestRM.testNMTokenSentForNormalContainer[0]

Error Message:
test timed out after 20000 milliseconds

Stack Trace:
java.lang.Exception: test timed out after 20000 milliseconds
	at sun.misc.Unsafe.park(Native Method)
	at java.util.concurrent.locks.LockSupport.park(LockSupport.java:186)
	at java.util.concurrent.locks.AbstractQueuedSynchronizer.parkAndCheckInterrupt(AbstractQueuedSynchronizer.java:834)
	at java.util.concurrent.locks.AbstractQueuedSynchronizer.doAcquireShared(AbstractQueuedSynchronizer.java:964)
	at java.util.concurrent.locks.AbstractQueuedSynchronizer.acquireShared(AbstractQueuedSynchronizer.java:1282)
	at java.util.concurrent.locks.ReentrantReadWriteLock$ReadLock.lock(ReentrantReadWriteLock.java:731)
	at org.apache.hadoop.yarn.server.resourcemanager.rmapp.attempt.RMAppAttemptImpl.getAppAttemptState(RMAppAttemptImpl.java:476)
	at org.apache.hadoop.yarn.server.resourcemanager.MockAM.waitForState(MockAM.java:78)
	at org.apache.hadoop.yarn.server.resourcemanager.MockRM.sendAMLaunched(MockRM.java:496)
	at org.apache.hadoop.yarn.server.resourcemanager.MockRM.launchAM(MockRM.java:661)
	at org.apache.hadoop.yarn.server.resourcemanager.TestRM.testNMTokenSentForNormalContainer(TestRM.java:223)


FAILED:  org.apache.hadoop.yarn.server.resourcemanager.TestRM.testNMToken[0]

Error Message:
test timed out after 40000 milliseconds

Stack Trace:
java.lang.Exception: test timed out after 40000 milliseconds
	at java.net.Inet4AddressImpl.lookupAllHostAddr(Native Method)
	at java.net.InetAddress$1.lookupAllHostAddr(InetAddress.java:901)
	at java.net.InetAddress.getAddressesFromNameService(InetAddress.java:1293)
	at java.net.InetAddress.getAllByName0(InetAddress.java:1246)
	at java.net.InetAddress.getAllByName(InetAddress.java:1162)
	at java.net.InetAddress.getAllByName(InetAddress.java:1098)
	at java.net.InetAddress.getByName(InetAddress.java:1048)
	at org.apache.hadoop.net.NetUtils.normalizeHostName(NetUtils.java:562)
	at org.apache.hadoop.yarn.server.resourcemanager.NodesListManager.isValidNode(NodesListManager.java:147)
	at org.apache.hadoop.yarn.server.resourcemanager.ResourceTrackerService.registerNodeManager(ResourceTrackerService.java:276)
	at org.apache.hadoop.yarn.server.resourcemanager.MockNM.registerNode(MockNM.java:123)
	at org.apache.hadoop.yarn.server.resourcemanager.MockNM.registerNode(MockNM.java:103)
	at org.apache.hadoop.yarn.server.resourcemanager.MockRM.registerNode(MockRM.java:438)
	at org.apache.hadoop.yarn.server.resourcemanager.TestRM.testNMToken(TestRM.java:311)


FAILED:  org.apache.hadoop.yarn.server.resourcemanager.TestRM.testNMTokenSentForNormalContainer[1]

Error Message:
test timed out after 20000 milliseconds

Stack Trace:
java.lang.Exception: test timed out after 20000 milliseconds
	at java.net.Inet4AddressImpl.lookupAllHostAddr(Native Method)
	at java.net.InetAddress$1.lookupAllHostAddr(InetAddress.java:901)
	at java.net.InetAddress.getAddressesFromNameService(InetAddress.java:1293)
	at java.net.InetAddress.getAllByName0(InetAddress.java:1246)
	at java.net.InetAddress.getAllByName(InetAddress.java:1162)
	at java.net.InetAddress.getAllByName(InetAddress.java:1098)
	at java.net.InetAddress.getByName(InetAddress.java:1048)
	at org.apache.hadoop.security.SecurityUtil$QualifiedHostResolver.getInetAddressByName(SecurityUtil.java:598)
	at org.apache.hadoop.security.SecurityUtil$QualifiedHostResolver.getByExactName(SecurityUtil.java:571)
	at org.apache.hadoop.security.SecurityUtil$QualifiedHostResolver.getByName(SecurityUtil.java:552)
	at org.apache.hadoop.security.SecurityUtil.getByName(SecurityUtil.java:464)
	at org.apache.hadoop.net.NetUtils.createSocketAddrForHost(NetUtils.java:236)
	at org.apache.hadoop.yarn.server.utils.BuilderUtils.newContainerToken(BuilderUtils.java:255)
	at org.apache.hadoop.yarn.server.resourcemanager.security.RMContainerTokenSecretManager.createContainerToken(RMContainerTokenSecretManager.java:220)
	at org.apache.hadoop.yarn.server.resourcemanager.scheduler.SchedulerApplicationAttempt.pullNewlyAllocatedContainersAndNMTokens(SchedulerApplicationAttempt.java:448)
	at org.apache.hadoop.yarn.server.resourcemanager.scheduler.common.fica.FiCaSchedulerApp.getAllocation(FiCaSchedulerApp.java:254)
	at org.apache.hadoop.yarn.server.resourcemanager.scheduler.capacity.CapacityScheduler.allocate(CapacityScheduler.java:890)
	at org.apache.hadoop.yarn.server.resourcemanager.ApplicationMasterService.allocate(ApplicationMasterService.java:529)
	at org.apache.hadoop.yarn.server.resourcemanager.MockAM$2.run(MockAM.java:220)
	at org.apache.hadoop.yarn.server.resourcemanager.MockAM$2.run(MockAM.java:217)
	at java.security.AccessController.doPrivileged(Native Method)
	at javax.security.auth.Subject.doAs(Subject.java:415)
	at org.apache.hadoop.security.UserGroupInformation.doAs(UserGroupInformation.java:1669)
	at org.apache.hadoop.yarn.server.resourcemanager.MockAM.allocate(MockAM.java:217)
	at org.apache.hadoop.yarn.server.resourcemanager.MockAM.allocate(MockAM.java:156)
	at org.apache.hadoop.yarn.server.resourcemanager.MockAM.allocate(MockAM.java:147)
	at org.apache.hadoop.yarn.server.resourcemanager.TestRM.testNMTokenSentForNormalContainer(TestRM.java:241)


FAILED:  org.apache.hadoop.yarn.server.resourcemanager.TestRM.testAppOnMultiNode[1]

Error Message:
test timed out after 30000 milliseconds

Stack Trace:
java.lang.Exception: test timed out after 30000 milliseconds
	at java.net.Inet4AddressImpl.lookupAllHostAddr(Native Method)
	at java.net.InetAddress$1.lookupAllHostAddr(InetAddress.java:901)
	at java.net.InetAddress.getAddressesFromNameService(InetAddress.java:1293)
	at java.net.InetAddress.getAllByName0(InetAddress.java:1246)
	at java.net.InetAddress.getAllByName(InetAddress.java:1162)
	at java.net.InetAddress.getAllByName(InetAddress.java:1098)
	at java.net.InetAddress.getByName(InetAddress.java:1048)
	at org.apache.hadoop.net.NetUtils.normalizeHostName(NetUtils.java:562)
	at org.apache.hadoop.yarn.server.resourcemanager.NodesListManager.isValidNode(NodesListManager.java:147)
	at org.apache.hadoop.yarn.server.resourcemanager.ResourceTrackerService.nodeHeartbeat(ResourceTrackerService.java:364)
	at org.apache.hadoop.yarn.server.resourcemanager.MockNM.nodeHeartbeat(MockNM.java:174)
	at org.apache.hadoop.yarn.server.resourcemanager.MockNM.nodeHeartbeat(MockNM.java:132)
	at org.apache.hadoop.yarn.server.resourcemanager.TestRM.testAppOnMultiNode(TestRM.java:187)


FAILED:  org.apache.hadoop.yarn.server.resourcemanager.TestRM.testNMToken[1]

Error Message:
test timed out after 40000 milliseconds

Stack Trace:
java.lang.Exception: test timed out after 40000 milliseconds
	at java.net.Inet4AddressImpl.lookupAllHostAddr(Native Method)
	at java.net.InetAddress$1.lookupAllHostAddr(InetAddress.java:901)
	at java.net.InetAddress.getAddressesFromNameService(InetAddress.java:1293)
	at java.net.InetAddress.getAllByName0(InetAddress.java:1246)
	at java.net.InetAddress.getAllByName(InetAddress.java:1162)
	at java.net.InetAddress.getAllByName(InetAddress.java:1098)
	at java.net.InetAddress.getByName(InetAddress.java:1048)
	at org.apache.hadoop.net.NetUtils.normalizeHostName(NetUtils.java:562)
	at org.apache.hadoop.yarn.server.resourcemanager.NodesListManager.isValidNode(NodesListManager.java:147)
	at org.apache.hadoop.yarn.server.resourcemanager.ResourceTrackerService.nodeHeartbeat(ResourceTrackerService.java:364)
	at org.apache.hadoop.yarn.server.resourcemanager.MockNM.nodeHeartbeat(MockNM.java:174)
	at org.apache.hadoop.yarn.server.resourcemanager.MockNM.nodeHeartbeat(MockNM.java:132)
	at org.apache.hadoop.yarn.server.resourcemanager.TestRM.allocateContainersAndValidateNMTokens(TestRM.java:422)
	at org.apache.hadoop.yarn.server.resourcemanager.TestRM.testNMToken(TestRM.java:296)


FAILED:  org.apache.hadoop.yarn.server.resourcemanager.TestWorkPreservingRMRestart.testReleasedContainerNotRecovered[1]

Error Message:
test timed out after 30000 milliseconds

Stack Trace:
java.lang.Exception: test timed out after 30000 milliseconds
	at java.lang.Thread.sleep(Native Method)
	at org.apache.hadoop.yarn.server.resourcemanager.MockRM.waitForState(MockRM.java:149)
	at org.apache.hadoop.yarn.server.resourcemanager.MockRM.launchAM(MockRM.java:662)
	at org.apache.hadoop.yarn.server.resourcemanager.MockRM.launchAndRegisterAM(MockRM.java:668)
	at org.apache.hadoop.yarn.server.resourcemanager.TestWorkPreservingRMRestart.testReleasedContainerNotRecovered(TestWorkPreservingRMRestart.java:850)



Mime
  • Unnamed multipart/mixed (inline, None, 0 bytes)
View raw message