hadoop-yarn-dev mailing list archives

Site index · List index
Message view « Date » · « Thread »
Top « Date » · « Thread »
From Apache Jenkins Server <jenk...@builds.apache.org>
Subject Failed: YARN-2837 PreCommit Build #6182
Date Wed, 24 Dec 2014 01:00:37 GMT
Jira: https://issues.apache.org/jira/browse/YARN-2837
Build: https://builds.apache.org/job/PreCommit-YARN-Build/6182/

###################################################################################
########################## LAST 60 LINES OF THE CONSOLE ###########################
[...truncated 4722 lines...]
  http://issues.apache.org/jira/secure/attachment/12688940/YARN-2837.7.patch
  against trunk revision 66cfe1d.

    {color:green}+1 @author{color}.  The patch does not contain any @author tags.

    {color:green}+1 tests included{color}.  The patch appears to include 4 new or modified
test files.

    {color:green}+1 javac{color}.  The applied patch does not increase the total number of
javac compiler warnings.

    {color:green}+1 javadoc{color}.  There were no new javadoc warning messages.

    {color:green}+1 eclipse:eclipse{color}.  The patch built with eclipse:eclipse.

    {color:red}-1 findbugs{color}.  The patch appears to introduce 24 new Findbugs (version
2.0.3) warnings.

    {color:green}+1 release audit{color}.  The applied patch does not increase the total number
of release audit warnings.

    {color:red}-1 core tests{color}.  The patch failed these unit tests in hadoop-yarn-project/hadoop-yarn/hadoop-yarn-api
hadoop-yarn-project/hadoop-yarn/hadoop-yarn-common hadoop-yarn-project/hadoop-yarn/hadoop-yarn-server/hadoop-yarn-server-applicationhistoryservice
hadoop-yarn-project/hadoop-yarn/hadoop-yarn-server/hadoop-yarn-server-resourcemanager hadoop-yarn-project/hadoop-yarn/hadoop-yarn-server/hadoop-yarn-server-tests:

                  org.apache.hadoop.yarn.server.resourcemanager.TestRMRestart

Test results: https://builds.apache.org/job/PreCommit-YARN-Build/6182//testReport/
Findbugs warnings: https://builds.apache.org/job/PreCommit-YARN-Build/6182//artifact/patchprocess/newPatchFindbugsWarningshadoop-yarn-server-applicationhistoryservice.html
Findbugs warnings: https://builds.apache.org/job/PreCommit-YARN-Build/6182//artifact/patchprocess/newPatchFindbugsWarningshadoop-yarn-server-resourcemanager.html
Console output: https://builds.apache.org/job/PreCommit-YARN-Build/6182//console

This message is automatically generated.


======================================================================
======================================================================
    Adding comment to Jira.
======================================================================
======================================================================


Comment added.
68fd686b99f7964f8ff3865af9b7fd541fcf02cc logged out


======================================================================
======================================================================
    Finished build.
======================================================================
======================================================================


Build step 'Execute shell' marked build as failure
Archiving artifacts
Sending artifact delta relative to PreCommit-YARN-Build #6051
Archived 35 artifacts
Archive block size is 32768
Received 137 blocks and 5336155 bytes
Compression is 45.7%
Took 1.6 sec
[description-setter] Could not determine description.
Recording test results
Email was triggered for: Failure
Sending email for trigger: Failure



###################################################################################
############################## FAILED TESTS (if any) ##############################
1 tests failed.
FAILED:  org.apache.hadoop.yarn.server.resourcemanager.TestRMRestart.testDecomissionedNMsMetricsOnRMRestart[0]

Error Message:
test timed out after 60000 milliseconds

Stack Trace:
java.lang.Exception: test timed out after 60000 milliseconds
	at java.lang.Object.wait(Native Method)
	at java.lang.Thread.join(Thread.java:1281)
	at java.lang.Thread.join(Thread.java:1355)
	at org.apache.hadoop.yarn.event.AsyncDispatcher.serviceStop(AsyncDispatcher.java:150)
	at org.apache.hadoop.service.AbstractService.stop(AbstractService.java:221)
	at org.apache.hadoop.service.ServiceOperations.stop(ServiceOperations.java:52)
	at org.apache.hadoop.service.ServiceOperations.stopQuietly(ServiceOperations.java:80)
	at org.apache.hadoop.service.CompositeService.stop(CompositeService.java:157)
	at org.apache.hadoop.service.CompositeService.serviceStop(CompositeService.java:131)
	at org.apache.hadoop.yarn.server.resourcemanager.ResourceManager.serviceStop(ResourceManager.java:1106)
	at org.apache.hadoop.service.AbstractService.stop(AbstractService.java:221)
	at org.apache.hadoop.yarn.server.resourcemanager.TestRMRestart.testDecomissionedNMsMetricsOnRMRestart(TestRMRestart.java:1873)



Mime
  • Unnamed multipart/mixed (inline, None, 0 bytes)
View raw message