hadoop-yarn-dev mailing list archives

Site index · List index
Message view « Date » · « Thread »
Top « Date » · « Thread »
From Apache Jenkins Server <jenk...@builds.apache.org>
Subject Build failed in Jenkins: Hadoop-Yarn-trunk-Java8 #41
Date Sun, 14 Dec 2014 11:43:20 GMT
See <https://builds.apache.org/job/Hadoop-Yarn-trunk-Java8/41/changes>

Changes:

[gera] MAPREDUCE-4879. TeraOutputFormat may overwrite an existing output directory. (gera)

------------------------------------------
[...truncated 4797 lines...]
[WARNING] Failed to retrieve plugin descriptor for org.eclipse.m2e:lifecycle-mapping:1.0.0:
Plugin org.eclipse.m2e:lifecycle-mapping:1.0.0 or one of its dependencies could not be resolved:
Failure to find org.eclipse.m2e:lifecycle-mapping:jar:1.0.0 in http://repo.maven.apache.org/maven2
was cached in the local repository, resolution will not be reattempted until the update interval
of central has elapsed or updates are forced
[INFO] 
[INFO] --- maven-clean-plugin:2.4.1:clean (default-clean) @ hadoop-yarn-client ---
[INFO] Deleting <https://builds.apache.org/job/Hadoop-Yarn-trunk-Java8/ws/hadoop-yarn-project/hadoop-yarn/hadoop-yarn-client/target>
[INFO] 
[INFO] --- maven-antrun-plugin:1.7:run (create-testdirs) @ hadoop-yarn-client ---
[INFO] Executing tasks

main:
    [mkdir] Created dir: <https://builds.apache.org/job/Hadoop-Yarn-trunk-Java8/ws/hadoop-yarn-project/hadoop-yarn/hadoop-yarn-client/target/test-dir>
[INFO] Executed tasks
[INFO] 
[INFO] --- hadoop-maven-plugins:3.0.0-SNAPSHOT:protoc (compile-protoc) @ hadoop-yarn-client
---
[INFO] 
[INFO] --- maven-resources-plugin:2.2:resources (default-resources) @ hadoop-yarn-client ---
[INFO] Using default encoding to copy filtered resources.
[INFO] 
[INFO] --- maven-compiler-plugin:2.5.1:compile (default-compile) @ hadoop-yarn-client ---
[INFO] Compiling 29 source files to <https://builds.apache.org/job/Hadoop-Yarn-trunk-Java8/ws/hadoop-yarn-project/hadoop-yarn/hadoop-yarn-client/target/classes>
[INFO] 
[INFO] --- maven-resources-plugin:2.2:testResources (default-testResources) @ hadoop-yarn-client
---
[INFO] Using default encoding to copy filtered resources.
[INFO] 
[INFO] --- maven-compiler-plugin:2.5.1:testCompile (default-testCompile) @ hadoop-yarn-client
---
[INFO] Compiling 21 source files to <https://builds.apache.org/job/Hadoop-Yarn-trunk-Java8/ws/hadoop-yarn-project/hadoop-yarn/hadoop-yarn-client/target/test-classes>
[INFO] 
[INFO] --- maven-surefire-plugin:2.17:test (default-test) @ hadoop-yarn-client ---
[INFO] Surefire report directory: <https://builds.apache.org/job/Hadoop-Yarn-trunk-Java8/ws/hadoop-yarn-project/hadoop-yarn/hadoop-yarn-client/target/surefire-reports>

-------------------------------------------------------
 T E S T S
-------------------------------------------------------

-------------------------------------------------------
 T E S T S
-------------------------------------------------------
Java HotSpot(TM) 64-Bit Server VM warning: ignoring option MaxPermSize=768m; support was removed
in 8.0
Running org.apache.hadoop.yarn.client.TestResourceManagerAdministrationProtocolPBClientImpl
Tests run: 7, Failures: 0, Errors: 0, Skipped: 0, Time elapsed: 2.712 sec - in org.apache.hadoop.yarn.client.TestResourceManagerAdministrationProtocolPBClientImpl
Java HotSpot(TM) 64-Bit Server VM warning: ignoring option MaxPermSize=768m; support was removed
in 8.0
Running org.apache.hadoop.yarn.client.TestYarnApiClasses
Tests run: 3, Failures: 0, Errors: 0, Skipped: 0, Time elapsed: 0.323 sec - in org.apache.hadoop.yarn.client.TestYarnApiClasses
Java HotSpot(TM) 64-Bit Server VM warning: ignoring option MaxPermSize=768m; support was removed
in 8.0
Running org.apache.hadoop.yarn.client.TestGetGroups
Tests run: 6, Failures: 0, Errors: 0, Skipped: 0, Time elapsed: 2.776 sec - in org.apache.hadoop.yarn.client.TestGetGroups
Java HotSpot(TM) 64-Bit Server VM warning: ignoring option MaxPermSize=768m; support was removed
in 8.0
Running org.apache.hadoop.yarn.client.TestRMFailover
Tests run: 5, Failures: 0, Errors: 0, Skipped: 0, Time elapsed: 40.649 sec - in org.apache.hadoop.yarn.client.TestRMFailover
Java HotSpot(TM) 64-Bit Server VM warning: ignoring option MaxPermSize=768m; support was removed
in 8.0
Running org.apache.hadoop.yarn.client.cli.TestRMAdminCLI
Tests run: 19, Failures: 0, Errors: 0, Skipped: 0, Time elapsed: 1.24 sec - in org.apache.hadoop.yarn.client.cli.TestRMAdminCLI
Java HotSpot(TM) 64-Bit Server VM warning: ignoring option MaxPermSize=768m; support was removed
in 8.0
Running org.apache.hadoop.yarn.client.cli.TestLogsCLI
Tests run: 5, Failures: 0, Errors: 0, Skipped: 0, Time elapsed: 1.144 sec - in org.apache.hadoop.yarn.client.cli.TestLogsCLI
Java HotSpot(TM) 64-Bit Server VM warning: ignoring option MaxPermSize=768m; support was removed
in 8.0
Running org.apache.hadoop.yarn.client.cli.TestYarnCLI
Tests run: 23, Failures: 0, Errors: 0, Skipped: 0, Time elapsed: 1.73 sec - in org.apache.hadoop.yarn.client.cli.TestYarnCLI
Java HotSpot(TM) 64-Bit Server VM warning: ignoring option MaxPermSize=768m; support was removed
in 8.0
Running org.apache.hadoop.yarn.client.api.impl.TestAHSClient
Tests run: 7, Failures: 0, Errors: 0, Skipped: 0, Time elapsed: 1.069 sec - in org.apache.hadoop.yarn.client.api.impl.TestAHSClient
Java HotSpot(TM) 64-Bit Server VM warning: ignoring option MaxPermSize=768m; support was removed
in 8.0
Running org.apache.hadoop.yarn.client.api.impl.TestAMRMClientOnRMRestart
Tests run: 3, Failures: 0, Errors: 0, Skipped: 0, Time elapsed: 33.481 sec - in org.apache.hadoop.yarn.client.api.impl.TestAMRMClientOnRMRestart
Java HotSpot(TM) 64-Bit Server VM warning: ignoring option MaxPermSize=768m; support was removed
in 8.0
Running org.apache.hadoop.yarn.client.api.impl.TestYarnClient
Tests run: 16, Failures: 0, Errors: 0, Skipped: 0, Time elapsed: 21.581 sec - in org.apache.hadoop.yarn.client.api.impl.TestYarnClient
Java HotSpot(TM) 64-Bit Server VM warning: ignoring option MaxPermSize=768m; support was removed
in 8.0
Running org.apache.hadoop.yarn.client.api.impl.TestAMRMClientContainerRequest
Tests run: 5, Failures: 0, Errors: 0, Skipped: 0, Time elapsed: 9.055 sec - in org.apache.hadoop.yarn.client.api.impl.TestAMRMClientContainerRequest
Java HotSpot(TM) 64-Bit Server VM warning: ignoring option MaxPermSize=768m; support was removed
in 8.0
Running org.apache.hadoop.yarn.client.api.impl.TestAMRMClient
Tests run: 9, Failures: 0, Errors: 0, Skipped: 0, Time elapsed: 49.98 sec - in org.apache.hadoop.yarn.client.api.impl.TestAMRMClient
Java HotSpot(TM) 64-Bit Server VM warning: ignoring option MaxPermSize=768m; support was removed
in 8.0
Running org.apache.hadoop.yarn.client.api.impl.TestNMClient
Tests run: 2, Failures: 0, Errors: 0, Skipped: 0, Time elapsed: 72.281 sec - in org.apache.hadoop.yarn.client.api.impl.TestNMClient
Java HotSpot(TM) 64-Bit Server VM warning: ignoring option MaxPermSize=768m; support was removed
in 8.0
Running org.apache.hadoop.yarn.client.api.async.impl.TestNMClientAsync
Tests run: 2, Failures: 0, Errors: 0, Skipped: 0, Time elapsed: 0.895 sec - in org.apache.hadoop.yarn.client.api.async.impl.TestNMClientAsync
Java HotSpot(TM) 64-Bit Server VM warning: ignoring option MaxPermSize=768m; support was removed
in 8.0
Running org.apache.hadoop.yarn.client.api.async.impl.TestAMRMClientAsync
Tests run: 9, Failures: 0, Errors: 0, Skipped: 0, Time elapsed: 2.915 sec - in org.apache.hadoop.yarn.client.api.async.impl.TestAMRMClientAsync
Java HotSpot(TM) 64-Bit Server VM warning: ignoring option MaxPermSize=768m; support was removed
in 8.0
Running org.apache.hadoop.yarn.client.TestApplicationMasterServiceProtocolOnHA
Tests run: 3, Failures: 0, Errors: 0, Skipped: 0, Time elapsed: 31.272 sec - in org.apache.hadoop.yarn.client.TestApplicationMasterServiceProtocolOnHA
Java HotSpot(TM) 64-Bit Server VM warning: ignoring option MaxPermSize=768m; support was removed
in 8.0
Running org.apache.hadoop.yarn.client.TestApplicationClientProtocolOnHA
Tests run: 17, Failures: 0, Errors: 4, Skipped: 0, Time elapsed: 155.478 sec <<<
FAILURE! - in org.apache.hadoop.yarn.client.TestApplicationClientProtocolOnHA
testGetContainersOnHA(org.apache.hadoop.yarn.client.TestApplicationClientProtocolOnHA)  Time
elapsed: 11.937 sec  <<< ERROR!
java.net.ConnectException: Call From asf908.gq1.ygridcore.net/67.195.81.152 to asf908.gq1.ygridcore.net:28032
failed on connection exception: java.net.ConnectException: Connection refused; For more details
see:  http://wiki.apache.org/hadoop/ConnectionRefused
	at sun.nio.ch.SocketChannelImpl.checkConnect(Native Method)
	at sun.nio.ch.SocketChannelImpl.finishConnect(SocketChannelImpl.java:712)
	at org.apache.hadoop.net.SocketIOWithTimeout.connect(SocketIOWithTimeout.java:206)
	at org.apache.hadoop.net.NetUtils.connect(NetUtils.java:530)
	at org.apache.hadoop.net.NetUtils.connect(NetUtils.java:494)
	at org.apache.hadoop.ipc.Client$Connection.setupConnection(Client.java:607)
	at org.apache.hadoop.ipc.Client$Connection.setupIOstreams(Client.java:705)
	at org.apache.hadoop.ipc.Client$Connection.access$2800(Client.java:368)
	at org.apache.hadoop.ipc.Client.getConnection(Client.java:1521)
	at org.apache.hadoop.ipc.Client.call(Client.java:1438)
	at org.apache.hadoop.ipc.Client.call(Client.java:1399)
	at org.apache.hadoop.ipc.ProtobufRpcEngine$Invoker.invoke(ProtobufRpcEngine.java:230)
	at com.sun.proxy.$Proxy16.getContainers(Unknown Source)
	at org.apache.hadoop.yarn.api.impl.pb.client.ApplicationClientProtocolPBClientImpl.getContainers(ApplicationClientProtocolPBClientImpl.java:410)
	at sun.reflect.NativeMethodAccessorImpl.invoke0(Native Method)
	at sun.reflect.NativeMethodAccessorImpl.invoke(NativeMethodAccessorImpl.java:62)
	at sun.reflect.DelegatingMethodAccessorImpl.invoke(DelegatingMethodAccessorImpl.java:43)
	at java.lang.reflect.Method.invoke(Method.java:483)
	at org.apache.hadoop.io.retry.RetryInvocationHandler.invokeMethod(RetryInvocationHandler.java:186)
	at org.apache.hadoop.io.retry.RetryInvocationHandler.invoke(RetryInvocationHandler.java:101)
	at com.sun.proxy.$Proxy17.getContainers(Unknown Source)
	at org.apache.hadoop.yarn.client.api.impl.YarnClientImpl.getContainers(YarnClientImpl.java:654)
	at org.apache.hadoop.yarn.client.TestApplicationClientProtocolOnHA.testGetContainersOnHA(TestApplicationClientProtocolOnHA.java:155)

testGetApplicationAttemptReportOnHA(org.apache.hadoop.yarn.client.TestApplicationClientProtocolOnHA)
 Time elapsed: 10.675 sec  <<< ERROR!
java.net.ConnectException: Call From asf908.gq1.ygridcore.net/67.195.81.152 to asf908.gq1.ygridcore.net:28032
failed on connection exception: java.net.ConnectException: Connection refused; For more details
see:  http://wiki.apache.org/hadoop/ConnectionRefused
	at sun.nio.ch.SocketChannelImpl.checkConnect(Native Method)
	at sun.nio.ch.SocketChannelImpl.finishConnect(SocketChannelImpl.java:712)
	at org.apache.hadoop.net.SocketIOWithTimeout.connect(SocketIOWithTimeout.java:206)
	at org.apache.hadoop.net.NetUtils.connect(NetUtils.java:530)
	at org.apache.hadoop.net.NetUtils.connect(NetUtils.java:494)
	at org.apache.hadoop.ipc.Client$Connection.setupConnection(Client.java:607)
	at org.apache.hadoop.ipc.Client$Connection.setupIOstreams(Client.java:705)
	at org.apache.hadoop.ipc.Client$Connection.access$2800(Client.java:368)
	at org.apache.hadoop.ipc.Client.getConnection(Client.java:1521)
	at org.apache.hadoop.ipc.Client.call(Client.java:1438)
	at org.apache.hadoop.ipc.Client.call(Client.java:1399)
	at org.apache.hadoop.ipc.ProtobufRpcEngine$Invoker.invoke(ProtobufRpcEngine.java:230)
	at com.sun.proxy.$Proxy16.getApplicationAttemptReport(Unknown Source)
	at org.apache.hadoop.yarn.api.impl.pb.client.ApplicationClientProtocolPBClientImpl.getApplicationAttemptReport(ApplicationClientProtocolPBClientImpl.java:369)
	at sun.reflect.NativeMethodAccessorImpl.invoke0(Native Method)
	at sun.reflect.NativeMethodAccessorImpl.invoke(NativeMethodAccessorImpl.java:62)
	at sun.reflect.DelegatingMethodAccessorImpl.invoke(DelegatingMethodAccessorImpl.java:43)
	at java.lang.reflect.Method.invoke(Method.java:483)
	at org.apache.hadoop.io.retry.RetryInvocationHandler.invokeMethod(RetryInvocationHandler.java:186)
	at org.apache.hadoop.io.retry.RetryInvocationHandler.invoke(RetryInvocationHandler.java:101)
	at com.sun.proxy.$Proxy17.getApplicationAttemptReport(Unknown Source)
	at org.apache.hadoop.yarn.client.api.impl.YarnClientImpl.getApplicationAttemptReport(YarnClientImpl.java:582)
	at org.apache.hadoop.yarn.client.TestApplicationClientProtocolOnHA.testGetApplicationAttemptReportOnHA(TestApplicationClientProtocolOnHA.java:129)

testSubmitApplicationOnHA(org.apache.hadoop.yarn.client.TestApplicationClientProtocolOnHA)
 Time elapsed: 9.422 sec  <<< ERROR!
java.net.ConnectException: Call From asf908.gq1.ygridcore.net/67.195.81.152 to asf908.gq1.ygridcore.net:28032
failed on connection exception: java.net.ConnectException: Connection refused; For more details
see:  http://wiki.apache.org/hadoop/ConnectionRefused
	at sun.nio.ch.SocketChannelImpl.checkConnect(Native Method)
	at sun.nio.ch.SocketChannelImpl.finishConnect(SocketChannelImpl.java:712)
	at org.apache.hadoop.net.SocketIOWithTimeout.connect(SocketIOWithTimeout.java:206)
	at org.apache.hadoop.net.NetUtils.connect(NetUtils.java:530)
	at org.apache.hadoop.net.NetUtils.connect(NetUtils.java:494)
	at org.apache.hadoop.ipc.Client$Connection.setupConnection(Client.java:607)
	at org.apache.hadoop.ipc.Client$Connection.setupIOstreams(Client.java:705)
	at org.apache.hadoop.ipc.Client$Connection.access$2800(Client.java:368)
	at org.apache.hadoop.ipc.Client.getConnection(Client.java:1521)
	at org.apache.hadoop.ipc.Client.call(Client.java:1438)
	at org.apache.hadoop.ipc.Client.call(Client.java:1399)
	at org.apache.hadoop.ipc.ProtobufRpcEngine$Invoker.invoke(ProtobufRpcEngine.java:230)
	at com.sun.proxy.$Proxy16.submitApplication(Unknown Source)
	at org.apache.hadoop.yarn.api.impl.pb.client.ApplicationClientProtocolPBClientImpl.submitApplication(ApplicationClientProtocolPBClientImpl.java:232)
	at sun.reflect.NativeMethodAccessorImpl.invoke0(Native Method)
	at sun.reflect.NativeMethodAccessorImpl.invoke(NativeMethodAccessorImpl.java:62)
	at sun.reflect.DelegatingMethodAccessorImpl.invoke(DelegatingMethodAccessorImpl.java:43)
	at java.lang.reflect.Method.invoke(Method.java:483)
	at org.apache.hadoop.io.retry.RetryInvocationHandler.invokeMethod(RetryInvocationHandler.java:186)
	at org.apache.hadoop.io.retry.RetryInvocationHandler.invoke(RetryInvocationHandler.java:101)
	at com.sun.proxy.$Proxy17.submitApplication(Unknown Source)
	at org.apache.hadoop.yarn.client.api.impl.YarnClientImpl.submitApplication(YarnClientImpl.java:240)
	at org.apache.hadoop.yarn.client.TestApplicationClientProtocolOnHA.testSubmitApplicationOnHA(TestApplicationClientProtocolOnHA.java:173)

testRenewDelegationTokenOnHA(org.apache.hadoop.yarn.client.TestApplicationClientProtocolOnHA)
 Time elapsed: 9.978 sec  <<< ERROR!
java.net.ConnectException: Call From asf908.gq1.ygridcore.net/67.195.81.152 to asf908.gq1.ygridcore.net:28032
failed on connection exception: java.net.ConnectException: Connection refused; For more details
see:  http://wiki.apache.org/hadoop/ConnectionRefused
	at sun.nio.ch.SocketChannelImpl.checkConnect(Native Method)
	at sun.nio.ch.SocketChannelImpl.finishConnect(SocketChannelImpl.java:712)
	at org.apache.hadoop.net.SocketIOWithTimeout.connect(SocketIOWithTimeout.java:206)
	at org.apache.hadoop.net.NetUtils.connect(NetUtils.java:530)
	at org.apache.hadoop.net.NetUtils.connect(NetUtils.java:494)
	at org.apache.hadoop.ipc.Client$Connection.setupConnection(Client.java:607)
	at org.apache.hadoop.ipc.Client$Connection.setupIOstreams(Client.java:705)
	at org.apache.hadoop.ipc.Client$Connection.access$2800(Client.java:368)
	at org.apache.hadoop.ipc.Client.getConnection(Client.java:1521)
	at org.apache.hadoop.ipc.Client.call(Client.java:1438)
	at org.apache.hadoop.ipc.Client.call(Client.java:1399)
	at org.apache.hadoop.ipc.ProtobufRpcEngine$Invoker.invoke(ProtobufRpcEngine.java:230)
	at com.sun.proxy.$Proxy16.renewDelegationToken(Unknown Source)
	at org.apache.hadoop.yarn.api.impl.pb.client.ApplicationClientProtocolPBClientImpl.renewDelegationToken(ApplicationClientProtocolPBClientImpl.java:321)
	at sun.reflect.NativeMethodAccessorImpl.invoke0(Native Method)
	at sun.reflect.NativeMethodAccessorImpl.invoke(NativeMethodAccessorImpl.java:62)
	at sun.reflect.DelegatingMethodAccessorImpl.invoke(DelegatingMethodAccessorImpl.java:43)
	at java.lang.reflect.Method.invoke(Method.java:483)
	at org.apache.hadoop.io.retry.RetryInvocationHandler.invokeMethod(RetryInvocationHandler.java:186)
	at org.apache.hadoop.io.retry.RetryInvocationHandler.invoke(RetryInvocationHandler.java:101)
	at com.sun.proxy.$Proxy17.renewDelegationToken(Unknown Source)
	at org.apache.hadoop.yarn.client.TestApplicationClientProtocolOnHA.testRenewDelegationTokenOnHA(TestApplicationClientProtocolOnHA.java:200)

Java HotSpot(TM) 64-Bit Server VM warning: ignoring option MaxPermSize=768m; support was removed
in 8.0
Running org.apache.hadoop.yarn.client.TestResourceTrackerOnHA
Tests run: 1, Failures: 0, Errors: 0, Skipped: 0, Time elapsed: 14.438 sec - in org.apache.hadoop.yarn.client.TestResourceTrackerOnHA

Results :

Tests in error: 
  TestApplicationClientProtocolOnHA.testGetContainersOnHA:155 » Connect Call Fro...
  TestApplicationClientProtocolOnHA.testGetApplicationAttemptReportOnHA:129 » Connect
  TestApplicationClientProtocolOnHA.testSubmitApplicationOnHA:173 » Connect Call...
  TestApplicationClientProtocolOnHA.testRenewDelegationTokenOnHA:200 » Connect C...

Tests run: 142, Failures: 0, Errors: 4, Skipped: 0

[INFO] ------------------------------------------------------------------------
[INFO] Reactor Summary:
[INFO] 
[INFO] hadoop-yarn ....................................... SUCCESS [  2.912 s]
[INFO] hadoop-yarn-api ................................... SUCCESS [01:02 min]
[INFO] hadoop-yarn-common ................................ SUCCESS [02:02 min]
[INFO] hadoop-yarn-server ................................ SUCCESS [  0.049 s]
[INFO] hadoop-yarn-server-common ......................... SUCCESS [ 33.093 s]
[INFO] hadoop-yarn-server-nodemanager .................... SUCCESS [06:03 min]
[INFO] hadoop-yarn-server-web-proxy ...................... SUCCESS [ 13.800 s]
[INFO] hadoop-yarn-server-applicationhistoryservice ...... SUCCESS [02:49 min]
[INFO] hadoop-yarn-server-resourcemanager ................ SUCCESS [48:03 min]
[INFO] hadoop-yarn-server-tests .......................... SUCCESS [02:16 min]
[INFO] hadoop-yarn-client ................................ FAILURE [07:54 min]
[INFO] hadoop-yarn-server-sharedcachemanager ............. SKIPPED
[INFO] hadoop-yarn-applications .......................... SKIPPED
[INFO] hadoop-yarn-applications-distributedshell ......... SKIPPED
[INFO] hadoop-yarn-applications-unmanaged-am-launcher .... SKIPPED
[INFO] hadoop-yarn-site .................................. SKIPPED
[INFO] hadoop-yarn-registry .............................. SKIPPED
[INFO] hadoop-yarn-project ............................... SKIPPED
[INFO] ------------------------------------------------------------------------
[INFO] BUILD FAILURE
[INFO] ------------------------------------------------------------------------
[INFO] Total time: 01:11 h
[INFO] Finished at: 2014-12-14T11:43:04+00:00
[INFO] Final Memory: 72M/755M
[INFO] ------------------------------------------------------------------------
[ERROR] Failed to execute goal org.apache.maven.plugins:maven-surefire-plugin:2.17:test (default-test)
on project hadoop-yarn-client: There are test failures.
[ERROR] 
[ERROR] Please refer to <https://builds.apache.org/job/Hadoop-Yarn-trunk-Java8/ws/hadoop-yarn-project/hadoop-yarn/hadoop-yarn-client/target/surefire-reports>
for the individual test results.
[ERROR] -> [Help 1]
[ERROR] 
[ERROR] To see the full stack trace of the errors, re-run Maven with the -e switch.
[ERROR] Re-run Maven using the -X switch to enable full debug logging.
[ERROR] 
[ERROR] For more information about the errors and possible solutions, please read the following
articles:
[ERROR] [Help 1] http://cwiki.apache.org/confluence/display/MAVEN/MojoFailureException
[ERROR] 
[ERROR] After correcting the problems, you can resume the build with the command
[ERROR]   mvn <goals> -rf :hadoop-yarn-client
Build step 'Execute shell' marked build as failure
Archiving artifacts
Recording test results
Updating MAPREDUCE-4879

Mime
View raw message