hadoop-yarn-dev mailing list archives

Site index · List index
Message view « Date » · « Thread »
Top « Date » · « Thread »
From Apache Jenkins Server <jenk...@builds.apache.org>
Subject Hadoop-Yarn-trunk-Java8 - Build # 23 - Still Failing
Date Tue, 02 Dec 2014 11:33:40 GMT
See https://builds.apache.org/job/Hadoop-Yarn-trunk-Java8/23/

###################################################################################
########################## LAST 60 LINES OF THE CONSOLE ###########################
[...truncated 8239 lines...]
[INFO] Reactor Summary:
[INFO] 
[INFO] hadoop-yarn ....................................... SUCCESS [  2.878 s]
[INFO] hadoop-yarn-api ................................... SUCCESS [02:59 min]
[INFO] hadoop-yarn-common ................................ SUCCESS [02:25 min]
[INFO] hadoop-yarn-server ................................ SUCCESS [  0.079 s]
[INFO] hadoop-yarn-server-common ......................... SUCCESS [ 37.467 s]
[INFO] hadoop-yarn-server-nodemanager .................... SUCCESS [05:59 min]
[INFO] hadoop-yarn-server-web-proxy ...................... SUCCESS [ 22.408 s]
[INFO] hadoop-yarn-server-applicationhistoryservice ...... SUCCESS [02:50 min]
[INFO] hadoop-yarn-server-resourcemanager ................ FAILURE [45:55 min]
[INFO] hadoop-yarn-server-tests .......................... SKIPPED
[INFO] hadoop-yarn-client ................................ SKIPPED
[INFO] hadoop-yarn-server-sharedcachemanager ............. SKIPPED
[INFO] hadoop-yarn-applications .......................... SKIPPED
[INFO] hadoop-yarn-applications-distributedshell ......... SKIPPED
[INFO] hadoop-yarn-applications-unmanaged-am-launcher .... SKIPPED
[INFO] hadoop-yarn-site .................................. SKIPPED
[INFO] hadoop-yarn-registry .............................. SKIPPED
[INFO] hadoop-yarn-project ............................... SKIPPED
[INFO] ------------------------------------------------------------------------
[INFO] BUILD FAILURE
[INFO] ------------------------------------------------------------------------
[INFO] Total time: 01:01 h
[INFO] Finished at: 2014-12-02T11:33:15+00:00
[INFO] Final Memory: 75M/682M
[INFO] ------------------------------------------------------------------------
[ERROR] Failed to execute goal org.apache.maven.plugins:maven-surefire-plugin:2.16:test (default-test)
on project hadoop-yarn-server-resourcemanager: There are test failures.
[ERROR] 
[ERROR] Please refer to /home/jenkins/jenkins-slave/workspace/Hadoop-Yarn-trunk-Java8/hadoop-yarn-project/hadoop-yarn/hadoop-yarn-server/hadoop-yarn-server-resourcemanager/target/surefire-reports
for the individual test results.
[ERROR] -> [Help 1]
[ERROR] 
[ERROR] To see the full stack trace of the errors, re-run Maven with the -e switch.
[ERROR] Re-run Maven using the -X switch to enable full debug logging.
[ERROR] 
[ERROR] For more information about the errors and possible solutions, please read the following
articles:
[ERROR] [Help 1] http://cwiki.apache.org/confluence/display/MAVEN/MojoFailureException
[ERROR] 
[ERROR] After correcting the problems, you can resume the build with the command
[ERROR]   mvn <goals> -rf :hadoop-yarn-server-resourcemanager
Build step 'Execute shell' marked build as failure
Archiving artifacts
Updating HBASE-11301
Updating HDFS-7438
Updating HADOOP-11081
Updating YARN-2905
Updating MAPREDUCE-6160
Updating YARN-2907
Updating MAPREDUCE-6172
Updating HDFS-7450
Updating HADOOP-11337
Updating YARN-2890
Updating HADOOP-11301
Updating HADOOP-11333
Updating YARN-2765
Updating HADOOP-11341
Sending e-mails to: yarn-dev@hadoop.apache.org
Email was triggered for: Failure
Sending email for trigger: Failure



###################################################################################
############################## FAILED TESTS (if any) ##############################
No tests ran.
Mime
  • Unnamed multipart/mixed (inline, None, 0 bytes)
View raw message