hadoop-yarn-dev mailing list archives

Site index · List index
Message view « Date » · « Thread »
Top « Date » · « Thread »
From Apache Jenkins Server <jenk...@builds.apache.org>
Subject Build failed in Jenkins: Hadoop-Yarn-trunk #785
Date Wed, 24 Dec 2014 11:43:56 GMT
See <https://builds.apache.org/job/Hadoop-Yarn-trunk/785/changes>

Changes:

[rkanter] HADOOP-11399. Java Configuration file and .xml files should be automatically cross-compared
(rchiang via rkanter)

[junping_du] YARN-2970. NodeLabel operations in RMAdmin CLI get missing in help command. (Contributed
by Varun Saxena)

[jianhe] YARN-2837. Support TimeLine server to recover delegation token when restarting. Contributed
by Zhijie Shen

[junping_du] Fix new findbugs warnings in rest of the hadoop-yarn components. (Contributed
by Li Lu)

[junping_du] CHANGES.txt: add YARN-2940

[junping_du] Revert ca3381de61ff53604d9389694049a1a4dedc7571 and 20674255ad891bb693ecb2faa5bdb37477073dac
as missing JIRA number in commit message

[junping_du] YARN-2940. Fix new findbugs warnings in rest of the hadoop-yarn components. (Contributed
by Li Lu)

[zjshen] YARN-2937. Fixed new findbugs warnings in hadoop-yarn-nodemanager. Contributed by
Varun Saxena.

[jianhe] YARN-2946. Fixed potential deadlock in RMStateStore. Contributed by Rohith Sharmaks

------------------------------------------
[...truncated 9236 lines...]
[INFO] Using default encoding to copy filtered resources.
[INFO] 
[INFO] --- maven-compiler-plugin:2.5.1:testCompile (default-testCompile) @ hadoop-yarn-server-tests
---
[INFO] Compiling 7 source files to <https://builds.apache.org/job/Hadoop-Yarn-trunk/ws/hadoop-yarn-project/hadoop-yarn/hadoop-yarn-server/hadoop-yarn-server-tests/target/test-classes>
[INFO] 
[INFO] --- maven-jar-plugin:2.3.1:test-jar (default) @ hadoop-yarn-server-tests ---
[INFO] Building jar: <https://builds.apache.org/job/Hadoop-Yarn-trunk/ws/hadoop-yarn-project/hadoop-yarn/hadoop-yarn-server/hadoop-yarn-server-tests/target/hadoop-yarn-server-tests-3.0.0-SNAPSHOT-tests.jar>
[INFO] 
[INFO] --- maven-surefire-plugin:2.17:test (default-test) @ hadoop-yarn-server-tests ---
[INFO] Surefire report directory: <https://builds.apache.org/job/Hadoop-Yarn-trunk/ws/hadoop-yarn-project/hadoop-yarn/hadoop-yarn-server/hadoop-yarn-server-tests/target/surefire-reports>

-------------------------------------------------------
 T E S T S
-------------------------------------------------------

-------------------------------------------------------
 T E S T S
-------------------------------------------------------
Running org.apache.hadoop.yarn.server.TestDiskFailures
Tests run: 3, Failures: 0, Errors: 0, Skipped: 0, Time elapsed: 18.68 sec - in org.apache.hadoop.yarn.server.TestDiskFailures
Running org.apache.hadoop.yarn.server.TestContainerManagerSecurity
Tests run: 4, Failures: 0, Errors: 0, Skipped: 0, Time elapsed: 88.27 sec - in org.apache.hadoop.yarn.server.TestContainerManagerSecurity
Running org.apache.hadoop.yarn.server.TestRMNMSecretKeys
Tests run: 1, Failures: 0, Errors: 0, Skipped: 0, Time elapsed: 2.387 sec - in org.apache.hadoop.yarn.server.TestRMNMSecretKeys
Running org.apache.hadoop.yarn.server.TestMiniYARNClusterForHA
Tests run: 1, Failures: 0, Errors: 0, Skipped: 0, Time elapsed: 6.136 sec - in org.apache.hadoop.yarn.server.TestMiniYARNClusterForHA

Results :

Tests run: 9, Failures: 0, Errors: 0, Skipped: 0

[INFO] 
[INFO] --- maven-jar-plugin:2.3.1:jar (default-jar) @ hadoop-yarn-server-tests ---
[INFO] Building jar: <https://builds.apache.org/job/Hadoop-Yarn-trunk/ws/hadoop-yarn-project/hadoop-yarn/hadoop-yarn-server/hadoop-yarn-server-tests/target/hadoop-yarn-server-tests-3.0.0-SNAPSHOT.jar>
[INFO] 
[INFO] --- maven-source-plugin:2.1.2:jar-no-fork (hadoop-java-sources) @ hadoop-yarn-server-tests
---
[INFO] Building jar: <https://builds.apache.org/job/Hadoop-Yarn-trunk/ws/hadoop-yarn-project/hadoop-yarn/hadoop-yarn-server/hadoop-yarn-server-tests/target/hadoop-yarn-server-tests-3.0.0-SNAPSHOT-sources.jar>
[INFO] 
[INFO] --- maven-source-plugin:2.1.2:test-jar-no-fork (hadoop-java-sources) @ hadoop-yarn-server-tests
---
[INFO] Building jar: <https://builds.apache.org/job/Hadoop-Yarn-trunk/ws/hadoop-yarn-project/hadoop-yarn/hadoop-yarn-server/hadoop-yarn-server-tests/target/hadoop-yarn-server-tests-3.0.0-SNAPSHOT-test-sources.jar>
[INFO] 
[INFO] --- maven-enforcer-plugin:1.3.1:enforce (dist-enforce) @ hadoop-yarn-server-tests ---
[INFO] 
[INFO] --- maven-site-plugin:3.4:attach-descriptor (attach-descriptor) @ hadoop-yarn-server-tests
---
[INFO] 
[INFO] --- maven-javadoc-plugin:2.8.1:jar (module-javadocs) @ hadoop-yarn-server-tests ---
[INFO] 
Loading source files for package org.apache.hadoop.yarn.proto...
Constructing Javadoc information...
Standard Doclet version 1.7.0_55
Building tree for all the packages and classes...
Generating <https://builds.apache.org/job/Hadoop-Yarn-trunk/ws/hadoop-yarn-project/hadoop-yarn/hadoop-yarn-server/hadoop-yarn-server-tests/target/org/apache/hadoop/yarn/proto/YarnSecurityTestTokenProtos.html...>
Generating <https://builds.apache.org/job/Hadoop-Yarn-trunk/ws/hadoop-yarn-project/hadoop-yarn/hadoop-yarn-server/hadoop-yarn-server-tests/target/org/apache/hadoop/yarn/proto/YarnSecurityTestTokenProtos.ContainerTokenIdentifierForTestProto.html...>
Generating <https://builds.apache.org/job/Hadoop-Yarn-trunk/ws/hadoop-yarn-project/hadoop-yarn/hadoop-yarn-server/hadoop-yarn-server-tests/target/org/apache/hadoop/yarn/proto/YarnSecurityTestTokenProtos.ContainerTokenIdentifierForTestProto.Builder.html...>
Generating <https://builds.apache.org/job/Hadoop-Yarn-trunk/ws/hadoop-yarn-project/hadoop-yarn/hadoop-yarn-server/hadoop-yarn-server-tests/target/org/apache/hadoop/yarn/proto/YarnSecurityTestTokenProtos.ContainerTokenIdentifierForTestProtoOrBuilder.html...>
Generating <https://builds.apache.org/job/Hadoop-Yarn-trunk/ws/hadoop-yarn-project/hadoop-yarn/hadoop-yarn-server/hadoop-yarn-server-tests/target/org/apache/hadoop/yarn/proto/YarnSecurityTestTokenProtos.NMTokenIdentifierNewProto.html...>
Generating <https://builds.apache.org/job/Hadoop-Yarn-trunk/ws/hadoop-yarn-project/hadoop-yarn/hadoop-yarn-server/hadoop-yarn-server-tests/target/org/apache/hadoop/yarn/proto/YarnSecurityTestTokenProtos.NMTokenIdentifierNewProto.Builder.html...>
Generating <https://builds.apache.org/job/Hadoop-Yarn-trunk/ws/hadoop-yarn-project/hadoop-yarn/hadoop-yarn-server/hadoop-yarn-server-tests/target/org/apache/hadoop/yarn/proto/YarnSecurityTestTokenProtos.NMTokenIdentifierNewProtoOrBuilder.html...>
Generating <https://builds.apache.org/job/Hadoop-Yarn-trunk/ws/hadoop-yarn-project/hadoop-yarn/hadoop-yarn-server/hadoop-yarn-server-tests/target/org/apache/hadoop/yarn/proto/package-frame.html...>
Generating <https://builds.apache.org/job/Hadoop-Yarn-trunk/ws/hadoop-yarn-project/hadoop-yarn/hadoop-yarn-server/hadoop-yarn-server-tests/target/org/apache/hadoop/yarn/proto/package-summary.html...>
Generating <https://builds.apache.org/job/Hadoop-Yarn-trunk/ws/hadoop-yarn-project/hadoop-yarn/hadoop-yarn-server/hadoop-yarn-server-tests/target/org/apache/hadoop/yarn/proto/package-tree.html...>
Generating <https://builds.apache.org/job/Hadoop-Yarn-trunk/ws/hadoop-yarn-project/hadoop-yarn/hadoop-yarn-server/hadoop-yarn-server-tests/target/constant-values.html...>
Generating <https://builds.apache.org/job/Hadoop-Yarn-trunk/ws/hadoop-yarn-project/hadoop-yarn/hadoop-yarn-server/hadoop-yarn-server-tests/target/serialized-form.html...>
Generating <https://builds.apache.org/job/Hadoop-Yarn-trunk/ws/hadoop-yarn-project/hadoop-yarn/hadoop-yarn-server/hadoop-yarn-server-tests/target/org/apache/hadoop/yarn/proto/class-use/YarnSecurityTestTokenProtos.html...>
Generating <https://builds.apache.org/job/Hadoop-Yarn-trunk/ws/hadoop-yarn-project/hadoop-yarn/hadoop-yarn-server/hadoop-yarn-server-tests/target/org/apache/hadoop/yarn/proto/class-use/YarnSecurityTestTokenProtos.NMTokenIdentifierNewProtoOrBuilder.html...>
Generating <https://builds.apache.org/job/Hadoop-Yarn-trunk/ws/hadoop-yarn-project/hadoop-yarn/hadoop-yarn-server/hadoop-yarn-server-tests/target/org/apache/hadoop/yarn/proto/class-use/YarnSecurityTestTokenProtos.NMTokenIdentifierNewProto.html...>
Generating <https://builds.apache.org/job/Hadoop-Yarn-trunk/ws/hadoop-yarn-project/hadoop-yarn/hadoop-yarn-server/hadoop-yarn-server-tests/target/org/apache/hadoop/yarn/proto/class-use/YarnSecurityTestTokenProtos.NMTokenIdentifierNewProto.Builder.html...>
Generating <https://builds.apache.org/job/Hadoop-Yarn-trunk/ws/hadoop-yarn-project/hadoop-yarn/hadoop-yarn-server/hadoop-yarn-server-tests/target/org/apache/hadoop/yarn/proto/class-use/YarnSecurityTestTokenProtos.ContainerTokenIdentifierForTestProtoOrBuilder.html...>
Generating <https://builds.apache.org/job/Hadoop-Yarn-trunk/ws/hadoop-yarn-project/hadoop-yarn/hadoop-yarn-server/hadoop-yarn-server-tests/target/org/apache/hadoop/yarn/proto/class-use/YarnSecurityTestTokenProtos.ContainerTokenIdentifierForTestProto.html...>
Generating <https://builds.apache.org/job/Hadoop-Yarn-trunk/ws/hadoop-yarn-project/hadoop-yarn/hadoop-yarn-server/hadoop-yarn-server-tests/target/org/apache/hadoop/yarn/proto/class-use/YarnSecurityTestTokenProtos.ContainerTokenIdentifierForTestProto.Builder.html...>
Generating <https://builds.apache.org/job/Hadoop-Yarn-trunk/ws/hadoop-yarn-project/hadoop-yarn/hadoop-yarn-server/hadoop-yarn-server-tests/target/org/apache/hadoop/yarn/proto/package-use.html...>
Building index for all the packages and classes...
Generating <https://builds.apache.org/job/Hadoop-Yarn-trunk/ws/hadoop-yarn-project/hadoop-yarn/hadoop-yarn-server/hadoop-yarn-server-tests/target/overview-tree.html...>
Generating <https://builds.apache.org/job/Hadoop-Yarn-trunk/ws/hadoop-yarn-project/hadoop-yarn/hadoop-yarn-server/hadoop-yarn-server-tests/target/index-all.html...>
Generating <https://builds.apache.org/job/Hadoop-Yarn-trunk/ws/hadoop-yarn-project/hadoop-yarn/hadoop-yarn-server/hadoop-yarn-server-tests/target/deprecated-list.html...>
Building index for all classes...
Generating <https://builds.apache.org/job/Hadoop-Yarn-trunk/ws/hadoop-yarn-project/hadoop-yarn/hadoop-yarn-server/hadoop-yarn-server-tests/target/allclasses-frame.html...>
Generating <https://builds.apache.org/job/Hadoop-Yarn-trunk/ws/hadoop-yarn-project/hadoop-yarn/hadoop-yarn-server/hadoop-yarn-server-tests/target/allclasses-noframe.html...>
Generating <https://builds.apache.org/job/Hadoop-Yarn-trunk/ws/hadoop-yarn-project/hadoop-yarn/hadoop-yarn-server/hadoop-yarn-server-tests/target/index.html...>
Generating <https://builds.apache.org/job/Hadoop-Yarn-trunk/ws/hadoop-yarn-project/hadoop-yarn/hadoop-yarn-server/hadoop-yarn-server-tests/target/help-doc.html...>
[INFO] Building jar: <https://builds.apache.org/job/Hadoop-Yarn-trunk/ws/hadoop-yarn-project/hadoop-yarn/hadoop-yarn-server/hadoop-yarn-server-tests/target/hadoop-yarn-server-tests-3.0.0-SNAPSHOT-javadoc.jar>
[INFO] 
[INFO] --- maven-enforcer-plugin:1.3.1:enforce (depcheck) @ hadoop-yarn-server-tests ---
[INFO] 
[INFO] --- maven-checkstyle-plugin:2.6:checkstyle (default-cli) @ hadoop-yarn-server-tests
---
[INFO] 
[INFO] --- findbugs-maven-plugin:3.0.0:findbugs (default-cli) @ hadoop-yarn-server-tests ---
[INFO] Fork Value is true
[INFO] Done FindBugs Analysis....
[INFO]                                                                         
[INFO] ------------------------------------------------------------------------
[INFO] Building hadoop-yarn-client 3.0.0-SNAPSHOT
[INFO] ------------------------------------------------------------------------
[WARNING] The POM for org.eclipse.m2e:lifecycle-mapping:jar:1.0.0 is missing, no dependency
information available
[WARNING] Failed to retrieve plugin descriptor for org.eclipse.m2e:lifecycle-mapping:1.0.0:
Plugin org.eclipse.m2e:lifecycle-mapping:1.0.0 or one of its dependencies could not be resolved:
Failure to find org.eclipse.m2e:lifecycle-mapping:jar:1.0.0 in http://repo.maven.apache.org/maven2
was cached in the local repository, resolution will not be reattempted until the update interval
of central has elapsed or updates are forced
[INFO] 
[INFO] --- maven-clean-plugin:2.4.1:clean (default-clean) @ hadoop-yarn-client ---
[INFO] Deleting <https://builds.apache.org/job/Hadoop-Yarn-trunk/ws/hadoop-yarn-project/hadoop-yarn/hadoop-yarn-client/target>
[INFO] 
[INFO] --- maven-antrun-plugin:1.7:run (create-testdirs) @ hadoop-yarn-client ---
[INFO] Executing tasks

main:
    [mkdir] Created dir: <https://builds.apache.org/job/Hadoop-Yarn-trunk/ws/hadoop-yarn-project/hadoop-yarn/hadoop-yarn-client/target/test-dir>
[INFO] Executed tasks
[INFO] 
[INFO] --- hadoop-maven-plugins:3.0.0-SNAPSHOT:protoc (compile-protoc) @ hadoop-yarn-client
---
[INFO] 
[INFO] --- maven-resources-plugin:2.2:resources (default-resources) @ hadoop-yarn-client ---
[INFO] Using default encoding to copy filtered resources.
[INFO] 
[INFO] --- maven-compiler-plugin:2.5.1:compile (default-compile) @ hadoop-yarn-client ---
[INFO] Compiling 29 source files to <https://builds.apache.org/job/Hadoop-Yarn-trunk/ws/hadoop-yarn-project/hadoop-yarn/hadoop-yarn-client/target/classes>
[INFO] 
[INFO] --- maven-resources-plugin:2.2:testResources (default-testResources) @ hadoop-yarn-client
---
[INFO] Using default encoding to copy filtered resources.
[INFO] 
[INFO] --- maven-compiler-plugin:2.5.1:testCompile (default-testCompile) @ hadoop-yarn-client
---
[INFO] Compiling 21 source files to <https://builds.apache.org/job/Hadoop-Yarn-trunk/ws/hadoop-yarn-project/hadoop-yarn/hadoop-yarn-client/target/test-classes>
[INFO] 
[INFO] --- maven-surefire-plugin:2.17:test (default-test) @ hadoop-yarn-client ---
[INFO] Surefire report directory: <https://builds.apache.org/job/Hadoop-Yarn-trunk/ws/hadoop-yarn-project/hadoop-yarn/hadoop-yarn-client/target/surefire-reports>

-------------------------------------------------------
 T E S T S
-------------------------------------------------------

-------------------------------------------------------
 T E S T S
-------------------------------------------------------
Running org.apache.hadoop.yarn.client.TestApplicationClientProtocolOnHA
Tests run: 17, Failures: 0, Errors: 0, Skipped: 0, Time elapsed: 131.381 sec - in org.apache.hadoop.yarn.client.TestApplicationClientProtocolOnHA
Running org.apache.hadoop.yarn.client.TestResourceTrackerOnHA
Tests run: 1, Failures: 0, Errors: 1, Skipped: 0, Time elapsed: 10.397 sec <<< FAILURE!
- in org.apache.hadoop.yarn.client.TestResourceTrackerOnHA
testResourceTrackerOnHA(org.apache.hadoop.yarn.client.TestResourceTrackerOnHA)  Time elapsed:
10.18 sec  <<< ERROR!
java.net.ConnectException: Call From asf904.gq1.ygridcore.net/67.195.81.148 to asf904.gq1.ygridcore.net:28031
failed on connection exception: java.net.ConnectException: Connection refused; For more details
see:  http://wiki.apache.org/hadoop/ConnectionRefused
	at sun.nio.ch.SocketChannelImpl.checkConnect(Native Method)
	at sun.nio.ch.SocketChannelImpl.finishConnect(SocketChannelImpl.java:739)
	at org.apache.hadoop.net.SocketIOWithTimeout.connect(SocketIOWithTimeout.java:206)
	at org.apache.hadoop.net.NetUtils.connect(NetUtils.java:530)
	at org.apache.hadoop.net.NetUtils.connect(NetUtils.java:494)
	at org.apache.hadoop.ipc.Client$Connection.setupConnection(Client.java:607)
	at org.apache.hadoop.ipc.Client$Connection.setupIOstreams(Client.java:705)
	at org.apache.hadoop.ipc.Client$Connection.access$2800(Client.java:368)
	at org.apache.hadoop.ipc.Client.getConnection(Client.java:1521)
	at org.apache.hadoop.ipc.Client.call(Client.java:1438)
	at org.apache.hadoop.ipc.Client.call(Client.java:1399)
	at org.apache.hadoop.ipc.ProtobufRpcEngine$Invoker.invoke(ProtobufRpcEngine.java:230)
	at com.sun.proxy.$Proxy87.registerNodeManager(Unknown Source)
	at org.apache.hadoop.yarn.server.api.impl.pb.client.ResourceTrackerPBClientImpl.registerNodeManager(ResourceTrackerPBClientImpl.java:68)
	at sun.reflect.NativeMethodAccessorImpl.invoke0(Native Method)
	at sun.reflect.NativeMethodAccessorImpl.invoke(NativeMethodAccessorImpl.java:57)
	at sun.reflect.DelegatingMethodAccessorImpl.invoke(DelegatingMethodAccessorImpl.java:43)
	at java.lang.reflect.Method.invoke(Method.java:606)
	at org.apache.hadoop.io.retry.RetryInvocationHandler.invokeMethod(RetryInvocationHandler.java:186)
	at org.apache.hadoop.io.retry.RetryInvocationHandler.invoke(RetryInvocationHandler.java:101)
	at com.sun.proxy.$Proxy88.registerNodeManager(Unknown Source)
	at org.apache.hadoop.yarn.client.TestResourceTrackerOnHA.testResourceTrackerOnHA(TestResourceTrackerOnHA.java:64)

Running org.apache.hadoop.yarn.client.api.impl.TestNMClient
Tests run: 2, Failures: 0, Errors: 0, Skipped: 0, Time elapsed: 72.289 sec - in org.apache.hadoop.yarn.client.api.impl.TestNMClient
Running org.apache.hadoop.yarn.client.api.impl.TestAMRMClient
Tests run: 9, Failures: 0, Errors: 0, Skipped: 0, Time elapsed: 50.194 sec - in org.apache.hadoop.yarn.client.api.impl.TestAMRMClient
Running org.apache.hadoop.yarn.client.api.impl.TestYarnClient
Tests run: 16, Failures: 0, Errors: 0, Skipped: 0, Time elapsed: 22.46 sec - in org.apache.hadoop.yarn.client.api.impl.TestYarnClient
Running org.apache.hadoop.yarn.client.api.impl.TestAHSClient
Tests run: 7, Failures: 0, Errors: 0, Skipped: 0, Time elapsed: 1.284 sec - in org.apache.hadoop.yarn.client.api.impl.TestAHSClient
Running org.apache.hadoop.yarn.client.api.impl.TestAMRMClientOnRMRestart
Tests run: 3, Failures: 0, Errors: 0, Skipped: 0, Time elapsed: 27.731 sec - in org.apache.hadoop.yarn.client.api.impl.TestAMRMClientOnRMRestart
Running org.apache.hadoop.yarn.client.api.impl.TestAMRMClientContainerRequest
Tests run: 5, Failures: 0, Errors: 0, Skipped: 0, Time elapsed: 1.421 sec - in org.apache.hadoop.yarn.client.api.impl.TestAMRMClientContainerRequest
Running org.apache.hadoop.yarn.client.api.async.impl.TestNMClientAsync
Tests run: 2, Failures: 0, Errors: 0, Skipped: 0, Time elapsed: 0.985 sec - in org.apache.hadoop.yarn.client.api.async.impl.TestNMClientAsync
Running org.apache.hadoop.yarn.client.api.async.impl.TestAMRMClientAsync
Tests run: 9, Failures: 0, Errors: 0, Skipped: 0, Time elapsed: 2.962 sec - in org.apache.hadoop.yarn.client.api.async.impl.TestAMRMClientAsync
Running org.apache.hadoop.yarn.client.TestApplicationMasterServiceProtocolOnHA
Tests run: 3, Failures: 0, Errors: 0, Skipped: 0, Time elapsed: 26.977 sec - in org.apache.hadoop.yarn.client.TestApplicationMasterServiceProtocolOnHA
Running org.apache.hadoop.yarn.client.TestGetGroups
Tests run: 6, Failures: 0, Errors: 0, Skipped: 0, Time elapsed: 2.924 sec - in org.apache.hadoop.yarn.client.TestGetGroups
Running org.apache.hadoop.yarn.client.TestYarnApiClasses
Tests run: 3, Failures: 0, Errors: 0, Skipped: 0, Time elapsed: 0.388 sec - in org.apache.hadoop.yarn.client.TestYarnApiClasses
Running org.apache.hadoop.yarn.client.TestResourceManagerAdministrationProtocolPBClientImpl
Tests run: 7, Failures: 0, Errors: 0, Skipped: 0, Time elapsed: 2.947 sec - in org.apache.hadoop.yarn.client.TestResourceManagerAdministrationProtocolPBClientImpl
Running org.apache.hadoop.yarn.client.TestRMFailover
Tests run: 5, Failures: 0, Errors: 0, Skipped: 0, Time elapsed: 42.187 sec - in org.apache.hadoop.yarn.client.TestRMFailover
Running org.apache.hadoop.yarn.client.cli.TestLogsCLI
Tests run: 5, Failures: 0, Errors: 0, Skipped: 0, Time elapsed: 1.428 sec - in org.apache.hadoop.yarn.client.cli.TestLogsCLI
Running org.apache.hadoop.yarn.client.cli.TestYarnCLI
Tests run: 25, Failures: 0, Errors: 0, Skipped: 0, Time elapsed: 2.063 sec - in org.apache.hadoop.yarn.client.cli.TestYarnCLI
Running org.apache.hadoop.yarn.client.cli.TestRMAdminCLI
Tests run: 19, Failures: 0, Errors: 0, Skipped: 0, Time elapsed: 1.64 sec - in org.apache.hadoop.yarn.client.cli.TestRMAdminCLI

Results :

Tests in error: 
  TestResourceTrackerOnHA.testResourceTrackerOnHA:64 ยป Connect Call From asf904....

Tests run: 144, Failures: 0, Errors: 1, Skipped: 0

[INFO] ------------------------------------------------------------------------
[INFO] Reactor Summary:
[INFO] 
[INFO] hadoop-yarn ....................................... SUCCESS [  3.025 s]
[INFO] hadoop-yarn-api ................................... SUCCESS [02:59 min]
[INFO] hadoop-yarn-common ................................ SUCCESS [02:39 min]
[INFO] hadoop-yarn-server ................................ SUCCESS [  0.092 s]
[INFO] hadoop-yarn-server-common ......................... SUCCESS [ 39.916 s]
[INFO] hadoop-yarn-server-nodemanager .................... SUCCESS [06:08 min]
[INFO] hadoop-yarn-server-web-proxy ...................... SUCCESS [ 21.806 s]
[INFO] hadoop-yarn-server-applicationhistoryservice ...... SUCCESS [03:00 min]
[INFO] hadoop-yarn-server-resourcemanager ................ SUCCESS [46:59 min]
[INFO] hadoop-yarn-server-tests .......................... SUCCESS [02:13 min]
[INFO] hadoop-yarn-client ................................ FAILURE [06:48 min]
[INFO] hadoop-yarn-server-sharedcachemanager ............. SKIPPED
[INFO] hadoop-yarn-applications .......................... SKIPPED
[INFO] hadoop-yarn-applications-distributedshell ......... SKIPPED
[INFO] hadoop-yarn-applications-unmanaged-am-launcher .... SKIPPED
[INFO] hadoop-yarn-site .................................. SKIPPED
[INFO] hadoop-yarn-registry .............................. SKIPPED
[INFO] hadoop-yarn-project ............................... SKIPPED
[INFO] ------------------------------------------------------------------------
[INFO] BUILD FAILURE
[INFO] ------------------------------------------------------------------------
[INFO] Total time: 01:11 h
[INFO] Finished at: 2014-12-24T11:43:35+00:00
[INFO] Final Memory: 70M/842M
[INFO] ------------------------------------------------------------------------
[ERROR] Failed to execute goal org.apache.maven.plugins:maven-surefire-plugin:2.17:test (default-test)
on project hadoop-yarn-client: There are test failures.
[ERROR] 
[ERROR] Please refer to <https://builds.apache.org/job/Hadoop-Yarn-trunk/ws/hadoop-yarn-project/hadoop-yarn/hadoop-yarn-client/target/surefire-reports>
for the individual test results.
[ERROR] -> [Help 1]
[ERROR] 
[ERROR] To see the full stack trace of the errors, re-run Maven with the -e switch.
[ERROR] Re-run Maven using the -X switch to enable full debug logging.
[ERROR] 
[ERROR] For more information about the errors and possible solutions, please read the following
articles:
[ERROR] [Help 1] http://cwiki.apache.org/confluence/display/MAVEN/MojoFailureException
[ERROR] 
[ERROR] After correcting the problems, you can resume the build with the command
[ERROR]   mvn <goals> -rf :hadoop-yarn-client
Build step 'Execute shell' marked build as failure
Archiving artifacts
Recording test results
Updating YARN-2837
Updating HADOOP-11399
Updating YARN-2970
Updating YARN-2940
Updating YARN-2946
Updating YARN-2937

Mime
View raw message