hadoop-yarn-dev mailing list archives

Site index · List index
Message view « Date » · « Thread »
Top « Date » · « Thread »
From Apache Jenkins Server <jenk...@builds.apache.org>
Subject Failed: YARN-2910 PreCommit Build #6054
Date Tue, 09 Dec 2014 08:21:12 GMT
Jira: https://issues.apache.org/jira/browse/YARN-2910
Build: https://builds.apache.org/job/PreCommit-YARN-Build/6054/

###################################################################################
########################## LAST 60 LINES OF THE CONSOLE ###########################
[...truncated 4198 lines...]
  against trunk revision db73cc9.

    {color:green}+1 @author{color}.  The patch does not contain any @author tags.

    {color:green}+1 tests included{color}.  The patch appears to include 1 new or modified
test files.

    {color:green}+1 javac{color}.  The applied patch does not increase the total number of
javac compiler warnings.

    {color:green}+1 javadoc{color}.  There were no new javadoc warning messages.

    {color:green}+1 eclipse:eclipse{color}.  The patch built with eclipse:eclipse.

    {color:red}-1 findbugs{color}.  The patch appears to introduce 1 new Findbugs (version
2.0.3) warnings.

    {color:green}+1 release audit{color}.  The applied patch does not increase the total number
of release audit warnings.

    {color:red}-1 core tests{color}.  The patch failed these unit tests in hadoop-yarn-project/hadoop-yarn/hadoop-yarn-server/hadoop-yarn-server-resourcemanager:

                  org.apache.hadoop.yarn.server.resourcemanager.TestWorkPreservingRMRestart

    {color:green}+1 contrib tests{color}.  The patch passed contrib unit tests.

Test results: https://builds.apache.org/job/PreCommit-YARN-Build/6054//testReport/
Findbugs warnings: https://builds.apache.org/job/PreCommit-YARN-Build/6054//artifact/patchprocess/newPatchFindbugsWarningshadoop-yarn-server-resourcemanager.html
Console output: https://builds.apache.org/job/PreCommit-YARN-Build/6054//console

This message is automatically generated.


======================================================================
======================================================================
    Adding comment to Jira.
======================================================================
======================================================================


Comment added.
1db6d63ec4ed94124ed959a1c753024028211c70 logged out


======================================================================
======================================================================
    Finished build.
======================================================================
======================================================================


Build step 'Execute shell' marked build as failure
Archiving artifacts
Sending artifact delta relative to PreCommit-YARN-Build #6051
Archived 15 artifacts
Archive block size is 32768
Received 242 blocks and 939123 bytes
Compression is 89.4%
Took 0.81 sec
[description-setter] Could not determine description.
Recording test results
Email was triggered for: Failure
Sending email for trigger: Failure



###################################################################################
############################## FAILED TESTS (if any) ##############################
2 tests failed.
REGRESSION:  org.apache.hadoop.yarn.server.resourcemanager.TestWorkPreservingRMRestart.testReleasedContainerNotRecovered[1]

Error Message:
test timed out after 30000 milliseconds

Stack Trace:
java.lang.Exception: test timed out after 30000 milliseconds
	at java.lang.Thread.sleep(Native Method)
	at org.apache.hadoop.test.GenericTestUtils.waitFor(GenericTestUtils.java:120)
	at org.apache.hadoop.yarn.server.resourcemanager.TestWorkPreservingRMRestart.testReleasedContainerNotRecovered(TestWorkPreservingRMRestart.java:889)


REGRESSION:  org.apache.hadoop.yarn.server.resourcemanager.TestWorkPreservingRMRestart.testReleasedContainerNotRecovered[2]

Error Message:
test timed out after 30000 milliseconds

Stack Trace:
java.lang.Exception: test timed out after 30000 milliseconds
	at java.lang.Thread.sleep(Native Method)
	at org.apache.hadoop.test.GenericTestUtils.waitFor(GenericTestUtils.java:120)
	at org.apache.hadoop.yarn.server.resourcemanager.TestWorkPreservingRMRestart.testReleasedContainerNotRecovered(TestWorkPreservingRMRestart.java:889)



Mime
  • Unnamed multipart/mixed (inline, None, 0 bytes)
View raw message