hadoop-yarn-dev mailing list archives

Site index · List index
Message view « Date » · « Thread »
Top « Date » · « Thread »
From Apache Jenkins Server <jenk...@builds.apache.org>
Subject Hadoop-Yarn-trunk-Java8 - Build # 48 - Still Failing
Date Sun, 21 Dec 2014 11:31:44 GMT
See https://builds.apache.org/job/Hadoop-Yarn-trunk-Java8/48/

###################################################################################
########################## LAST 60 LINES OF THE CONSOLE ###########################
[...truncated 4809 lines...]
Results :

Tests in error: 
  TestContainerManagerSecurity.testContainerManagerWithEpoch:173 NoClassDefFound
  TestContainerManagerSecurity.testContainerManager:148 NoClassDefFound org/apac...
  TestContainerManagerSecurity.testContainerManagerWithEpoch:173 NoClassDefFound
  TestContainerManagerSecurity.testContainerManager:148 NoClassDefFound org/apac...

Tests run: 9, Failures: 0, Errors: 4, Skipped: 0

[INFO] ------------------------------------------------------------------------
[INFO] Reactor Summary:
[INFO] 
[INFO] hadoop-yarn ....................................... SUCCESS [  2.636 s]
[INFO] hadoop-yarn-api ................................... SUCCESS [ 53.647 s]
[INFO] hadoop-yarn-common ................................ SUCCESS [01:58 min]
[INFO] hadoop-yarn-server ................................ SUCCESS [  0.049 s]
[INFO] hadoop-yarn-server-common ......................... SUCCESS [ 32.822 s]
[INFO] hadoop-yarn-server-nodemanager .................... SUCCESS [06:04 min]
[INFO] hadoop-yarn-server-web-proxy ...................... SUCCESS [ 13.654 s]
[INFO] hadoop-yarn-server-applicationhistoryservice ...... SUCCESS [02:43 min]
[INFO] hadoop-yarn-server-resourcemanager ................ SUCCESS [46:14 min]
[INFO] hadoop-yarn-server-tests .......................... FAILURE [ 48.164 s]
[INFO] hadoop-yarn-client ................................ SKIPPED
[INFO] hadoop-yarn-server-sharedcachemanager ............. SKIPPED
[INFO] hadoop-yarn-applications .......................... SKIPPED
[INFO] hadoop-yarn-applications-distributedshell ......... SKIPPED
[INFO] hadoop-yarn-applications-unmanaged-am-launcher .... SKIPPED
[INFO] hadoop-yarn-site .................................. SKIPPED
[INFO] hadoop-yarn-registry .............................. SKIPPED
[INFO] hadoop-yarn-project ............................... SKIPPED
[INFO] ------------------------------------------------------------------------
[INFO] BUILD FAILURE
[INFO] ------------------------------------------------------------------------
[INFO] Total time: 59:34 min
[INFO] Finished at: 2014-12-21T11:31:27+00:00
[INFO] Final Memory: 86M/931M
[INFO] ------------------------------------------------------------------------
[ERROR] Failed to execute goal org.apache.maven.plugins:maven-surefire-plugin:2.17:test (default-test)
on project hadoop-yarn-server-tests: There are test failures.
[ERROR] 
[ERROR] Please refer to /home/jenkins/jenkins-slave/workspace/Hadoop-Yarn-trunk-Java8/hadoop-yarn-project/hadoop-yarn/hadoop-yarn-server/hadoop-yarn-server-tests/target/surefire-reports
for the individual test results.
[ERROR] -> [Help 1]
[ERROR] 
[ERROR] To see the full stack trace of the errors, re-run Maven with the -e switch.
[ERROR] Re-run Maven using the -X switch to enable full debug logging.
[ERROR] 
[ERROR] For more information about the errors and possible solutions, please read the following
articles:
[ERROR] [Help 1] http://cwiki.apache.org/confluence/display/MAVEN/MojoFailureException
[ERROR] 
[ERROR] After correcting the problems, you can resume the build with the command
[ERROR]   mvn <goals> -rf :hadoop-yarn-server-tests
Build step 'Execute shell' marked build as failure
Archiving artifacts
Recording test results
Updating YARN-2975
Updating YARN-2977
Sending e-mails to: yarn-dev@hadoop.apache.org
Email was triggered for: Failure
Sending email for trigger: Failure



###################################################################################
############################## FAILED TESTS (if any) ##############################
4 tests failed.
REGRESSION:  org.apache.hadoop.yarn.server.TestContainerManagerSecurity.testContainerManagerWithEpoch[0]

Error Message:
org/apache/hadoop/service/ServiceStateException

Stack Trace:
java.lang.NoClassDefFoundError: org/apache/hadoop/service/ServiceStateException
	at java.net.URLClassLoader$1.run(URLClassLoader.java:372)
	at java.net.URLClassLoader$1.run(URLClassLoader.java:361)
	at java.security.AccessController.doPrivileged(Native Method)
	at java.net.URLClassLoader.findClass(URLClassLoader.java:360)
	at java.lang.ClassLoader.loadClass(ClassLoader.java:424)
	at sun.misc.Launcher$AppClassLoader.loadClass(Launcher.java:308)
	at java.lang.ClassLoader.loadClass(ClassLoader.java:357)
	at org.apache.hadoop.yarn.server.TestContainerManagerSecurity.testContainerManagerWithEpoch(TestContainerManagerSecurity.java:173)


REGRESSION:  org.apache.hadoop.yarn.server.TestContainerManagerSecurity.testContainerManager[0]

Error Message:
org/apache/hadoop/service/ServiceStateException

Stack Trace:
java.lang.NoClassDefFoundError: org/apache/hadoop/service/ServiceStateException
	at java.net.URLClassLoader$1.run(URLClassLoader.java:372)
	at java.net.URLClassLoader$1.run(URLClassLoader.java:361)
	at java.security.AccessController.doPrivileged(Native Method)
	at java.net.URLClassLoader.findClass(URLClassLoader.java:360)
	at java.lang.ClassLoader.loadClass(ClassLoader.java:424)
	at sun.misc.Launcher$AppClassLoader.loadClass(Launcher.java:308)
	at java.lang.ClassLoader.loadClass(ClassLoader.java:357)
	at org.apache.hadoop.yarn.server.TestContainerManagerSecurity.testContainerManager(TestContainerManagerSecurity.java:148)


REGRESSION:  org.apache.hadoop.yarn.server.TestContainerManagerSecurity.testContainerManagerWithEpoch[1]

Error Message:
org/apache/hadoop/service/ServiceStateException

Stack Trace:
java.lang.NoClassDefFoundError: org/apache/hadoop/service/ServiceStateException
	at java.net.URLClassLoader$1.run(URLClassLoader.java:372)
	at java.net.URLClassLoader$1.run(URLClassLoader.java:361)
	at java.security.AccessController.doPrivileged(Native Method)
	at java.net.URLClassLoader.findClass(URLClassLoader.java:360)
	at java.lang.ClassLoader.loadClass(ClassLoader.java:424)
	at sun.misc.Launcher$AppClassLoader.loadClass(Launcher.java:308)
	at java.lang.ClassLoader.loadClass(ClassLoader.java:357)
	at org.apache.hadoop.yarn.server.TestContainerManagerSecurity.testContainerManagerWithEpoch(TestContainerManagerSecurity.java:173)


REGRESSION:  org.apache.hadoop.yarn.server.TestContainerManagerSecurity.testContainerManager[1]

Error Message:
org/apache/hadoop/service/ServiceStateException

Stack Trace:
java.lang.NoClassDefFoundError: org/apache/hadoop/service/ServiceStateException
	at java.net.URLClassLoader$1.run(URLClassLoader.java:372)
	at java.net.URLClassLoader$1.run(URLClassLoader.java:361)
	at java.security.AccessController.doPrivileged(Native Method)
	at java.net.URLClassLoader.findClass(URLClassLoader.java:360)
	at java.lang.ClassLoader.loadClass(ClassLoader.java:424)
	at sun.misc.Launcher$AppClassLoader.loadClass(Launcher.java:308)
	at java.lang.ClassLoader.loadClass(ClassLoader.java:357)
	at org.apache.hadoop.yarn.server.TestContainerManagerSecurity.testContainerManager(TestContainerManagerSecurity.java:148)



Mime
  • Unnamed multipart/mixed (inline, None, 0 bytes)
View raw message