hadoop-yarn-dev mailing list archives

Site index · List index
Message view « Date » · « Thread »
Top « Date » · « Thread »
From Apache Jenkins Server <jenk...@builds.apache.org>
Subject Build failed in Jenkins: Hadoop-Yarn-trunk-Java8 #38
Date Fri, 12 Dec 2014 10:40:58 GMT
See <https://builds.apache.org/job/Hadoop-Yarn-trunk-Java8/38/changes>

Changes:

[aw] HADOOP-11353. Add support for .hadooprc (aw)

[jianhe] YARN-2917. Fixed potential deadlock when system.exit is called in AsyncDispatcher.
Contributed by Rohith Sharmaks

[wheat9] HDFS-7515. Fix new findbugs warnings in hadoop-hdfs. Contributed by Haohui Mai.

[gera] HADOOP-11211. mapreduce.job.classloader.system.classes semantics should be order-independent.
(Yitong Zhou via gera)

[brandonli] HDFS-7449. Add metrics to NFS gateway. Contributed by Brandon Li

[wheat9] HADOOP-11389. Clean up byte to string encoding issues in hadoop-common. Contributed
by Haohui Mai.

[wang] HDFS-7497. Inconsistent report of decommissioning DataNodes between dfsadmin and NameNode
webui. Contributed by Yongjun Zhang.

[devaraj] MAPREDUCE-6046. Change the class name for logs in RMCommunicator.

[devaraj] YARN-2243. Order of arguments for Preconditions.checkNotNull() is wrong in

------------------------------------------
[...truncated 4188 lines...]
	at org.apache.hadoop.ipc.RPC$Server.<init>(RPC.java:935)
	at org.apache.hadoop.ipc.ProtobufRpcEngine$Server.<init>(ProtobufRpcEngine.java:535)
	at org.apache.hadoop.ipc.ProtobufRpcEngine.getServer(ProtobufRpcEngine.java:510)
	at org.apache.hadoop.ipc.RPC$Builder.build(RPC.java:780)
	at org.apache.hadoop.yarn.factories.impl.pb.RpcServerFactoryPBImpl.createServer(RpcServerFactoryPBImpl.java:173)
	at org.apache.hadoop.yarn.factories.impl.pb.RpcServerFactoryPBImpl.getServer(RpcServerFactoryPBImpl.java:132)
	at org.apache.hadoop.yarn.ipc.HadoopYarnProtoRPC.getServer(HadoopYarnProtoRPC.java:65)
	at org.apache.hadoop.yarn.ipc.YarnRPC.getServer(YarnRPC.java:54)
	at org.apache.hadoop.yarn.server.nodemanager.containermanager.ContainerManagerImpl.serviceStart(ContainerManagerImpl.java:421)
	at org.apache.hadoop.service.AbstractService.start(AbstractService.java:193)
	at org.apache.hadoop.yarn.server.nodemanager.containermanager.monitor.TestContainersMonitor.testContainerKillOnMemoryOverflow(TestContainersMonitor.java:191)

Java HotSpot(TM) 64-Bit Server VM warning: ignoring option MaxPermSize=768m; support was removed
in 8.0
Running org.apache.hadoop.yarn.server.nodemanager.containermanager.loghandler.TestNonAggregatingLogHandler
Tests run: 5, Failures: 0, Errors: 0, Skipped: 0, Time elapsed: 11.127 sec - in org.apache.hadoop.yarn.server.nodemanager.containermanager.loghandler.TestNonAggregatingLogHandler
Java HotSpot(TM) 64-Bit Server VM warning: ignoring option MaxPermSize=768m; support was removed
in 8.0
Running org.apache.hadoop.yarn.server.nodemanager.containermanager.TestAuxServices
Tests run: 6, Failures: 0, Errors: 0, Skipped: 0, Time elapsed: 0.704 sec - in org.apache.hadoop.yarn.server.nodemanager.containermanager.TestAuxServices
Java HotSpot(TM) 64-Bit Server VM warning: ignoring option MaxPermSize=768m; support was removed
in 8.0
Running org.apache.hadoop.yarn.server.nodemanager.containermanager.TestContainerManagerRecovery
Tests run: 1, Failures: 0, Errors: 0, Skipped: 0, Time elapsed: 1.484 sec - in org.apache.hadoop.yarn.server.nodemanager.containermanager.TestContainerManagerRecovery
Java HotSpot(TM) 64-Bit Server VM warning: ignoring option MaxPermSize=768m; support was removed
in 8.0
Running org.apache.hadoop.yarn.server.nodemanager.containermanager.launcher.TestContainerLaunch
Tests run: 16, Failures: 0, Errors: 4, Skipped: 4, Time elapsed: 2.473 sec <<< FAILURE!
- in org.apache.hadoop.yarn.server.nodemanager.containermanager.launcher.TestContainerLaunch
testImmediateKill(org.apache.hadoop.yarn.server.nodemanager.containermanager.launcher.TestContainerLaunch)
 Time elapsed: 0.154 sec  <<< ERROR!
org.apache.hadoop.yarn.exceptions.YarnRuntimeException: java.net.BindException: Problem binding
to [0.0.0.0:12345] java.net.BindException: Address already in use; For more details see: 
http://wiki.apache.org/hadoop/BindException
	at sun.nio.ch.Net.bind0(Native Method)
	at sun.nio.ch.Net.bind(Net.java:414)
	at sun.nio.ch.Net.bind(Net.java:406)
	at sun.nio.ch.ServerSocketChannelImpl.bind(ServerSocketChannelImpl.java:214)
	at sun.nio.ch.ServerSocketAdaptor.bind(ServerSocketAdaptor.java:74)
	at org.apache.hadoop.ipc.Server.bind(Server.java:411)
	at org.apache.hadoop.ipc.Server$Listener.<init>(Server.java:577)
	at org.apache.hadoop.ipc.Server.<init>(Server.java:2293)
	at org.apache.hadoop.ipc.RPC$Server.<init>(RPC.java:935)
	at org.apache.hadoop.ipc.ProtobufRpcEngine$Server.<init>(ProtobufRpcEngine.java:535)
	at org.apache.hadoop.ipc.ProtobufRpcEngine.getServer(ProtobufRpcEngine.java:510)
	at org.apache.hadoop.ipc.RPC$Builder.build(RPC.java:780)
	at org.apache.hadoop.yarn.factories.impl.pb.RpcServerFactoryPBImpl.createServer(RpcServerFactoryPBImpl.java:173)
	at org.apache.hadoop.yarn.factories.impl.pb.RpcServerFactoryPBImpl.getServer(RpcServerFactoryPBImpl.java:132)
	at org.apache.hadoop.yarn.ipc.HadoopYarnProtoRPC.getServer(HadoopYarnProtoRPC.java:65)
	at org.apache.hadoop.yarn.ipc.YarnRPC.getServer(YarnRPC.java:54)
	at org.apache.hadoop.yarn.server.nodemanager.containermanager.ContainerManagerImpl.serviceStart(ContainerManagerImpl.java:421)
	at org.apache.hadoop.service.AbstractService.start(AbstractService.java:193)
	at org.apache.hadoop.yarn.server.nodemanager.containermanager.launcher.TestContainerLaunch.internalKillTest(TestContainerLaunch.java:633)
	at org.apache.hadoop.yarn.server.nodemanager.containermanager.launcher.TestContainerLaunch.testImmediateKill(TestContainerLaunch.java:769)

testContainerEnvVariables(org.apache.hadoop.yarn.server.nodemanager.containermanager.launcher.TestContainerLaunch)
 Time elapsed: 0.083 sec  <<< ERROR!
org.apache.hadoop.yarn.exceptions.YarnRuntimeException: java.net.BindException: Problem binding
to [0.0.0.0:12345] java.net.BindException: Address already in use; For more details see: 
http://wiki.apache.org/hadoop/BindException
	at sun.nio.ch.Net.bind0(Native Method)
	at sun.nio.ch.Net.bind(Net.java:414)
	at sun.nio.ch.Net.bind(Net.java:406)
	at sun.nio.ch.ServerSocketChannelImpl.bind(ServerSocketChannelImpl.java:214)
	at sun.nio.ch.ServerSocketAdaptor.bind(ServerSocketAdaptor.java:74)
	at org.apache.hadoop.ipc.Server.bind(Server.java:411)
	at org.apache.hadoop.ipc.Server$Listener.<init>(Server.java:577)
	at org.apache.hadoop.ipc.Server.<init>(Server.java:2293)
	at org.apache.hadoop.ipc.RPC$Server.<init>(RPC.java:935)
	at org.apache.hadoop.ipc.ProtobufRpcEngine$Server.<init>(ProtobufRpcEngine.java:535)
	at org.apache.hadoop.ipc.ProtobufRpcEngine.getServer(ProtobufRpcEngine.java:510)
	at org.apache.hadoop.ipc.RPC$Builder.build(RPC.java:780)
	at org.apache.hadoop.yarn.factories.impl.pb.RpcServerFactoryPBImpl.createServer(RpcServerFactoryPBImpl.java:173)
	at org.apache.hadoop.yarn.factories.impl.pb.RpcServerFactoryPBImpl.getServer(RpcServerFactoryPBImpl.java:132)
	at org.apache.hadoop.yarn.ipc.HadoopYarnProtoRPC.getServer(HadoopYarnProtoRPC.java:65)
	at org.apache.hadoop.yarn.ipc.YarnRPC.getServer(YarnRPC.java:54)
	at org.apache.hadoop.yarn.server.nodemanager.containermanager.ContainerManagerImpl.serviceStart(ContainerManagerImpl.java:421)
	at org.apache.hadoop.service.AbstractService.start(AbstractService.java:193)
	at org.apache.hadoop.yarn.server.nodemanager.containermanager.launcher.TestContainerLaunch.testContainerEnvVariables(TestContainerLaunch.java:380)

testDelayedKill(org.apache.hadoop.yarn.server.nodemanager.containermanager.launcher.TestContainerLaunch)
 Time elapsed: 0.083 sec  <<< ERROR!
org.apache.hadoop.yarn.exceptions.YarnRuntimeException: java.net.BindException: Problem binding
to [0.0.0.0:12345] java.net.BindException: Address already in use; For more details see: 
http://wiki.apache.org/hadoop/BindException
	at sun.nio.ch.Net.bind0(Native Method)
	at sun.nio.ch.Net.bind(Net.java:414)
	at sun.nio.ch.Net.bind(Net.java:406)
	at sun.nio.ch.ServerSocketChannelImpl.bind(ServerSocketChannelImpl.java:214)
	at sun.nio.ch.ServerSocketAdaptor.bind(ServerSocketAdaptor.java:74)
	at org.apache.hadoop.ipc.Server.bind(Server.java:411)
	at org.apache.hadoop.ipc.Server$Listener.<init>(Server.java:577)
	at org.apache.hadoop.ipc.Server.<init>(Server.java:2293)
	at org.apache.hadoop.ipc.RPC$Server.<init>(RPC.java:935)
	at org.apache.hadoop.ipc.ProtobufRpcEngine$Server.<init>(ProtobufRpcEngine.java:535)
	at org.apache.hadoop.ipc.ProtobufRpcEngine.getServer(ProtobufRpcEngine.java:510)
	at org.apache.hadoop.ipc.RPC$Builder.build(RPC.java:780)
	at org.apache.hadoop.yarn.factories.impl.pb.RpcServerFactoryPBImpl.createServer(RpcServerFactoryPBImpl.java:173)
	at org.apache.hadoop.yarn.factories.impl.pb.RpcServerFactoryPBImpl.getServer(RpcServerFactoryPBImpl.java:132)
	at org.apache.hadoop.yarn.ipc.HadoopYarnProtoRPC.getServer(HadoopYarnProtoRPC.java:65)
	at org.apache.hadoop.yarn.ipc.YarnRPC.getServer(YarnRPC.java:54)
	at org.apache.hadoop.yarn.server.nodemanager.containermanager.ContainerManagerImpl.serviceStart(ContainerManagerImpl.java:421)
	at org.apache.hadoop.service.AbstractService.start(AbstractService.java:193)
	at org.apache.hadoop.yarn.server.nodemanager.containermanager.launcher.TestContainerLaunch.internalKillTest(TestContainerLaunch.java:633)
	at org.apache.hadoop.yarn.server.nodemanager.containermanager.launcher.TestContainerLaunch.testDelayedKill(TestContainerLaunch.java:764)

testKillProcessGroup(org.apache.hadoop.yarn.server.nodemanager.containermanager.launcher.TestContainerLaunch)
 Time elapsed: 0.082 sec  <<< ERROR!
org.apache.hadoop.yarn.exceptions.YarnRuntimeException: java.net.BindException: Problem binding
to [0.0.0.0:12345] java.net.BindException: Address already in use; For more details see: 
http://wiki.apache.org/hadoop/BindException
	at sun.nio.ch.Net.bind0(Native Method)
	at sun.nio.ch.Net.bind(Net.java:414)
	at sun.nio.ch.Net.bind(Net.java:406)
	at sun.nio.ch.ServerSocketChannelImpl.bind(ServerSocketChannelImpl.java:214)
	at sun.nio.ch.ServerSocketAdaptor.bind(ServerSocketAdaptor.java:74)
	at org.apache.hadoop.ipc.Server.bind(Server.java:411)
	at org.apache.hadoop.ipc.Server$Listener.<init>(Server.java:577)
	at org.apache.hadoop.ipc.Server.<init>(Server.java:2293)
	at org.apache.hadoop.ipc.RPC$Server.<init>(RPC.java:935)
	at org.apache.hadoop.ipc.ProtobufRpcEngine$Server.<init>(ProtobufRpcEngine.java:535)
	at org.apache.hadoop.ipc.ProtobufRpcEngine.getServer(ProtobufRpcEngine.java:510)
	at org.apache.hadoop.ipc.RPC$Builder.build(RPC.java:780)
	at org.apache.hadoop.yarn.factories.impl.pb.RpcServerFactoryPBImpl.createServer(RpcServerFactoryPBImpl.java:173)
	at org.apache.hadoop.yarn.factories.impl.pb.RpcServerFactoryPBImpl.getServer(RpcServerFactoryPBImpl.java:132)
	at org.apache.hadoop.yarn.ipc.HadoopYarnProtoRPC.getServer(HadoopYarnProtoRPC.java:65)
	at org.apache.hadoop.yarn.ipc.YarnRPC.getServer(YarnRPC.java:54)
	at org.apache.hadoop.yarn.server.nodemanager.containermanager.ContainerManagerImpl.serviceStart(ContainerManagerImpl.java:421)
	at org.apache.hadoop.service.AbstractService.start(AbstractService.java:193)
	at org.apache.hadoop.yarn.server.nodemanager.containermanager.launcher.TestContainerLaunch.testKillProcessGroup(TestContainerLaunch.java:979)

Java HotSpot(TM) 64-Bit Server VM warning: ignoring option MaxPermSize=768m; support was removed
in 8.0
Running org.apache.hadoop.yarn.server.nodemanager.containermanager.localizer.TestLocalCacheDirectoryManager
Tests run: 5, Failures: 0, Errors: 0, Skipped: 0, Time elapsed: 0.932 sec - in org.apache.hadoop.yarn.server.nodemanager.containermanager.localizer.TestLocalCacheDirectoryManager
Java HotSpot(TM) 64-Bit Server VM warning: ignoring option MaxPermSize=768m; support was removed
in 8.0
Running org.apache.hadoop.yarn.server.nodemanager.containermanager.localizer.TestContainerLocalizer
Tests run: 3, Failures: 0, Errors: 0, Skipped: 0, Time elapsed: 1.163 sec - in org.apache.hadoop.yarn.server.nodemanager.containermanager.localizer.TestContainerLocalizer
Java HotSpot(TM) 64-Bit Server VM warning: ignoring option MaxPermSize=768m; support was removed
in 8.0
Running org.apache.hadoop.yarn.server.nodemanager.containermanager.localizer.TestLocalResourcesTrackerImpl
Tests run: 8, Failures: 0, Errors: 0, Skipped: 0, Time elapsed: 0.966 sec - in org.apache.hadoop.yarn.server.nodemanager.containermanager.localizer.TestLocalResourcesTrackerImpl
Java HotSpot(TM) 64-Bit Server VM warning: ignoring option MaxPermSize=768m; support was removed
in 8.0
Running org.apache.hadoop.yarn.server.nodemanager.containermanager.localizer.sharedcache.TestSharedCacheUploadService
Tests run: 2, Failures: 0, Errors: 0, Skipped: 0, Time elapsed: 0.581 sec - in org.apache.hadoop.yarn.server.nodemanager.containermanager.localizer.sharedcache.TestSharedCacheUploadService
Java HotSpot(TM) 64-Bit Server VM warning: ignoring option MaxPermSize=768m; support was removed
in 8.0
Running org.apache.hadoop.yarn.server.nodemanager.containermanager.localizer.sharedcache.TestSharedCacheUploader
Tests run: 6, Failures: 0, Errors: 0, Skipped: 0, Time elapsed: 0.805 sec - in org.apache.hadoop.yarn.server.nodemanager.containermanager.localizer.sharedcache.TestSharedCacheUploader
Java HotSpot(TM) 64-Bit Server VM warning: ignoring option MaxPermSize=768m; support was removed
in 8.0
Running org.apache.hadoop.yarn.server.nodemanager.containermanager.localizer.TestLocalResource
Tests run: 2, Failures: 0, Errors: 0, Skipped: 0, Time elapsed: 0.325 sec - in org.apache.hadoop.yarn.server.nodemanager.containermanager.localizer.TestLocalResource
Java HotSpot(TM) 64-Bit Server VM warning: ignoring option MaxPermSize=768m; support was removed
in 8.0
Running org.apache.hadoop.yarn.server.nodemanager.containermanager.localizer.TestResourceRetention
Tests run: 1, Failures: 0, Errors: 0, Skipped: 0, Time elapsed: 0.699 sec - in org.apache.hadoop.yarn.server.nodemanager.containermanager.localizer.TestResourceRetention
Java HotSpot(TM) 64-Bit Server VM warning: ignoring option MaxPermSize=768m; support was removed
in 8.0
Running org.apache.hadoop.yarn.server.nodemanager.containermanager.localizer.TestLocalizedResource
Tests run: 1, Failures: 0, Errors: 0, Skipped: 0, Time elapsed: 0.546 sec - in org.apache.hadoop.yarn.server.nodemanager.containermanager.localizer.TestLocalizedResource
Java HotSpot(TM) 64-Bit Server VM warning: ignoring option MaxPermSize=768m; support was removed
in 8.0
Running org.apache.hadoop.yarn.server.nodemanager.containermanager.localizer.TestResourceLocalizationService
Tests run: 12, Failures: 0, Errors: 0, Skipped: 0, Time elapsed: 4.392 sec - in org.apache.hadoop.yarn.server.nodemanager.containermanager.localizer.TestResourceLocalizationService
Java HotSpot(TM) 64-Bit Server VM warning: ignoring option MaxPermSize=768m; support was removed
in 8.0
Running org.apache.hadoop.yarn.server.nodemanager.containermanager.application.TestApplication
Tests run: 8, Failures: 0, Errors: 0, Skipped: 0, Time elapsed: 5.106 sec - in org.apache.hadoop.yarn.server.nodemanager.containermanager.application.TestApplication
Java HotSpot(TM) 64-Bit Server VM warning: ignoring option MaxPermSize=768m; support was removed
in 8.0
Running org.apache.hadoop.yarn.server.nodemanager.TestDirectoryCollection
Tests run: 6, Failures: 0, Errors: 0, Skipped: 0, Time elapsed: 0.58 sec - in org.apache.hadoop.yarn.server.nodemanager.TestDirectoryCollection
Java HotSpot(TM) 64-Bit Server VM warning: ignoring option MaxPermSize=768m; support was removed
in 8.0
Running org.apache.hadoop.yarn.server.nodemanager.TestNMAuditLogger
Tests run: 3, Failures: 0, Errors: 0, Skipped: 0, Time elapsed: 0.796 sec - in org.apache.hadoop.yarn.server.nodemanager.TestNMAuditLogger
Java HotSpot(TM) 64-Bit Server VM warning: ignoring option MaxPermSize=768m; support was removed
in 8.0
Running org.apache.hadoop.yarn.server.nodemanager.TestDeletionService
Tests run: 6, Failures: 0, Errors: 0, Skipped: 0, Time elapsed: 22.528 sec - in org.apache.hadoop.yarn.server.nodemanager.TestDeletionService
Java HotSpot(TM) 64-Bit Server VM warning: ignoring option MaxPermSize=768m; support was removed
in 8.0
Running org.apache.hadoop.yarn.server.nodemanager.TestDockerContainerExecutorWithMocks
Tests run: 4, Failures: 0, Errors: 0, Skipped: 0, Time elapsed: 0.906 sec - in org.apache.hadoop.yarn.server.nodemanager.TestDockerContainerExecutorWithMocks
Java HotSpot(TM) 64-Bit Server VM warning: ignoring option MaxPermSize=768m; support was removed
in 8.0
Running org.apache.hadoop.yarn.server.nodemanager.TestEventFlow
Tests run: 1, Failures: 0, Errors: 0, Skipped: 0, Time elapsed: 5.289 sec - in org.apache.hadoop.yarn.server.nodemanager.TestEventFlow
Java HotSpot(TM) 64-Bit Server VM warning: ignoring option MaxPermSize=768m; support was removed
in 8.0
Running org.apache.hadoop.yarn.server.nodemanager.webapp.TestNMWebServices
Tests run: 11, Failures: 0, Errors: 0, Skipped: 0, Time elapsed: 5.231 sec - in org.apache.hadoop.yarn.server.nodemanager.webapp.TestNMWebServices
Java HotSpot(TM) 64-Bit Server VM warning: ignoring option MaxPermSize=768m; support was removed
in 8.0
Running org.apache.hadoop.yarn.server.nodemanager.webapp.TestNMWebServicesContainers
Tests run: 12, Failures: 0, Errors: 0, Skipped: 0, Time elapsed: 5.689 sec - in org.apache.hadoop.yarn.server.nodemanager.webapp.TestNMWebServicesContainers
Java HotSpot(TM) 64-Bit Server VM warning: ignoring option MaxPermSize=768m; support was removed
in 8.0
Running org.apache.hadoop.yarn.server.nodemanager.webapp.TestContainerLogsPage
Tests run: 4, Failures: 0, Errors: 0, Skipped: 1, Time elapsed: 0.954 sec - in org.apache.hadoop.yarn.server.nodemanager.webapp.TestContainerLogsPage
Java HotSpot(TM) 64-Bit Server VM warning: ignoring option MaxPermSize=768m; support was removed
in 8.0
Running org.apache.hadoop.yarn.server.nodemanager.webapp.TestNMWebServicesApps
Tests run: 19, Failures: 0, Errors: 0, Skipped: 0, Time elapsed: 7.14 sec - in org.apache.hadoop.yarn.server.nodemanager.webapp.TestNMWebServicesApps
Java HotSpot(TM) 64-Bit Server VM warning: ignoring option MaxPermSize=768m; support was removed
in 8.0
Running org.apache.hadoop.yarn.server.nodemanager.webapp.TestNMWebServer
Tests run: 3, Failures: 0, Errors: 0, Skipped: 0, Time elapsed: 2.03 sec - in org.apache.hadoop.yarn.server.nodemanager.webapp.TestNMWebServer

Results :

Tests in error: 
  TestContainerManager.testContainerLaunchAndExitFailure:450 » YarnRuntime java....
  TestContainerManager.testContainerSetup:180 » YarnRuntime java.net.BindExcepti...
  TestContainerManager.testContainerManagerInitialization:148 » YarnRuntime java...
  TestContainerManager.testStartContainerFailureWithUnknownAuxService:760 » YarnRuntime
  TestContainerManager.testContainerLaunchAndStop:260 » YarnRuntime java.net.Bin...
  TestContainerManager.testLocalFilesCleanup:467 » YarnRuntime java.net.BindExce...
  TestContainerManager.testContainerLaunchFromPreviousRM:574 » YarnRuntime java....
  TestContainerManager.testContainerLaunchAndExitSuccess:439 » YarnRuntime java....
  TestContainerManager.testMultipleContainersLaunch:638 » YarnRuntime java.net.B...
  TestContainerManager.testMultipleContainersStopAndGetStatus:683 » YarnRuntime ...
  TestContainersMonitor.testContainerKillOnMemoryOverflow:191 » YarnRuntime java...
  TestContainerLaunch.testImmediateKill:769->internalKillTest:633 » YarnRuntime ...
  TestContainerLaunch.testContainerEnvVariables:380 » YarnRuntime java.net.BindE...
  TestContainerLaunch.testDelayedKill:764->internalKillTest:633 » YarnRuntime ja...
  TestContainerLaunch.testKillProcessGroup:979 » YarnRuntime java.net.BindExcept...

Tests run: 279, Failures: 0, Errors: 15, Skipped: 5

[INFO] ------------------------------------------------------------------------
[INFO] Reactor Summary:
[INFO] 
[INFO] hadoop-yarn ....................................... SUCCESS [  3.198 s]
[INFO] hadoop-yarn-api ................................... SUCCESS [ 56.389 s]
[INFO] hadoop-yarn-common ................................ SUCCESS [02:04 min]
[INFO] hadoop-yarn-server ................................ SUCCESS [  0.059 s]
[INFO] hadoop-yarn-server-common ......................... SUCCESS [ 33.613 s]
[INFO] hadoop-yarn-server-nodemanager .................... FAILURE [05:05 min]
[INFO] hadoop-yarn-server-web-proxy ...................... SKIPPED
[INFO] hadoop-yarn-server-applicationhistoryservice ...... SKIPPED
[INFO] hadoop-yarn-server-resourcemanager ................ SKIPPED
[INFO] hadoop-yarn-server-tests .......................... SKIPPED
[INFO] hadoop-yarn-client ................................ SKIPPED
[INFO] hadoop-yarn-server-sharedcachemanager ............. SKIPPED
[INFO] hadoop-yarn-applications .......................... SKIPPED
[INFO] hadoop-yarn-applications-distributedshell ......... SKIPPED
[INFO] hadoop-yarn-applications-unmanaged-am-launcher .... SKIPPED
[INFO] hadoop-yarn-site .................................. SKIPPED
[INFO] hadoop-yarn-registry .............................. SKIPPED
[INFO] hadoop-yarn-project ............................... SKIPPED
[INFO] ------------------------------------------------------------------------
[INFO] BUILD FAILURE
[INFO] ------------------------------------------------------------------------
[INFO] Total time: 08:44 min
[INFO] Finished at: 2014-12-12T10:40:45+00:00
[INFO] Final Memory: 75M/860M
[INFO] ------------------------------------------------------------------------
[ERROR] Failed to execute goal org.apache.maven.plugins:maven-surefire-plugin:2.17:test (default-test)
on project hadoop-yarn-server-nodemanager: There are test failures.
[ERROR] 
[ERROR] Please refer to <https://builds.apache.org/job/Hadoop-Yarn-trunk-Java8/ws/hadoop-yarn-project/hadoop-yarn/hadoop-yarn-server/hadoop-yarn-server-nodemanager/target/surefire-reports>
for the individual test results.
[ERROR] -> [Help 1]
[ERROR] 
[ERROR] To see the full stack trace of the errors, re-run Maven with the -e switch.
[ERROR] Re-run Maven using the -X switch to enable full debug logging.
[ERROR] 
[ERROR] For more information about the errors and possible solutions, please read the following
articles:
[ERROR] [Help 1] http://cwiki.apache.org/confluence/display/MAVEN/MojoFailureException
[ERROR] 
[ERROR] After correcting the problems, you can resume the build with the command
[ERROR]   mvn <goals> -rf :hadoop-yarn-server-nodemanager
Build step 'Execute shell' marked build as failure
Archiving artifacts
Recording test results
Updating HDFS-7497
Updating YARN-2243
Updating HADOOP-11389
Updating HDFS-7449
Updating HADOOP-11211
Updating YARN-2917
Updating HADOOP-11353
Updating MAPREDUCE-6046
Updating HDFS-7515

Mime
View raw message