hadoop-yarn-dev mailing list archives

Site index · List index
Message view « Date » · « Thread »
Top « Date » · « Thread »
From Apache Jenkins Server <jenk...@builds.apache.org>
Subject Hadoop-Yarn-trunk-Java8 - Build # 21 - Still Failing
Date Sun, 30 Nov 2014 11:45:31 GMT
See https://builds.apache.org/job/Hadoop-Yarn-trunk-Java8/21/

###################################################################################
########################## LAST 60 LINES OF THE CONSOLE ###########################
[...truncated 9438 lines...]
Running org.apache.hadoop.yarn.client.TestResourceTrackerOnHA
Tests run: 1, Failures: 0, Errors: 0, Skipped: 0, Time elapsed: 14.322 sec - in org.apache.hadoop.yarn.client.TestResourceTrackerOnHA

Results :

Tests in error: 
  TestApplicationClientProtocolOnHA.testGetContainersOnHA:154 » Connect Call Fro...
  TestApplicationClientProtocolOnHA.testRenewDelegationTokenOnHA:198 » Connect C...
  TestApplicationClientProtocolOnHA.testForceKillApplicationOnHA:185 » Connect C...
  TestApplicationClientProtocolOnHA.testGetDelegationTokenOnHA:190 » Connect Cal...

Tests run: 142, Failures: 0, Errors: 4, Skipped: 0

[INFO] ------------------------------------------------------------------------
[INFO] Reactor Summary:
[INFO] 
[INFO] hadoop-yarn ....................................... SUCCESS [  3.081 s]
[INFO] hadoop-yarn-api ................................... SUCCESS [02:56 min]
[INFO] hadoop-yarn-common ................................ SUCCESS [02:24 min]
[INFO] hadoop-yarn-server ................................ SUCCESS [  0.084 s]
[INFO] hadoop-yarn-server-common ......................... SUCCESS [ 38.006 s]
[INFO] hadoop-yarn-server-nodemanager .................... SUCCESS [05:58 min]
[INFO] hadoop-yarn-server-web-proxy ...................... SUCCESS [ 17.663 s]
[INFO] hadoop-yarn-server-applicationhistoryservice ...... SUCCESS [02:50 min]
[INFO] hadoop-yarn-server-resourcemanager ................ SUCCESS [48:25 min]
[INFO] hadoop-yarn-server-tests .......................... SUCCESS [02:12 min]
[INFO] hadoop-yarn-client ................................ FAILURE [07:28 min]
[INFO] hadoop-yarn-server-sharedcachemanager ............. SKIPPED
[INFO] hadoop-yarn-applications .......................... SKIPPED
[INFO] hadoop-yarn-applications-distributedshell ......... SKIPPED
[INFO] hadoop-yarn-applications-unmanaged-am-launcher .... SKIPPED
[INFO] hadoop-yarn-site .................................. SKIPPED
[INFO] hadoop-yarn-registry .............................. SKIPPED
[INFO] hadoop-yarn-project ............................... SKIPPED
[INFO] ------------------------------------------------------------------------
[INFO] BUILD FAILURE
[INFO] ------------------------------------------------------------------------
[INFO] Total time: 01:13 h
[INFO] Finished at: 2014-11-30T11:45:22+00:00
[INFO] Final Memory: 94M/1059M
[INFO] ------------------------------------------------------------------------
[ERROR] Failed to execute goal org.apache.maven.plugins:maven-surefire-plugin:2.16:test (default-test)
on project hadoop-yarn-client: There are test failures.
[ERROR] 
[ERROR] Please refer to /home/jenkins/jenkins-slave/workspace/Hadoop-Yarn-trunk-Java8/hadoop-yarn-project/hadoop-yarn/hadoop-yarn-client/target/surefire-reports
for the individual test results.
[ERROR] -> [Help 1]
[ERROR] 
[ERROR] To see the full stack trace of the errors, re-run Maven with the -e switch.
[ERROR] Re-run Maven using the -X switch to enable full debug logging.
[ERROR] 
[ERROR] For more information about the errors and possible solutions, please read the following
articles:
[ERROR] [Help 1] http://cwiki.apache.org/confluence/display/MAVEN/MojoFailureException
[ERROR] 
[ERROR] After correcting the problems, you can resume the build with the command
[ERROR]   mvn <goals> -rf :hadoop-yarn-client
Build step 'Execute shell' marked build as failure
Archiving artifacts
Sending e-mails to: yarn-dev@hadoop.apache.org
Email was triggered for: Failure
Sending email for trigger: Failure



###################################################################################
############################## FAILED TESTS (if any) ##############################
No tests ran.
Mime
  • Unnamed multipart/mixed (inline, None, 0 bytes)
View raw message