hadoop-yarn-dev mailing list archives

Site index · List index
Message view « Date » · « Thread »
Top « Date » · « Thread »
From Apache Jenkins Server <jenk...@builds.apache.org>
Subject Hadoop-Yarn-trunk-Java8 - Build # 4 - Still Failing
Date Thu, 13 Nov 2014 11:32:52 GMT
See https://builds.apache.org/job/Hadoop-Yarn-trunk-Java8/4/

###################################################################################
########################## LAST 60 LINES OF THE CONSOLE ###########################
[...truncated 8553 lines...]
[INFO] 
[INFO] hadoop-yarn ....................................... SUCCESS [  2.863 s]
[INFO] hadoop-yarn-api ................................... SUCCESS [02:41 min]
[INFO] hadoop-yarn-common ................................ SUCCESS [02:24 min]
[INFO] hadoop-yarn-server ................................ SUCCESS [  0.082 s]
[INFO] hadoop-yarn-server-common ......................... SUCCESS [ 38.570 s]
[INFO] hadoop-yarn-server-nodemanager .................... SUCCESS [06:00 min]
[INFO] hadoop-yarn-server-web-proxy ...................... SUCCESS [ 17.632 s]
[INFO] hadoop-yarn-server-applicationhistoryservice ...... SUCCESS [02:48 min]
[INFO] hadoop-yarn-server-resourcemanager ................ FAILURE [45:33 min]
[INFO] hadoop-yarn-server-tests .......................... SKIPPED
[INFO] hadoop-yarn-client ................................ SKIPPED
[INFO] hadoop-yarn-server-sharedcachemanager ............. SKIPPED
[INFO] hadoop-yarn-applications .......................... SKIPPED
[INFO] hadoop-yarn-applications-distributedshell ......... SKIPPED
[INFO] hadoop-yarn-applications-unmanaged-am-launcher .... SKIPPED
[INFO] hadoop-yarn-site .................................. SKIPPED
[INFO] hadoop-yarn-registry .............................. SKIPPED
[INFO] hadoop-yarn-project ............................... SKIPPED
[INFO] ------------------------------------------------------------------------
[INFO] BUILD FAILURE
[INFO] ------------------------------------------------------------------------
[INFO] Total time: 01:00 h
[INFO] Finished at: 2014-11-13T11:32:35+00:00
[INFO] Final Memory: 68M/692M
[INFO] ------------------------------------------------------------------------
[ERROR] Failed to execute goal org.apache.maven.plugins:maven-surefire-plugin:2.16:test (default-test)
on project hadoop-yarn-server-resourcemanager: There are test failures.
[ERROR] 
[ERROR] Please refer to /home/jenkins/jenkins-slave/workspace/Hadoop-Yarn-trunk-Java8/hadoop-yarn-project/hadoop-yarn/hadoop-yarn-server/hadoop-yarn-server-resourcemanager/target/surefire-reports
for the individual test results.
[ERROR] -> [Help 1]
[ERROR] 
[ERROR] To see the full stack trace of the errors, re-run Maven with the -e switch.
[ERROR] Re-run Maven using the -X switch to enable full debug logging.
[ERROR] 
[ERROR] For more information about the errors and possible solutions, please read the following
articles:
[ERROR] [Help 1] http://cwiki.apache.org/confluence/display/MAVEN/MojoFailureException
[ERROR] 
[ERROR] After correcting the problems, you can resume the build with the command
[ERROR]   mvn <goals> -rf :hadoop-yarn-server-resourcemanager
Build step 'Execute shell' marked build as failure
Archiving artifacts
Updating YARN-1492
Updating YARN-2794
Updating HADOOP-11284
Updating HDFS-7391
Updating HDFS-7387
Updating HADOOP-7984
Updating YARN-2780
Updating YARN-2603
Updating YARN-2236
Updating HADOOP-9576
Updating HADOOP-11291
Updating YARN-2843
Updating HADOOP-11025
Updating HADOOP-11217
Updating YARN-2841
Sending e-mails to: yarn-dev@hadoop.apache.org
Email was triggered for: Failure
Sending email for trigger: Failure



###################################################################################
############################## FAILED TESTS (if any) ##############################
No tests ran.
Mime
  • Unnamed multipart/mixed (inline, None, 0 bytes)
View raw message