hadoop-yarn-dev mailing list archives

Site index · List index
Message view « Date » · « Thread »
Top « Date » · « Thread »
From Apache Jenkins Server <jenk...@builds.apache.org>
Subject Hadoop-Yarn-trunk-Java8 - Build # 15 - Still Failing
Date Mon, 24 Nov 2014 11:43:29 GMT
See https://builds.apache.org/job/Hadoop-Yarn-trunk-Java8/15/

###################################################################################
########################## LAST 60 LINES OF THE CONSOLE ###########################
[...truncated 9334 lines...]

Running org.apache.hadoop.yarn.client.TestResourceTrackerOnHA
Tests run: 1, Failures: 0, Errors: 0, Skipped: 0, Time elapsed: 14.022 sec - in org.apache.hadoop.yarn.client.TestResourceTrackerOnHA

Results :

Tests in error: 
  TestApplicationClientProtocolOnHA.testGetContainersOnHA:154 » Connect Call Fro...
  TestApplicationClientProtocolOnHA.testGetApplicationAttemptReportOnHA:128 » Connect

Tests run: 142, Failures: 0, Errors: 2, Skipped: 0

[INFO] ------------------------------------------------------------------------
[INFO] Reactor Summary:
[INFO] 
[INFO] hadoop-yarn ....................................... SUCCESS [  3.059 s]
[INFO] hadoop-yarn-api ................................... SUCCESS [02:47 min]
[INFO] hadoop-yarn-common ................................ SUCCESS [02:24 min]
[INFO] hadoop-yarn-server ................................ SUCCESS [  0.079 s]
[INFO] hadoop-yarn-server-common ......................... SUCCESS [ 38.817 s]
[INFO] hadoop-yarn-server-nodemanager .................... SUCCESS [05:57 min]
[INFO] hadoop-yarn-server-web-proxy ...................... SUCCESS [ 17.418 s]
[INFO] hadoop-yarn-server-applicationhistoryservice ...... SUCCESS [02:51 min]
[INFO] hadoop-yarn-server-resourcemanager ................ SUCCESS [46:46 min]
[INFO] hadoop-yarn-server-tests .......................... SUCCESS [02:12 min]
[INFO] hadoop-yarn-client ................................ FAILURE [07:13 min]
[INFO] hadoop-yarn-server-sharedcachemanager ............. SKIPPED
[INFO] hadoop-yarn-applications .......................... SKIPPED
[INFO] hadoop-yarn-applications-distributedshell ......... SKIPPED
[INFO] hadoop-yarn-applications-unmanaged-am-launcher .... SKIPPED
[INFO] hadoop-yarn-site .................................. SKIPPED
[INFO] hadoop-yarn-registry .............................. SKIPPED
[INFO] hadoop-yarn-project ............................... SKIPPED
[INFO] ------------------------------------------------------------------------
[INFO] BUILD FAILURE
[INFO] ------------------------------------------------------------------------
[INFO] Total time: 01:11 h
[INFO] Finished at: 2014-11-24T11:43:19+00:00
[INFO] Final Memory: 94M/928M
[INFO] ------------------------------------------------------------------------
[ERROR] Failed to execute goal org.apache.maven.plugins:maven-surefire-plugin:2.16:test (default-test)
on project hadoop-yarn-client: There are test failures.
[ERROR] 
[ERROR] Please refer to /home/jenkins/jenkins-slave/workspace/Hadoop-Yarn-trunk-Java8/hadoop-yarn-project/hadoop-yarn/hadoop-yarn-client/target/surefire-reports
for the individual test results.
[ERROR] -> [Help 1]
[ERROR] 
[ERROR] To see the full stack trace of the errors, re-run Maven with the -e switch.
[ERROR] Re-run Maven using the -X switch to enable full debug logging.
[ERROR] 
[ERROR] For more information about the errors and possible solutions, please read the following
articles:
[ERROR] [Help 1] http://cwiki.apache.org/confluence/display/MAVEN/MojoFailureException
[ERROR] 
[ERROR] After correcting the problems, you can resume the build with the command
[ERROR]   mvn <goals> -rf :hadoop-yarn-client
Build step 'Execute shell' marked build as failure
Archiving artifacts
Updating HDFS-7403
Sending e-mails to: yarn-dev@hadoop.apache.org
Email was triggered for: Failure
Sending email for trigger: Failure



###################################################################################
############################## FAILED TESTS (if any) ##############################
No tests ran.
Mime
  • Unnamed multipart/mixed (inline, None, 0 bytes)
View raw message