hadoop-yarn-dev mailing list archives

Site index · List index
Message view « Date » · « Thread »
Top « Date » · « Thread »
From Apache Jenkins Server <jenk...@builds.apache.org>
Subject Build failed in Jenkins: Hadoop-Yarn-trunk-Java8 #5
Date Fri, 14 Nov 2014 11:33:01 GMT
See <https://builds.apache.org/job/Hadoop-Yarn-trunk-Java8/5/changes>

Changes:

[jlowe] MAPREDUCE-6156. Fetcher - connect() doesn't handle connection refused correctly. Contributed
by Junping Du

[jlowe] YARN-2846. Incorrect persist exit code for running containers in reacquireContainer()
that interrupted by NodeManager restart. Contributed by Junping Du

[vinodkv] YARN-2853. Fixed a bug in ResourceManager causing apps to hang when the user kill
request races with ApplicationMaster finish. Contributed by Jian He.

[acmurthy] YARN-2853. Merging to branch-2.6 for hadoop-2.6.0-rc1.

[acmurthy] YARN-2635. Merging to branch-2.6 for hadoop-2.6.0-rc1.

[aw] HADOOP-8989. hadoop fs -find feature (Jonathan Allen via aw)

[aw] HADOOP-11298. slaves.sh and stop-all.sh are missing slashes (aw)

[aw] HADOOP-11150. hadoop command should show the reason on failure by invalid COMMAND or
CLASSNAME (Masatake Iwasaki via aw)

[szetszwo] HDFS-7358. Clients may get stuck waiting when using ByteArrayManager.

[cnauroth] HDFS-7385. ThreadLocal used in FSEditLog class causes FSImage permission mess up.
Contributed by jiangyu.

[acmurthy] Preparing to release hadoop-2.6.0-rc1.

[vinodkv] Revert "YARN-2603. ApplicationConstants missing HADOOP_MAPRED_HOME (Ray Chiang via
aw)"

[zjshen] YARN-2766. Made ApplicationHistoryManager return a sorted list of apps, attempts
and containers. Contributed by Robert Kanter.

[wheat9] HDFS-7395. BlockIdManager#clear() bails out when resetting the GenerationStampV1Limit.
Contributed by Haohui Mai.

[jianhe] YARN-2856. Fixed RMAppImpl to handle ATTEMPT_KILLED event at ACCEPTED state on app
recovery. Contributed by Rohith Sharmaks

------------------------------------------
[...truncated 7979 lines...]
Running org.apache.hadoop.yarn.server.resourcemanager.recovery.TestZKRMStateStore
Tests run: 2, Failures: 0, Errors: 0, Skipped: 0, Time elapsed: 8.146 sec - in org.apache.hadoop.yarn.server.resourcemanager.recovery.TestZKRMStateStore
Running org.apache.hadoop.yarn.server.resourcemanager.recovery.TestFSRMStateStore
Tests run: 2, Failures: 0, Errors: 0, Skipped: 0, Time elapsed: 15.97 sec - in org.apache.hadoop.yarn.server.resourcemanager.recovery.TestFSRMStateStore
Running org.apache.hadoop.yarn.server.resourcemanager.scheduler.TestSchedulerUtils
Tests run: 8, Failures: 0, Errors: 0, Skipped: 0, Time elapsed: 5.247 sec - in org.apache.hadoop.yarn.server.resourcemanager.scheduler.TestSchedulerUtils
Running org.apache.hadoop.yarn.server.resourcemanager.scheduler.TestQueueMetrics
Tests run: 7, Failures: 0, Errors: 0, Skipped: 0, Time elapsed: 2.65 sec - in org.apache.hadoop.yarn.server.resourcemanager.scheduler.TestQueueMetrics
Running org.apache.hadoop.yarn.server.resourcemanager.scheduler.fifo.TestFifoScheduler
Tests run: 7, Failures: 0, Errors: 0, Skipped: 0, Time elapsed: 2.442 sec - in org.apache.hadoop.yarn.server.resourcemanager.scheduler.fifo.TestFifoScheduler
Running org.apache.hadoop.yarn.server.resourcemanager.scheduler.TestSchedulerApplicationAttempt
Tests run: 1, Failures: 0, Errors: 0, Skipped: 0, Time elapsed: 0.857 sec - in org.apache.hadoop.yarn.server.resourcemanager.scheduler.TestSchedulerApplicationAttempt
Running org.apache.hadoop.yarn.server.resourcemanager.scheduler.fair.TestComputeFairShares
Tests run: 9, Failures: 0, Errors: 0, Skipped: 0, Time elapsed: 0.452 sec - in org.apache.hadoop.yarn.server.resourcemanager.scheduler.fair.TestComputeFairShares
Running org.apache.hadoop.yarn.server.resourcemanager.scheduler.fair.TestFairSchedulerConfiguration
Tests run: 5, Failures: 0, Errors: 0, Skipped: 0, Time elapsed: 0.439 sec - in org.apache.hadoop.yarn.server.resourcemanager.scheduler.fair.TestFairSchedulerConfiguration
Running org.apache.hadoop.yarn.server.resourcemanager.scheduler.fair.TestQueuePlacementPolicy
Tests run: 14, Failures: 0, Errors: 0, Skipped: 0, Time elapsed: 0.562 sec - in org.apache.hadoop.yarn.server.resourcemanager.scheduler.fair.TestQueuePlacementPolicy
Running org.apache.hadoop.yarn.server.resourcemanager.scheduler.fair.TestQueueManager
Tests run: 2, Failures: 0, Errors: 0, Skipped: 0, Time elapsed: 1.041 sec - in org.apache.hadoop.yarn.server.resourcemanager.scheduler.fair.TestQueueManager
Running org.apache.hadoop.yarn.server.resourcemanager.scheduler.fair.TestFairSchedulerQueueACLs
Tests run: 1, Failures: 0, Errors: 0, Skipped: 0, Time elapsed: 54.022 sec - in org.apache.hadoop.yarn.server.resourcemanager.scheduler.fair.TestFairSchedulerQueueACLs
Running org.apache.hadoop.yarn.server.resourcemanager.scheduler.fair.TestSchedulingPolicy
Tests run: 2, Failures: 0, Errors: 0, Skipped: 0, Time elapsed: 0.578 sec - in org.apache.hadoop.yarn.server.resourcemanager.scheduler.fair.TestSchedulingPolicy
Running org.apache.hadoop.yarn.server.resourcemanager.scheduler.fair.TestFSLeafQueue
Tests run: 3, Failures: 0, Errors: 0, Skipped: 0, Time elapsed: 2.346 sec - in org.apache.hadoop.yarn.server.resourcemanager.scheduler.fair.TestFSLeafQueue
Running org.apache.hadoop.yarn.server.resourcemanager.scheduler.fair.TestFairSchedulerFairShare
Tests run: 6, Failures: 0, Errors: 0, Skipped: 0, Time elapsed: 3.439 sec - in org.apache.hadoop.yarn.server.resourcemanager.scheduler.fair.TestFairSchedulerFairShare
Running org.apache.hadoop.yarn.server.resourcemanager.scheduler.fair.TestFSAppAttempt
Tests run: 4, Failures: 0, Errors: 0, Skipped: 0, Time elapsed: 2.022 sec - in org.apache.hadoop.yarn.server.resourcemanager.scheduler.fair.TestFSAppAttempt
Running org.apache.hadoop.yarn.server.resourcemanager.scheduler.fair.TestFairScheduler
Tests run: 79, Failures: 0, Errors: 0, Skipped: 0, Time elapsed: 8.623 sec - in org.apache.hadoop.yarn.server.resourcemanager.scheduler.fair.TestFairScheduler
Running org.apache.hadoop.yarn.server.resourcemanager.scheduler.fair.policies.TestEmptyQueues
Tests run: 3, Failures: 0, Errors: 0, Skipped: 0, Time elapsed: 0.453 sec - in org.apache.hadoop.yarn.server.resourcemanager.scheduler.fair.policies.TestEmptyQueues
Running org.apache.hadoop.yarn.server.resourcemanager.scheduler.fair.policies.TestDominantResourceFairnessPolicy
Tests run: 9, Failures: 0, Errors: 0, Skipped: 0, Time elapsed: 0.456 sec - in org.apache.hadoop.yarn.server.resourcemanager.scheduler.fair.policies.TestDominantResourceFairnessPolicy
Running org.apache.hadoop.yarn.server.resourcemanager.scheduler.fair.TestMaxRunningAppsEnforcer
Tests run: 6, Failures: 0, Errors: 0, Skipped: 0, Time elapsed: 1.314 sec - in org.apache.hadoop.yarn.server.resourcemanager.scheduler.fair.TestMaxRunningAppsEnforcer
Running org.apache.hadoop.yarn.server.resourcemanager.scheduler.fair.TestFairSchedulerEventLog
Tests run: 1, Failures: 0, Errors: 0, Skipped: 0, Time elapsed: 1.453 sec - in org.apache.hadoop.yarn.server.resourcemanager.scheduler.fair.TestFairSchedulerEventLog
Running org.apache.hadoop.yarn.server.resourcemanager.scheduler.fair.TestFairSchedulerPreemption
Tests run: 1, Failures: 0, Errors: 0, Skipped: 0, Time elapsed: 2.281 sec - in org.apache.hadoop.yarn.server.resourcemanager.scheduler.fair.TestFairSchedulerPreemption
Running org.apache.hadoop.yarn.server.resourcemanager.scheduler.fair.TestAllocationFileLoaderService
Tests run: 6, Failures: 0, Errors: 0, Skipped: 0, Time elapsed: 0.75 sec - in org.apache.hadoop.yarn.server.resourcemanager.scheduler.fair.TestAllocationFileLoaderService
Running org.apache.hadoop.yarn.server.resourcemanager.scheduler.capacity.TestQueueMappings
Tests run: 1, Failures: 0, Errors: 0, Skipped: 0, Time elapsed: 10.371 sec - in org.apache.hadoop.yarn.server.resourcemanager.scheduler.capacity.TestQueueMappings
Running org.apache.hadoop.yarn.server.resourcemanager.scheduler.capacity.TestReservationQueue
Tests run: 1, Failures: 0, Errors: 0, Skipped: 0, Time elapsed: 1.377 sec - in org.apache.hadoop.yarn.server.resourcemanager.scheduler.capacity.TestReservationQueue
Running org.apache.hadoop.yarn.server.resourcemanager.scheduler.capacity.TestReservations
Tests run: 9, Failures: 0, Errors: 0, Skipped: 0, Time elapsed: 3.63 sec - in org.apache.hadoop.yarn.server.resourcemanager.scheduler.capacity.TestReservations
Running org.apache.hadoop.yarn.server.resourcemanager.scheduler.capacity.TestParentQueue
Tests run: 9, Failures: 0, Errors: 0, Skipped: 0, Time elapsed: 3.756 sec - in org.apache.hadoop.yarn.server.resourcemanager.scheduler.capacity.TestParentQueue
Running org.apache.hadoop.yarn.server.resourcemanager.scheduler.capacity.TestCapacitySchedulerDynamicBehavior
Tests run: 4, Failures: 0, Errors: 0, Skipped: 0, Time elapsed: 8.367 sec - in org.apache.hadoop.yarn.server.resourcemanager.scheduler.capacity.TestCapacitySchedulerDynamicBehavior
Running org.apache.hadoop.yarn.server.resourcemanager.scheduler.capacity.TestChildQueueOrder
Tests run: 1, Failures: 0, Errors: 0, Skipped: 0, Time elapsed: 2.344 sec - in org.apache.hadoop.yarn.server.resourcemanager.scheduler.capacity.TestChildQueueOrder
Running org.apache.hadoop.yarn.server.resourcemanager.scheduler.capacity.TestCapacityScheduler
Tests run: 30, Failures: 0, Errors: 0, Skipped: 0, Time elapsed: 67.119 sec - in org.apache.hadoop.yarn.server.resourcemanager.scheduler.capacity.TestCapacityScheduler
Running org.apache.hadoop.yarn.server.resourcemanager.scheduler.capacity.TestLeafQueue
Tests run: 23, Failures: 0, Errors: 0, Skipped: 0, Time elapsed: 8.262 sec - in org.apache.hadoop.yarn.server.resourcemanager.scheduler.capacity.TestLeafQueue
Running org.apache.hadoop.yarn.server.resourcemanager.scheduler.capacity.TestCapacitySchedulerQueueACLs
Tests run: 1, Failures: 0, Errors: 0, Skipped: 0, Time elapsed: 53.94 sec - in org.apache.hadoop.yarn.server.resourcemanager.scheduler.capacity.TestCapacitySchedulerQueueACLs
Running org.apache.hadoop.yarn.server.resourcemanager.scheduler.capacity.TestQueueParsing
Tests run: 10, Failures: 0, Errors: 0, Skipped: 0, Time elapsed: 2.266 sec - in org.apache.hadoop.yarn.server.resourcemanager.scheduler.capacity.TestQueueParsing
Running org.apache.hadoop.yarn.server.resourcemanager.scheduler.capacity.TestContainerAllocation
Tests run: 9, Failures: 0, Errors: 0, Skipped: 0, Time elapsed: 234.86 sec - in org.apache.hadoop.yarn.server.resourcemanager.scheduler.capacity.TestContainerAllocation
Running org.apache.hadoop.yarn.server.resourcemanager.scheduler.capacity.TestCSQueueUtils
Tests run: 3, Failures: 0, Errors: 0, Skipped: 0, Time elapsed: 1.688 sec - in org.apache.hadoop.yarn.server.resourcemanager.scheduler.capacity.TestCSQueueUtils
Running org.apache.hadoop.yarn.server.resourcemanager.scheduler.capacity.TestApplicationLimits
Tests run: 4, Failures: 0, Errors: 0, Skipped: 0, Time elapsed: 2.405 sec - in org.apache.hadoop.yarn.server.resourcemanager.scheduler.capacity.TestApplicationLimits
Running org.apache.hadoop.yarn.server.resourcemanager.TestMoveApplication
Tests run: 4, Failures: 0, Errors: 0, Skipped: 0, Time elapsed: 6.361 sec - in org.apache.hadoop.yarn.server.resourcemanager.TestMoveApplication
Running org.apache.hadoop.yarn.server.resourcemanager.metrics.TestSystemMetricsPublisher
Tests run: 3, Failures: 0, Errors: 0, Skipped: 0, Time elapsed: 5.179 sec - in org.apache.hadoop.yarn.server.resourcemanager.metrics.TestSystemMetricsPublisher
Running org.apache.hadoop.yarn.server.resourcemanager.TestRMAuditLogger
Tests run: 3, Failures: 0, Errors: 0, Skipped: 0, Time elapsed: 1.04 sec - in org.apache.hadoop.yarn.server.resourcemanager.TestRMAuditLogger
Running org.apache.hadoop.yarn.server.resourcemanager.TestRMNodeTransitions
Tests run: 17, Failures: 0, Errors: 0, Skipped: 0, Time elapsed: 1.549 sec - in org.apache.hadoop.yarn.server.resourcemanager.TestRMNodeTransitions
Running org.apache.hadoop.yarn.server.resourcemanager.TestAppManager
Tests run: 12, Failures: 0, Errors: 0, Skipped: 0, Time elapsed: 6.057 sec - in org.apache.hadoop.yarn.server.resourcemanager.TestAppManager
Running org.apache.hadoop.yarn.server.resourcemanager.TestClientRMService
Tests run: 23, Failures: 0, Errors: 0, Skipped: 0, Time elapsed: 11.194 sec - in org.apache.hadoop.yarn.server.resourcemanager.TestClientRMService
Running org.apache.hadoop.yarn.server.resourcemanager.TestRM
Tests run: 22, Failures: 0, Errors: 0, Skipped: 0, Time elapsed: 163.082 sec - in org.apache.hadoop.yarn.server.resourcemanager.TestRM
Running org.apache.hadoop.yarn.server.resourcemanager.TestApplicationMasterLauncher
Tests run: 2, Failures: 0, Errors: 0, Skipped: 0, Time elapsed: 10.95 sec - in org.apache.hadoop.yarn.server.resourcemanager.TestApplicationMasterLauncher
Running org.apache.hadoop.yarn.server.resourcemanager.TestApplicationACLs
Tests run: 1, Failures: 0, Errors: 0, Skipped: 0, Time elapsed: 21.945 sec - in org.apache.hadoop.yarn.server.resourcemanager.TestApplicationACLs
Running org.apache.hadoop.yarn.server.resourcemanager.TestApplicationMasterService
Tests run: 5, Failures: 0, Errors: 0, Skipped: 0, Time elapsed: 42.018 sec - in org.apache.hadoop.yarn.server.resourcemanager.TestApplicationMasterService
Running org.apache.hadoop.yarn.server.resourcemanager.TestResourceTrackerService
Tests run: 14, Failures: 0, Errors: 0, Skipped: 0, Time elapsed: 8.975 sec - in org.apache.hadoop.yarn.server.resourcemanager.TestResourceTrackerService
Running org.apache.hadoop.yarn.server.resourcemanager.TestClientRMTokens
Tests run: 6, Failures: 0, Errors: 0, Skipped: 0, Time elapsed: 17.732 sec - in org.apache.hadoop.yarn.server.resourcemanager.TestClientRMTokens
Running org.apache.hadoop.yarn.server.resourcemanager.TestRMProxyUsersConf
Tests run: 3, Failures: 0, Errors: 0, Skipped: 0, Time elapsed: 31.902 sec - in org.apache.hadoop.yarn.server.resourcemanager.TestRMProxyUsersConf
Running org.apache.hadoop.yarn.server.resourcemanager.resource.TestResourceWeights
Tests run: 1, Failures: 0, Errors: 0, Skipped: 0, Time elapsed: 0.064 sec - in org.apache.hadoop.yarn.server.resourcemanager.resource.TestResourceWeights
Running org.apache.hadoop.yarn.server.resourcemanager.resource.TestResources
Tests run: 2, Failures: 0, Errors: 0, Skipped: 0, Time elapsed: 0.444 sec - in org.apache.hadoop.yarn.server.resourcemanager.resource.TestResources
Running org.apache.hadoop.yarn.server.resourcemanager.TestKillApplicationWithRMHA
Tests run: 4, Failures: 0, Errors: 0, Skipped: 0, Time elapsed: 25.956 sec - in org.apache.hadoop.yarn.server.resourcemanager.TestKillApplicationWithRMHA
Running org.apache.hadoop.yarn.server.resourcemanager.TestRMEmbeddedElector
Tests run: 1, Failures: 0, Errors: 0, Skipped: 0, Time elapsed: 2.908 sec - in org.apache.hadoop.yarn.server.resourcemanager.TestRMEmbeddedElector
Running org.apache.hadoop.yarn.server.resourcemanager.TestApplicationCleanup
Tests run: 6, Failures: 0, Errors: 0, Skipped: 0, Time elapsed: 44.249 sec - in org.apache.hadoop.yarn.server.resourcemanager.TestApplicationCleanup
Running org.apache.hadoop.yarn.server.resourcemanager.TestRMAdminService
Tests run: 15, Failures: 0, Errors: 0, Skipped: 0, Time elapsed: 9.258 sec - in org.apache.hadoop.yarn.server.resourcemanager.TestRMAdminService
Running org.apache.hadoop.yarn.server.resourcemanager.reservation.TestInMemoryPlan
Tests run: 8, Failures: 0, Errors: 0, Skipped: 0, Time elapsed: 0.704 sec - in org.apache.hadoop.yarn.server.resourcemanager.reservation.TestInMemoryPlan
Running org.apache.hadoop.yarn.server.resourcemanager.reservation.TestSimpleCapacityReplanner
Tests run: 1, Failures: 0, Errors: 0, Skipped: 0, Time elapsed: 0.729 sec - in org.apache.hadoop.yarn.server.resourcemanager.reservation.TestSimpleCapacityReplanner
Running org.apache.hadoop.yarn.server.resourcemanager.reservation.TestCapacityReservationSystem
Tests run: 2, Failures: 0, Errors: 0, Skipped: 0, Time elapsed: 1.818 sec - in org.apache.hadoop.yarn.server.resourcemanager.reservation.TestCapacityReservationSystem
Running org.apache.hadoop.yarn.server.resourcemanager.reservation.TestInMemoryReservationAllocation
Tests run: 5, Failures: 0, Errors: 0, Skipped: 0, Time elapsed: 0.484 sec - in org.apache.hadoop.yarn.server.resourcemanager.reservation.TestInMemoryReservationAllocation
Running org.apache.hadoop.yarn.server.resourcemanager.reservation.TestNoOverCommitPolicy
Tests run: 6, Failures: 0, Errors: 0, Skipped: 0, Time elapsed: 2.733 sec - in org.apache.hadoop.yarn.server.resourcemanager.reservation.TestNoOverCommitPolicy
Running org.apache.hadoop.yarn.server.resourcemanager.reservation.TestReservationInputValidator
Tests run: 23, Failures: 0, Errors: 0, Skipped: 0, Time elapsed: 0.761 sec - in org.apache.hadoop.yarn.server.resourcemanager.reservation.TestReservationInputValidator
Running org.apache.hadoop.yarn.server.resourcemanager.reservation.TestCapacityOverTimePolicy
Tests run: 8, Failures: 0, Errors: 0, Skipped: 0, Time elapsed: 5.015 sec - in org.apache.hadoop.yarn.server.resourcemanager.reservation.TestCapacityOverTimePolicy
Running org.apache.hadoop.yarn.server.resourcemanager.reservation.TestCapacitySchedulerPlanFollower
Tests run: 2, Failures: 0, Errors: 0, Skipped: 0, Time elapsed: 2.116 sec - in org.apache.hadoop.yarn.server.resourcemanager.reservation.TestCapacitySchedulerPlanFollower
Running org.apache.hadoop.yarn.server.resourcemanager.reservation.TestRLESparseResourceAllocation
Tests run: 4, Failures: 0, Errors: 0, Skipped: 0, Time elapsed: 0.462 sec - in org.apache.hadoop.yarn.server.resourcemanager.reservation.TestRLESparseResourceAllocation
Running org.apache.hadoop.yarn.server.resourcemanager.reservation.TestGreedyReservationAgent
Tests run: 9, Failures: 0, Errors: 0, Skipped: 0, Time elapsed: 2.76 sec - in org.apache.hadoop.yarn.server.resourcemanager.reservation.TestGreedyReservationAgent
Running org.apache.hadoop.yarn.server.resourcemanager.webapp.TestRMWebServicesDelegationTokens
Tests run: 6, Failures: 0, Errors: 0, Skipped: 0, Time elapsed: 45.202 sec - in org.apache.hadoop.yarn.server.resourcemanager.webapp.TestRMWebServicesDelegationTokens
Running org.apache.hadoop.yarn.server.resourcemanager.webapp.TestRMWebServices
Tests run: 18, Failures: 0, Errors: 0, Skipped: 0, Time elapsed: 10.592 sec - in org.apache.hadoop.yarn.server.resourcemanager.webapp.TestRMWebServices
Running org.apache.hadoop.yarn.server.resourcemanager.webapp.TestRMWebappAuthentication
Tests run: 2, Failures: 0, Errors: 0, Skipped: 0, Time elapsed: 9.864 sec - in org.apache.hadoop.yarn.server.resourcemanager.webapp.TestRMWebappAuthentication
Running org.apache.hadoop.yarn.server.resourcemanager.webapp.TestRMWebServicesFairScheduler
Tests run: 2, Failures: 0, Errors: 0, Skipped: 0, Time elapsed: 3.986 sec - in org.apache.hadoop.yarn.server.resourcemanager.webapp.TestRMWebServicesFairScheduler
Running org.apache.hadoop.yarn.server.resourcemanager.webapp.TestRMWebServicesApps
Tests run: 40, Failures: 0, Errors: 0, Skipped: 0, Time elapsed: 173.163 sec - in org.apache.hadoop.yarn.server.resourcemanager.webapp.TestRMWebServicesApps
Running org.apache.hadoop.yarn.server.resourcemanager.webapp.TestNodesPage
Tests run: 2, Failures: 0, Errors: 0, Skipped: 0, Time elapsed: 4.114 sec - in org.apache.hadoop.yarn.server.resourcemanager.webapp.TestNodesPage
Running org.apache.hadoop.yarn.server.resourcemanager.webapp.TestRMWebServicesHttpStaticUserPermissions
Tests run: 1, Failures: 0, Errors: 0, Skipped: 0, Time elapsed: 8.099 sec - in org.apache.hadoop.yarn.server.resourcemanager.webapp.TestRMWebServicesHttpStaticUserPermissions
Running org.apache.hadoop.yarn.server.resourcemanager.webapp.TestRMWebServicesNodes
Tests run: 22, Failures: 0, Errors: 0, Skipped: 0, Time elapsed: 12.661 sec - in org.apache.hadoop.yarn.server.resourcemanager.webapp.TestRMWebServicesNodes
Running org.apache.hadoop.yarn.server.resourcemanager.webapp.TestRMWebServicesNodeLabels
Tests run: 1, Failures: 0, Errors: 0, Skipped: 0, Time elapsed: 3.739 sec - in org.apache.hadoop.yarn.server.resourcemanager.webapp.TestRMWebServicesNodeLabels
Running org.apache.hadoop.yarn.server.resourcemanager.webapp.TestRMWebAppFairScheduler
Tests run: 2, Failures: 0, Errors: 0, Skipped: 0, Time elapsed: 5.658 sec - in org.apache.hadoop.yarn.server.resourcemanager.webapp.TestRMWebAppFairScheduler
Running org.apache.hadoop.yarn.server.resourcemanager.webapp.TestRMWebApp
Tests run: 3, Failures: 0, Errors: 0, Skipped: 0, Time elapsed: 10.808 sec - in org.apache.hadoop.yarn.server.resourcemanager.webapp.TestRMWebApp
Running org.apache.hadoop.yarn.server.resourcemanager.webapp.TestRMWebServicesDelegationTokenAuthentication
Tests run: 8, Failures: 0, Errors: 0, Skipped: 0, Time elapsed: 9.928 sec - in org.apache.hadoop.yarn.server.resourcemanager.webapp.TestRMWebServicesDelegationTokenAuthentication
Running org.apache.hadoop.yarn.server.resourcemanager.webapp.TestRMWebServicesAppsModification
Tests run: 32, Failures: 0, Errors: 2, Skipped: 0, Time elapsed: 151.14 sec <<< FAILURE!
- in org.apache.hadoop.yarn.server.resourcemanager.webapp.TestRMWebServicesAppsModification
testGetNewApplicationAndSubmit[1](org.apache.hadoop.yarn.server.resourcemanager.webapp.TestRMWebServicesAppsModification)
 Time elapsed: 0.276 sec  <<< ERROR!
java.lang.NoClassDefFoundError: org/apache/hadoop/io/FastByteComparisons
	at java.net.URLClassLoader$1.run(URLClassLoader.java:202)
	at java.security.AccessController.doPrivileged(Native Method)
	at java.net.URLClassLoader.findClass(URLClassLoader.java:190)
	at java.lang.ClassLoader.loadClass(ClassLoader.java:306)
	at sun.misc.Launcher$AppClassLoader.loadClass(Launcher.java:301)
	at java.lang.ClassLoader.loadClass(ClassLoader.java:247)
	at org.apache.hadoop.io.WritableComparator.compareBytes(WritableComparator.java:187)
	at org.apache.hadoop.io.BinaryComparable.compareTo(BinaryComparable.java:50)
	at org.apache.hadoop.io.BinaryComparable.equals(BinaryComparable.java:72)
	at org.apache.hadoop.io.Text.equals(Text.java:348)
	at java.util.ArrayList.indexOf(ArrayList.java:216)
	at java.util.ArrayList.contains(ArrayList.java:199)
	at org.apache.hadoop.yarn.server.resourcemanager.webapp.TestRMWebServicesAppsModification.testAppSubmit(TestRMWebServicesAppsModification.java:844)
	at org.apache.hadoop.yarn.server.resourcemanager.webapp.TestRMWebServicesAppsModification.testGetNewApplicationAndSubmit(TestRMWebServicesAppsModification.java:726)

testGetNewApplicationAndSubmit[3](org.apache.hadoop.yarn.server.resourcemanager.webapp.TestRMWebServicesAppsModification)
 Time elapsed: 0.225 sec  <<< ERROR!
java.lang.NoClassDefFoundError: org/apache/hadoop/io/FastByteComparisons
	at org.apache.hadoop.io.WritableComparator.compareBytes(WritableComparator.java:187)
	at org.apache.hadoop.io.BinaryComparable.compareTo(BinaryComparable.java:50)
	at org.apache.hadoop.io.BinaryComparable.equals(BinaryComparable.java:72)
	at org.apache.hadoop.io.Text.equals(Text.java:348)
	at java.util.ArrayList.indexOf(ArrayList.java:216)
	at java.util.ArrayList.contains(ArrayList.java:199)
	at org.apache.hadoop.yarn.server.resourcemanager.webapp.TestRMWebServicesAppsModification.testAppSubmit(TestRMWebServicesAppsModification.java:844)
	at org.apache.hadoop.yarn.server.resourcemanager.webapp.TestRMWebServicesAppsModification.testGetNewApplicationAndSubmit(TestRMWebServicesAppsModification.java:726)

Running org.apache.hadoop.yarn.server.resourcemanager.webapp.TestRMWebServicesCapacitySched
Tests run: 7, Failures: 0, Errors: 0, Skipped: 0, Time elapsed: 14.758 sec - in org.apache.hadoop.yarn.server.resourcemanager.webapp.TestRMWebServicesCapacitySched

Results :

Tests in error: 
  TestRMWebServicesAppsModification.testGetNewApplicationAndSubmit:726->testAppSubmit:844
» NoClassDefFound
  TestRMWebServicesAppsModification.testGetNewApplicationAndSubmit:726->testAppSubmit:844
» NoClassDefFound

Tests run: 947, Failures: 0, Errors: 2, Skipped: 1

[INFO] ------------------------------------------------------------------------
[INFO] Reactor Summary:
[INFO] 
[INFO] hadoop-yarn ....................................... SUCCESS [  3.081 s]
[INFO] hadoop-yarn-api ................................... SUCCESS [02:48 min]
[INFO] hadoop-yarn-common ................................ SUCCESS [02:25 min]
[INFO] hadoop-yarn-server ................................ SUCCESS [  0.080 s]
[INFO] hadoop-yarn-server-common ......................... SUCCESS [ 37.374 s]
[INFO] hadoop-yarn-server-nodemanager .................... SUCCESS [05:57 min]
[INFO] hadoop-yarn-server-web-proxy ...................... SUCCESS [ 24.089 s]
[INFO] hadoop-yarn-server-applicationhistoryservice ...... SUCCESS [02:48 min]
[INFO] hadoop-yarn-server-resourcemanager ................ FAILURE [45:37 min]
[INFO] hadoop-yarn-server-tests .......................... SKIPPED
[INFO] hadoop-yarn-client ................................ SKIPPED
[INFO] hadoop-yarn-server-sharedcachemanager ............. SKIPPED
[INFO] hadoop-yarn-applications .......................... SKIPPED
[INFO] hadoop-yarn-applications-distributedshell ......... SKIPPED
[INFO] hadoop-yarn-applications-unmanaged-am-launcher .... SKIPPED
[INFO] hadoop-yarn-site .................................. SKIPPED
[INFO] hadoop-yarn-registry .............................. SKIPPED
[INFO] hadoop-yarn-project ............................... SKIPPED
[INFO] ------------------------------------------------------------------------
[INFO] BUILD FAILURE
[INFO] ------------------------------------------------------------------------
[INFO] Total time: 01:00 h
[INFO] Finished at: 2014-11-14T11:32:48+00:00
[INFO] Final Memory: 75M/701M
[INFO] ------------------------------------------------------------------------
[ERROR] Failed to execute goal org.apache.maven.plugins:maven-surefire-plugin:2.16:test (default-test)
on project hadoop-yarn-server-resourcemanager: There are test failures.
[ERROR] 
[ERROR] Please refer to <https://builds.apache.org/job/Hadoop-Yarn-trunk-Java8/ws/hadoop-yarn-project/hadoop-yarn/hadoop-yarn-server/hadoop-yarn-server-resourcemanager/target/surefire-reports>
for the individual test results.
[ERROR] -> [Help 1]
[ERROR] 
[ERROR] To see the full stack trace of the errors, re-run Maven with the -e switch.
[ERROR] Re-run Maven using the -X switch to enable full debug logging.
[ERROR] 
[ERROR] For more information about the errors and possible solutions, please read the following
articles:
[ERROR] [Help 1] http://cwiki.apache.org/confluence/display/MAVEN/MojoFailureException
[ERROR] 
[ERROR] After correcting the problems, you can resume the build with the command
[ERROR]   mvn <goals> -rf :hadoop-yarn-server-resourcemanager
Build step 'Execute shell' marked build as failure
Archiving artifacts
Updating MAPREDUCE-6156
Updating YARN-2846
Updating YARN-2856
Updating YARN-2635
Updating HDFS-7385
Updating HADOOP-11150
Updating HDFS-7395
Updating YARN-2603
Updating HADOOP-8989
Updating HADOOP-11298
Updating HDFS-7358
Updating YARN-2853
Updating YARN-2766

Mime
View raw message