hadoop-yarn-dev mailing list archives

Site index · List index
Message view « Date » · « Thread »
Top « Date » · « Thread »
From Apache Jenkins Server <jenk...@builds.apache.org>
Subject Build failed in Jenkins: Hadoop-Yarn-trunk #713
Date Thu, 16 Oct 2014 11:39:49 GMT
See <https://builds.apache.org/job/Hadoop-Yarn-trunk/713/changes>

Changes:

[jlowe] MAPREDUCE-5873. Shuffle bandwidth computation includes time spent waiting for maps.
Contributed by Siqi Li

[jing9] HDFS-7185. The active NameNode will not accept an fsimage sent from the standby during
rolling upgrade. Contributed by Jing Zhao.

[jlowe] MAPREDUCE-5970. Provide a boolean switch to enable MR-AM profiling. Contributed by
Gera Shegalov

[jianhe] YARN-2312. Deprecated old ContainerId#getId API and updated MapReduce to use ContainerId#getContainerId
instead. Contributed by Tsuyoshi OZAWA

[raviprak] HADOOP-11181. GraphiteSink emits wrong timestamps (Sascha Coenen via raviprak)

[vinodkv] YARN-2496. Enhanced Capacity Scheduler to have basic support for allocating resources
based on node-labels. Contributed by Wangda Tan.

[vinodkv] YARN-2685. Fixed a bug in CommonNodeLabelsManager that caused wrong resource tracking
per label when a host runs multiple node-managers. Contributed by Wangda Tan.

[szetszwo] HDFS-7208. NN doesn't schedule replication when a DN storage fails.  Contributed
by Ming Ma

[szetszwo] HDFS-5089. When a LayoutVersion support SNAPSHOT, it must support FSIMAGE_NAME_OPTIMIZATION.

------------------------------------------
[...truncated 8964 lines...]
[INFO] ------------------------------------------------------------------------
[WARNING] The POM for org.eclipse.m2e:lifecycle-mapping:jar:1.0.0 is missing, no dependency
information available
[WARNING] Failed to retrieve plugin descriptor for org.eclipse.m2e:lifecycle-mapping:1.0.0:
Plugin org.eclipse.m2e:lifecycle-mapping:1.0.0 or one of its dependencies could not be resolved:
Failure to find org.eclipse.m2e:lifecycle-mapping:jar:1.0.0 in http://repo.maven.apache.org/maven2
was cached in the local repository, resolution will not be reattempted until the update interval
of central has elapsed or updates are forced
[INFO] 
[INFO] --- maven-clean-plugin:2.4.1:clean (default-clean) @ hadoop-yarn-server-tests ---
[INFO] Deleting <https://builds.apache.org/job/Hadoop-Yarn-trunk/ws/hadoop-yarn-project/hadoop-yarn/hadoop-yarn-server/hadoop-yarn-server-tests/target>
[INFO] 
[INFO] --- maven-antrun-plugin:1.7:run (create-testdirs) @ hadoop-yarn-server-tests ---
[INFO] Executing tasks

main:
    [mkdir] Created dir: <https://builds.apache.org/job/Hadoop-Yarn-trunk/ws/hadoop-yarn-project/hadoop-yarn/hadoop-yarn-server/hadoop-yarn-server-tests/target/test-dir>
[INFO] Executed tasks
[INFO] 
[INFO] --- hadoop-maven-plugins:3.0.0-SNAPSHOT:protoc (compile-protoc) @ hadoop-yarn-server-tests
---
[INFO] 
[INFO] --- maven-resources-plugin:2.2:resources (default-resources) @ hadoop-yarn-server-tests
---
[INFO] Using default encoding to copy filtered resources.
[INFO] 
[INFO] --- maven-compiler-plugin:2.5.1:compile (default-compile) @ hadoop-yarn-server-tests
---
[INFO] Compiling 1 source file to <https://builds.apache.org/job/Hadoop-Yarn-trunk/ws/hadoop-yarn-project/hadoop-yarn/hadoop-yarn-server/hadoop-yarn-server-tests/target/classes>
[INFO] 
[INFO] --- maven-resources-plugin:2.2:testResources (default-testResources) @ hadoop-yarn-server-tests
---
[INFO] Using default encoding to copy filtered resources.
[INFO] 
[INFO] --- maven-compiler-plugin:2.5.1:testCompile (default-testCompile) @ hadoop-yarn-server-tests
---
[INFO] Compiling 7 source files to <https://builds.apache.org/job/Hadoop-Yarn-trunk/ws/hadoop-yarn-project/hadoop-yarn/hadoop-yarn-server/hadoop-yarn-server-tests/target/test-classes>
[INFO] 
[INFO] --- maven-jar-plugin:2.3.1:test-jar (default) @ hadoop-yarn-server-tests ---
[INFO] Building jar: <https://builds.apache.org/job/Hadoop-Yarn-trunk/ws/hadoop-yarn-project/hadoop-yarn/hadoop-yarn-server/hadoop-yarn-server-tests/target/hadoop-yarn-server-tests-3.0.0-SNAPSHOT-tests.jar>
[INFO] 
[INFO] --- maven-surefire-plugin:2.16:test (default-test) @ hadoop-yarn-server-tests ---
[INFO] Surefire report directory: <https://builds.apache.org/job/Hadoop-Yarn-trunk/ws/hadoop-yarn-project/hadoop-yarn/hadoop-yarn-server/hadoop-yarn-server-tests/target/surefire-reports>

-------------------------------------------------------
 T E S T S
-------------------------------------------------------

-------------------------------------------------------
 T E S T S
-------------------------------------------------------
Running org.apache.hadoop.yarn.server.TestDiskFailures
Tests run: 3, Failures: 0, Errors: 0, Skipped: 0, Time elapsed: 17.76 sec - in org.apache.hadoop.yarn.server.TestDiskFailures
Running org.apache.hadoop.yarn.server.TestContainerManagerSecurity
Tests run: 4, Failures: 0, Errors: 0, Skipped: 0, Time elapsed: 88.253 sec - in org.apache.hadoop.yarn.server.TestContainerManagerSecurity
Running org.apache.hadoop.yarn.server.TestRMNMSecretKeys
Tests run: 1, Failures: 0, Errors: 0, Skipped: 0, Time elapsed: 2.199 sec - in org.apache.hadoop.yarn.server.TestRMNMSecretKeys
Running org.apache.hadoop.yarn.server.TestMiniYARNClusterForHA
Tests run: 1, Failures: 0, Errors: 0, Skipped: 0, Time elapsed: 6.124 sec - in org.apache.hadoop.yarn.server.TestMiniYARNClusterForHA

Results :

Tests run: 9, Failures: 0, Errors: 0, Skipped: 0

[INFO] 
[INFO] --- maven-jar-plugin:2.3.1:jar (default-jar) @ hadoop-yarn-server-tests ---
[INFO] Building jar: <https://builds.apache.org/job/Hadoop-Yarn-trunk/ws/hadoop-yarn-project/hadoop-yarn/hadoop-yarn-server/hadoop-yarn-server-tests/target/hadoop-yarn-server-tests-3.0.0-SNAPSHOT.jar>
[INFO] 
[INFO] --- maven-source-plugin:2.1.2:jar-no-fork (hadoop-java-sources) @ hadoop-yarn-server-tests
---
[INFO] Building jar: <https://builds.apache.org/job/Hadoop-Yarn-trunk/ws/hadoop-yarn-project/hadoop-yarn/hadoop-yarn-server/hadoop-yarn-server-tests/target/hadoop-yarn-server-tests-3.0.0-SNAPSHOT-sources.jar>
[INFO] 
[INFO] --- maven-source-plugin:2.1.2:test-jar-no-fork (hadoop-java-sources) @ hadoop-yarn-server-tests
---
[INFO] Building jar: <https://builds.apache.org/job/Hadoop-Yarn-trunk/ws/hadoop-yarn-project/hadoop-yarn/hadoop-yarn-server/hadoop-yarn-server-tests/target/hadoop-yarn-server-tests-3.0.0-SNAPSHOT-test-sources.jar>
[INFO] 
[INFO] --- maven-enforcer-plugin:1.3.1:enforce (dist-enforce) @ hadoop-yarn-server-tests ---
[INFO] 
[INFO] --- maven-site-plugin:3.3:attach-descriptor (attach-descriptor) @ hadoop-yarn-server-tests
---
[INFO] 
[INFO] --- maven-javadoc-plugin:2.8.1:jar (module-javadocs) @ hadoop-yarn-server-tests ---
[INFO] 
Loading source files for package org.apache.hadoop.yarn.proto...
Constructing Javadoc information...
Standard Doclet version 1.6.0_45
Building tree for all the packages and classes...
Generating <https://builds.apache.org/job/Hadoop-Yarn-trunk/ws/hadoop-yarn-project/hadoop-yarn/hadoop-yarn-server/hadoop-yarn-server-tests/target/org/apache/hadoop/yarn/proto//YarnSecurityTestTokenProtos.html...>
Generating <https://builds.apache.org/job/Hadoop-Yarn-trunk/ws/hadoop-yarn-project/hadoop-yarn/hadoop-yarn-server/hadoop-yarn-server-tests/target/org/apache/hadoop/yarn/proto//YarnSecurityTestTokenProtos.ContainerTokenIdentifierForTestProto.html...>
Generating <https://builds.apache.org/job/Hadoop-Yarn-trunk/ws/hadoop-yarn-project/hadoop-yarn/hadoop-yarn-server/hadoop-yarn-server-tests/target/org/apache/hadoop/yarn/proto//YarnSecurityTestTokenProtos.ContainerTokenIdentifierForTestProto.Builder.html...>
Generating <https://builds.apache.org/job/Hadoop-Yarn-trunk/ws/hadoop-yarn-project/hadoop-yarn/hadoop-yarn-server/hadoop-yarn-server-tests/target/org/apache/hadoop/yarn/proto//YarnSecurityTestTokenProtos.ContainerTokenIdentifierForTestProtoOrBuilder.html...>
Generating <https://builds.apache.org/job/Hadoop-Yarn-trunk/ws/hadoop-yarn-project/hadoop-yarn/hadoop-yarn-server/hadoop-yarn-server-tests/target/org/apache/hadoop/yarn/proto//YarnSecurityTestTokenProtos.NMTokenIdentifierNewProto.html...>
Generating <https://builds.apache.org/job/Hadoop-Yarn-trunk/ws/hadoop-yarn-project/hadoop-yarn/hadoop-yarn-server/hadoop-yarn-server-tests/target/org/apache/hadoop/yarn/proto//YarnSecurityTestTokenProtos.NMTokenIdentifierNewProto.Builder.html...>
Generating <https://builds.apache.org/job/Hadoop-Yarn-trunk/ws/hadoop-yarn-project/hadoop-yarn/hadoop-yarn-server/hadoop-yarn-server-tests/target/org/apache/hadoop/yarn/proto//YarnSecurityTestTokenProtos.NMTokenIdentifierNewProtoOrBuilder.html...>
Generating <https://builds.apache.org/job/Hadoop-Yarn-trunk/ws/hadoop-yarn-project/hadoop-yarn/hadoop-yarn-server/hadoop-yarn-server-tests/target/org/apache/hadoop/yarn/proto//package-frame.html...>
Generating <https://builds.apache.org/job/Hadoop-Yarn-trunk/ws/hadoop-yarn-project/hadoop-yarn/hadoop-yarn-server/hadoop-yarn-server-tests/target/org/apache/hadoop/yarn/proto//package-summary.html...>
Generating <https://builds.apache.org/job/Hadoop-Yarn-trunk/ws/hadoop-yarn-project/hadoop-yarn/hadoop-yarn-server/hadoop-yarn-server-tests/target/org/apache/hadoop/yarn/proto//package-tree.html...>
Generating <https://builds.apache.org/job/Hadoop-Yarn-trunk/ws/hadoop-yarn-project/hadoop-yarn/hadoop-yarn-server/hadoop-yarn-server-tests/target/constant-values.html...>
Generating <https://builds.apache.org/job/Hadoop-Yarn-trunk/ws/hadoop-yarn-project/hadoop-yarn/hadoop-yarn-server/hadoop-yarn-server-tests/target/serialized-form.html...>
Generating <https://builds.apache.org/job/Hadoop-Yarn-trunk/ws/hadoop-yarn-project/hadoop-yarn/hadoop-yarn-server/hadoop-yarn-server-tests/target/org/apache/hadoop/yarn/proto//class-use/YarnSecurityTestTokenProtos.html...>
Generating <https://builds.apache.org/job/Hadoop-Yarn-trunk/ws/hadoop-yarn-project/hadoop-yarn/hadoop-yarn-server/hadoop-yarn-server-tests/target/org/apache/hadoop/yarn/proto//class-use/YarnSecurityTestTokenProtos.NMTokenIdentifierNewProtoOrBuilder.html...>
Generating <https://builds.apache.org/job/Hadoop-Yarn-trunk/ws/hadoop-yarn-project/hadoop-yarn/hadoop-yarn-server/hadoop-yarn-server-tests/target/org/apache/hadoop/yarn/proto//class-use/YarnSecurityTestTokenProtos.NMTokenIdentifierNewProto.html...>
Generating <https://builds.apache.org/job/Hadoop-Yarn-trunk/ws/hadoop-yarn-project/hadoop-yarn/hadoop-yarn-server/hadoop-yarn-server-tests/target/org/apache/hadoop/yarn/proto//class-use/YarnSecurityTestTokenProtos.NMTokenIdentifierNewProto.Builder.html...>
Generating <https://builds.apache.org/job/Hadoop-Yarn-trunk/ws/hadoop-yarn-project/hadoop-yarn/hadoop-yarn-server/hadoop-yarn-server-tests/target/org/apache/hadoop/yarn/proto//class-use/YarnSecurityTestTokenProtos.ContainerTokenIdentifierForTestProtoOrBuilder.html...>
Generating <https://builds.apache.org/job/Hadoop-Yarn-trunk/ws/hadoop-yarn-project/hadoop-yarn/hadoop-yarn-server/hadoop-yarn-server-tests/target/org/apache/hadoop/yarn/proto//class-use/YarnSecurityTestTokenProtos.ContainerTokenIdentifierForTestProto.html...>
Generating <https://builds.apache.org/job/Hadoop-Yarn-trunk/ws/hadoop-yarn-project/hadoop-yarn/hadoop-yarn-server/hadoop-yarn-server-tests/target/org/apache/hadoop/yarn/proto//class-use/YarnSecurityTestTokenProtos.ContainerTokenIdentifierForTestProto.Builder.html...>
Generating <https://builds.apache.org/job/Hadoop-Yarn-trunk/ws/hadoop-yarn-project/hadoop-yarn/hadoop-yarn-server/hadoop-yarn-server-tests/target/org/apache/hadoop/yarn/proto//package-use.html...>
Building index for all the packages and classes...
Generating <https://builds.apache.org/job/Hadoop-Yarn-trunk/ws/hadoop-yarn-project/hadoop-yarn/hadoop-yarn-server/hadoop-yarn-server-tests/target/overview-tree.html...>
Generating <https://builds.apache.org/job/Hadoop-Yarn-trunk/ws/hadoop-yarn-project/hadoop-yarn/hadoop-yarn-server/hadoop-yarn-server-tests/target/index-all.html...>
Generating <https://builds.apache.org/job/Hadoop-Yarn-trunk/ws/hadoop-yarn-project/hadoop-yarn/hadoop-yarn-server/hadoop-yarn-server-tests/target/deprecated-list.html...>
Building index for all classes...
Generating <https://builds.apache.org/job/Hadoop-Yarn-trunk/ws/hadoop-yarn-project/hadoop-yarn/hadoop-yarn-server/hadoop-yarn-server-tests/target/allclasses-frame.html...>
Generating <https://builds.apache.org/job/Hadoop-Yarn-trunk/ws/hadoop-yarn-project/hadoop-yarn/hadoop-yarn-server/hadoop-yarn-server-tests/target/allclasses-noframe.html...>
Generating <https://builds.apache.org/job/Hadoop-Yarn-trunk/ws/hadoop-yarn-project/hadoop-yarn/hadoop-yarn-server/hadoop-yarn-server-tests/target/index.html...>
Generating <https://builds.apache.org/job/Hadoop-Yarn-trunk/ws/hadoop-yarn-project/hadoop-yarn/hadoop-yarn-server/hadoop-yarn-server-tests/target/help-doc.html...>
Generating <https://builds.apache.org/job/Hadoop-Yarn-trunk/ws/hadoop-yarn-project/hadoop-yarn/hadoop-yarn-server/hadoop-yarn-server-tests/target/stylesheet.css...>
[INFO] Building jar: <https://builds.apache.org/job/Hadoop-Yarn-trunk/ws/hadoop-yarn-project/hadoop-yarn/hadoop-yarn-server/hadoop-yarn-server-tests/target/hadoop-yarn-server-tests-3.0.0-SNAPSHOT-javadoc.jar>
[INFO] 
[INFO] --- maven-enforcer-plugin:1.3.1:enforce (depcheck) @ hadoop-yarn-server-tests ---
[INFO] 
[INFO] --- maven-checkstyle-plugin:2.6:checkstyle (default-cli) @ hadoop-yarn-server-tests
---
[INFO] 
[INFO] --- findbugs-maven-plugin:2.3.2:findbugs (default-cli) @ hadoop-yarn-server-tests ---
[INFO] ****** FindBugsMojo execute *******
[INFO] canGenerate is true
[INFO] ****** FindBugsMojo executeFindbugs *******
[INFO] Temp File is <https://builds.apache.org/job/Hadoop-Yarn-trunk/ws/hadoop-yarn-project/hadoop-yarn/hadoop-yarn-server/hadoop-yarn-server-tests/target/findbugsTemp.xml>
[INFO] Fork Value is true
[INFO] xmlOutput is true
[INFO]                                                                         
[INFO] ------------------------------------------------------------------------
[INFO] Building hadoop-yarn-client 3.0.0-SNAPSHOT
[INFO] ------------------------------------------------------------------------
[WARNING] The POM for org.eclipse.m2e:lifecycle-mapping:jar:1.0.0 is missing, no dependency
information available
[WARNING] Failed to retrieve plugin descriptor for org.eclipse.m2e:lifecycle-mapping:1.0.0:
Plugin org.eclipse.m2e:lifecycle-mapping:1.0.0 or one of its dependencies could not be resolved:
Failure to find org.eclipse.m2e:lifecycle-mapping:jar:1.0.0 in http://repo.maven.apache.org/maven2
was cached in the local repository, resolution will not be reattempted until the update interval
of central has elapsed or updates are forced
[INFO] 
[INFO] --- maven-clean-plugin:2.4.1:clean (default-clean) @ hadoop-yarn-client ---
[INFO] Deleting <https://builds.apache.org/job/Hadoop-Yarn-trunk/ws/hadoop-yarn-project/hadoop-yarn/hadoop-yarn-client/target>
[INFO] 
[INFO] --- maven-antrun-plugin:1.7:run (create-testdirs) @ hadoop-yarn-client ---
[INFO] Executing tasks

main:
    [mkdir] Created dir: <https://builds.apache.org/job/Hadoop-Yarn-trunk/ws/hadoop-yarn-project/hadoop-yarn/hadoop-yarn-client/target/test-dir>
[INFO] Executed tasks
[INFO] 
[INFO] --- hadoop-maven-plugins:3.0.0-SNAPSHOT:protoc (compile-protoc) @ hadoop-yarn-client
---
[INFO] 
[INFO] --- maven-resources-plugin:2.2:resources (default-resources) @ hadoop-yarn-client ---
[INFO] Using default encoding to copy filtered resources.
[INFO] 
[INFO] --- maven-compiler-plugin:2.5.1:compile (default-compile) @ hadoop-yarn-client ---
[INFO] Compiling 27 source files to <https://builds.apache.org/job/Hadoop-Yarn-trunk/ws/hadoop-yarn-project/hadoop-yarn/hadoop-yarn-client/target/classes>
[INFO] 
[INFO] --- maven-resources-plugin:2.2:testResources (default-testResources) @ hadoop-yarn-client
---
[INFO] Using default encoding to copy filtered resources.
[INFO] 
[INFO] --- maven-compiler-plugin:2.5.1:testCompile (default-testCompile) @ hadoop-yarn-client
---
[INFO] Compiling 21 source files to <https://builds.apache.org/job/Hadoop-Yarn-trunk/ws/hadoop-yarn-project/hadoop-yarn/hadoop-yarn-client/target/test-classes>
[INFO] 
[INFO] --- maven-surefire-plugin:2.16:test (default-test) @ hadoop-yarn-client ---
[INFO] Surefire report directory: <https://builds.apache.org/job/Hadoop-Yarn-trunk/ws/hadoop-yarn-project/hadoop-yarn/hadoop-yarn-client/target/surefire-reports>

-------------------------------------------------------
 T E S T S
-------------------------------------------------------

-------------------------------------------------------
 T E S T S
-------------------------------------------------------
Running org.apache.hadoop.yarn.client.TestApplicationClientProtocolOnHA
Tests run: 17, Failures: 0, Errors: 0, Skipped: 0, Time elapsed: 126.132 sec - in org.apache.hadoop.yarn.client.TestApplicationClientProtocolOnHA
Running org.apache.hadoop.yarn.client.TestResourceTrackerOnHA
Running org.apache.hadoop.yarn.client.api.impl.TestNMClient
Tests run: 2, Failures: 0, Errors: 0, Skipped: 0, Time elapsed: 72.2 sec - in org.apache.hadoop.yarn.client.api.impl.TestNMClient
Running org.apache.hadoop.yarn.client.api.impl.TestAMRMClient
Tests run: 9, Failures: 0, Errors: 0, Skipped: 0, Time elapsed: 51.237 sec - in org.apache.hadoop.yarn.client.api.impl.TestAMRMClient
Running org.apache.hadoop.yarn.client.api.impl.TestYarnClient
Tests run: 15, Failures: 0, Errors: 0, Skipped: 0, Time elapsed: 36.432 sec - in org.apache.hadoop.yarn.client.api.impl.TestYarnClient
Running org.apache.hadoop.yarn.client.api.impl.TestAHSClient
Tests run: 7, Failures: 0, Errors: 0, Skipped: 0, Time elapsed: 1.102 sec - in org.apache.hadoop.yarn.client.api.impl.TestAHSClient
Running org.apache.hadoop.yarn.client.api.impl.TestAMRMClientOnRMRestart
Tests run: 3, Failures: 0, Errors: 0, Skipped: 0, Time elapsed: 28.288 sec - in org.apache.hadoop.yarn.client.api.impl.TestAMRMClientOnRMRestart
Running org.apache.hadoop.yarn.client.api.impl.TestAMRMClientContainerRequest
Tests run: 5, Failures: 0, Errors: 0, Skipped: 0, Time elapsed: 1.842 sec - in org.apache.hadoop.yarn.client.api.impl.TestAMRMClientContainerRequest
Running org.apache.hadoop.yarn.client.api.async.impl.TestNMClientAsync
Tests run: 2, Failures: 0, Errors: 0, Skipped: 0, Time elapsed: 0.919 sec - in org.apache.hadoop.yarn.client.api.async.impl.TestNMClientAsync
Running org.apache.hadoop.yarn.client.api.async.impl.TestAMRMClientAsync
Tests run: 9, Failures: 0, Errors: 0, Skipped: 0, Time elapsed: 2.873 sec - in org.apache.hadoop.yarn.client.api.async.impl.TestAMRMClientAsync
Running org.apache.hadoop.yarn.client.TestApplicationMasterServiceOnHA
Tests run: 1, Failures: 0, Errors: 0, Skipped: 0, Time elapsed: 9.974 sec - in org.apache.hadoop.yarn.client.TestApplicationMasterServiceOnHA
Running org.apache.hadoop.yarn.client.TestGetGroups
Tests run: 6, Failures: 0, Errors: 0, Skipped: 0, Time elapsed: 2.884 sec - in org.apache.hadoop.yarn.client.TestGetGroups
Running org.apache.hadoop.yarn.client.TestYarnApiClasses
Tests run: 3, Failures: 0, Errors: 0, Skipped: 0, Time elapsed: 0.324 sec - in org.apache.hadoop.yarn.client.TestYarnApiClasses
Running org.apache.hadoop.yarn.client.TestResourceManagerAdministrationProtocolPBClientImpl
Tests run: 7, Failures: 0, Errors: 0, Skipped: 0, Time elapsed: 2.863 sec - in org.apache.hadoop.yarn.client.TestResourceManagerAdministrationProtocolPBClientImpl
Running org.apache.hadoop.yarn.client.TestRMFailover
Tests run: 5, Failures: 0, Errors: 0, Skipped: 0, Time elapsed: 41.046 sec - in org.apache.hadoop.yarn.client.TestRMFailover
Running org.apache.hadoop.yarn.client.TestRMAdminCLI
Tests run: 13, Failures: 0, Errors: 0, Skipped: 0, Time elapsed: 1.266 sec - in org.apache.hadoop.yarn.client.TestRMAdminCLI
Running org.apache.hadoop.yarn.client.cli.TestLogsCLI
Tests run: 4, Failures: 0, Errors: 0, Skipped: 0, Time elapsed: 0.944 sec - in org.apache.hadoop.yarn.client.cli.TestLogsCLI
Running org.apache.hadoop.yarn.client.cli.TestYarnCLI
Tests run: 19, Failures: 0, Errors: 0, Skipped: 0, Time elapsed: 1.773 sec - in org.apache.hadoop.yarn.client.cli.TestYarnCLI

Results :

Tests run: 127, Failures: 0, Errors: 0, Skipped: 0

[INFO] ------------------------------------------------------------------------
[INFO] Reactor Summary:
[INFO] 
[INFO] hadoop-yarn ....................................... SUCCESS [  3.006 s]
[INFO] hadoop-yarn-api ................................... SUCCESS [02:43 min]
[INFO] hadoop-yarn-common ................................ SUCCESS [02:14 min]
[INFO] hadoop-yarn-server ................................ SUCCESS [  0.081 s]
[INFO] hadoop-yarn-server-common ......................... SUCCESS [ 35.314 s]
[INFO] hadoop-yarn-server-nodemanager .................... SUCCESS [05:39 min]
[INFO] hadoop-yarn-server-web-proxy ...................... SUCCESS [ 16.960 s]
[INFO] hadoop-yarn-server-applicationhistoryservice ...... SUCCESS [02:18 min]
[INFO] hadoop-yarn-server-resourcemanager ................ SUCCESS [44:18 min]
[INFO] hadoop-yarn-server-tests .......................... SUCCESS [02:12 min]
[INFO] hadoop-yarn-client ................................ FAILURE [06:35 min]
[INFO] hadoop-yarn-server-sharedcachemanager ............. SKIPPED
[INFO] hadoop-yarn-applications .......................... SKIPPED
[INFO] hadoop-yarn-applications-distributedshell ......... SKIPPED
[INFO] hadoop-yarn-applications-unmanaged-am-launcher .... SKIPPED
[INFO] hadoop-yarn-site .................................. SKIPPED
[INFO] hadoop-yarn-registry .............................. SKIPPED
[INFO] hadoop-yarn-project ............................... SKIPPED
[INFO] ------------------------------------------------------------------------
[INFO] BUILD FAILURE
[INFO] ------------------------------------------------------------------------
[INFO] Total time: 01:06 h
[INFO] Finished at: 2014-10-16T11:39:40+00:00
[INFO] Final Memory: 85M/868M
[INFO] ------------------------------------------------------------------------
[ERROR] Failed to execute goal org.apache.maven.plugins:maven-surefire-plugin:2.16:test (default-test)
on project hadoop-yarn-client: ExecutionException; nested exception is java.util.concurrent.ExecutionException:
java.lang.RuntimeException: The forked VM terminated without saying properly goodbye. VM crash
or System.exit called ?
[ERROR] Command was/bin/sh -c cd <https://builds.apache.org/job/Hadoop-Yarn-trunk/ws/hadoop-yarn-project/hadoop-yarn/hadoop-yarn-client>
&& /home/jenkins/tools/java/jdk1.6.0_45-64/jre/bin/java -Xmx1024m -XX:+HeapDumpOnOutOfMemoryError
-jar <https://builds.apache.org/job/Hadoop-Yarn-trunk/ws/hadoop-yarn-project/hadoop-yarn/hadoop-yarn-client/target/surefire/surefirebooter5494483467603363483.jar>
<https://builds.apache.org/job/Hadoop-Yarn-trunk/ws/hadoop-yarn-project/hadoop-yarn/hadoop-yarn-client/target/surefire/surefire5012423316387977121tmp>
<https://builds.apache.org/job/Hadoop-Yarn-trunk/ws/hadoop-yarn-project/hadoop-yarn/hadoop-yarn-client/target/surefire/surefire_2441626317078964857844tmp>
[ERROR] -> [Help 1]
[ERROR] 
[ERROR] To see the full stack trace of the errors, re-run Maven with the -e switch.
[ERROR] Re-run Maven using the -X switch to enable full debug logging.
[ERROR] 
[ERROR] For more information about the errors and possible solutions, please read the following
articles:
[ERROR] [Help 1] http://cwiki.apache.org/confluence/display/MAVEN/MojoFailureException
[ERROR] 
[ERROR] After correcting the problems, you can resume the build with the command
[ERROR]   mvn <goals> -rf :hadoop-yarn-client
Build step 'Execute shell' marked build as failure
Archiving artifacts
Updating HDFS-7208
Updating YARN-2312
Updating HDFS-7185
Updating HDFS-5089
Updating YARN-2496
Updating MAPREDUCE-5970
Updating MAPREDUCE-5873
Updating HADOOP-11181
Updating YARN-2685

Mime
View raw message