hadoop-yarn-dev mailing list archives

Site index · List index
Message view « Date » · « Thread »
Top « Date » · « Thread »
From Apache Jenkins Server <jenk...@builds.apache.org>
Subject Failed: YARN-1198 PreCommit Build #5219
Date Wed, 01 Oct 2014 23:11:49 GMT
Jira: https://issues.apache.org/jira/browse/YARN-1198
Build: https://builds.apache.org/job/PreCommit-YARN-Build/5219/

###################################################################################
########################## LAST 60 LINES OF THE CONSOLE ###########################
[...truncated 40 lines...]
http://issues.apache.org/jira/secure/attachment/12672450/YARN-1198.10.patch
cp: cannot stat '/home/jenkins/buildSupport/lib/*': No such file or directory
The patch does not appear to apply with p0 to p2
PATCH APPLICATION FAILED




{color:red}-1 overall{color}.  Here are the results of testing the latest attachment 
  http://issues.apache.org/jira/secure/attachment/12672450/YARN-1198.10.patch
  against trunk revision 8dfe54f.

    {color:red}-1 patch{color}.  The patch command could not apply the patch.

Console output: https://builds.apache.org/job/PreCommit-YARN-Build/5219//console

This message is automatically generated.


======================================================================
======================================================================
    Adding comment to Jira.
======================================================================
======================================================================


Comment added.
0ff8d23e40d0c0deab50bfc5c6ca02458f79990e logged out


======================================================================
======================================================================
    Finished build.
======================================================================
======================================================================


Build step 'Execute shell' marked build as failure
Archiving artifacts
Sending artifact delta relative to PreCommit-YARN-Build #4749
ERROR: Failed to archive {patchprocess/patchJavacWarnings.txt=patchprocess/patchJavacWarnings.txt,
patchprocess/trunkJavacWarnings.txt=patchprocess/trunkJavacWarnings.txt, patchprocess/trunkJavadocWarnings.txt=patchprocess/trunkJavadocWarnings.txt}
due to internal error; falling back to full archiving
java.lang.IllegalStateException: checksum mismatch after transfer (6581801202181819975 vs.
2072449902); /x1/jenkins/jenkins-home/jobs/PreCommit-YARN-Build/builds/2014-10-01_23-11-07/archive/patchprocess/patchJavacWarnings.txt
may be corrupted
	at jsync.protocol.FileSequenceReader.read(FileSequenceReader.java:45)
	at com.cloudbees.jenkins.plugins.jsync.archiver.JSyncArtifactManager.remoteSync(JSyncArtifactManager.java:134)
	at com.cloudbees.jenkins.plugins.jsync.archiver.JSyncArtifactManager.archive(JSyncArtifactManager.java:67)
	at hudson.tasks.ArtifactArchiver.perform(ArtifactArchiver.java:140)
	at hudson.tasks.BuildStepMonitor$1.perform(BuildStepMonitor.java:20)
	at hudson.model.AbstractBuild$AbstractBuildExecution.perform(AbstractBuild.java:804)
	at hudson.model.AbstractBuild$AbstractBuildExecution.performAllBuildSteps(AbstractBuild.java:776)
	at hudson.model.Build$BuildExecution.post2(Build.java:183)
	at hudson.model.AbstractBuild$AbstractBuildExecution.post(AbstractBuild.java:725)
	at hudson.model.Run.execute(Run.java:1701)
	at hudson.model.FreeStyleBuild.run(FreeStyleBuild.java:43)
	at hudson.model.ResourceController.execute(ResourceController.java:88)
	at hudson.model.Executor.run(Executor.java:231)
[description-setter] Could not determine description.
Recording test results
Email was triggered for: Failure
Sending email for trigger: Failure



###################################################################################
############################## FAILED TESTS (if any) ##############################
No tests ran.
Mime
  • Unnamed multipart/mixed (inline, None, 0 bytes)
View raw message