hadoop-yarn-dev mailing list archives

Site index · List index
Message view « Date » · « Thread »
Top « Date » · « Thread »
From Apache Jenkins Server <jenk...@builds.apache.org>
Subject Build failed in Jenkins: Hadoop-Yarn-trunk #698
Date Thu, 02 Oct 2014 10:44:31 GMT
See <https://builds.apache.org/job/Hadoop-Yarn-trunk/698/changes>

Changes:

[aagarwal] HDFS-6921. Add LazyPersist flag to FileStatus. (Arpit Agarwal)

[aagarwal] HDFS-6924. Add new RAM_DISK storage type. (Arpit Agarwal)

[aagarwal] HDFS-6922. Add LazyPersist flag to INodeFile, save it in FsImage and edit logs.
(Arpit Agarwal)

[aagarwal] HDFS-6923. Propagate LazyPersist flag to DNs via DataTransferProtocol. (Arpit Agarwal)

[aagarwal] HDFS-6925. DataNode should attempt to place replicas on transient storage first
if lazyPersist flag is received. (Arpit Agarwal)

[aagarwal] HDFS-6926. DN support for saving replicas to persistent storage and evicting in-memory
replicas. (Arpit Agarwal)

[aagarwal] HDFS-6927. Initial unit tests for Lazy Persist files. (Arpit Agarwal)

[aagarwal] HDFS-6929. NN periodically unlinks lazy persist files with missing replicas from
namespace. (Arpit Agarwal)

[arp] HDFS-6928. 'hdfs put' command should accept lazyPersist flag for testing. (Arpit Agarwal)

[arp] HADOOP-10880. Move HTTP delegation tokens out of URL querystring to a header. (tucu)

[arp] Fixing CHANGES.txt, moving HADOOP-8815 to 2.6.0 release

[arp] Fix up CHANGES.txt for HDFS-6134, HADOOP-10150 and related JIRAs following merge to
branch-2

[arp] Fix typos in log messages. Contributed by Ray Chiang

[arp] HDFS-6960. Bugfix in LazyWriter, fix test case and some refactoring. (Arpit Agarwal)

[arp] HDFS-6931. Move lazily persisted replicas to finalized directory on DN startup. (Arpit
Agarwal)

[arp] HDFS-6950. Add Additional unit tests for HDFS-6581. (Contributed by Xiaoyu Yao)

[arp] HDFS-6930. Improve replica eviction from RAM disk. (Arpit Agarwal)

[arp] HDFS-6977. Delete all copies when a block is deleted from the block space. (Arpit Agarwal)

[arp] HDFS-6991. Notify NN of evicted block before deleting it from RAM disk. (Arpit Agarwal)

[arp] HDFS-6482. Fix CHANGES.txt in trunk

[arp] HDFS-6978. Directory scanner should correctly reconcile blocks on RAM disk. (Arpit Agarwal)

[arp] HDFS-7066. LazyWriter#evictBlocks misses a null check for replicaState. (Contributed
by Xiaoyu Yao)

[arp] HDFS-7064. Fix unit test failures in HDFS-6581 branch. (Contributed by Xiaoyu Yao)

[arp] HDFS-7079. Few more unit test fixes for HDFS-6581. (Arpit Agarwal)

[arp] HDFS-7080. Fix finalize and upgrade unit test failures. (Arpit Agarwal)

[arp] HDFS-7084. FsDatasetImpl#copyBlockFiles debug log can be improved. (Contributed by Xiaoyu
Yao)

[arp] HDFS-7091. Add forwarding constructor for INodeFile for existing callers. (Arpit Agarwal)

[arp] HDFS-7100. Make eviction scheme pluggable. (Arpit Agarwal)

[arp] HDFS-7108. Fix unit test failures in SimulatedFsDataset. (Arpit Agarwal)

[arp] HDFS-7071. Updated editsStored and editsStored.xml to bump layout version and add LazyPersist
flag. (Contributed by Xiaoyu Yao and Arpit Agarwal)

[arp] HDFS-7071. Undo accidental commit of binary file editsStored.

[arp] HDFS-6990. Add unit test for evict/delete RAM_DISK block with open handle. (Contributed
by Xiaoyu Yao)

[arp] HDFS-7143. Fix findbugs warnings in HDFS-6581 branch. (Contributed by Tsz Wo Nicholas
Sze)

[arp] HDFS-6932. Balancer and Mover tools should ignore replicas on RAM_DISK. (Contributed
by Xiaoyu Yao)

[arp] HDFS-7144. Fix findbugs warnings in RamDiskReplicaTracker. (Contributed by Tsz Wo Nicholas
Sze)

[arp] Fix test build break after merging from trunk

[arp] HDFS-7155. Bugfix in createLocatedFileStatus caused by bad merge. (Arpit Agarwal)

[arp] HDFS-7153. Add storagePolicy to NN edit log during file creation. (Arpit Agarwal)

[arp] HDFS-7159. Use block storage policy to set lazy persist preference. (Arpit Agarwal)

[arp] HDFS-7129. Metrics to track usage of memory for writes. (Contributed by Xiaoyu Yao)

[arp] HDFS-7171. Fix Jenkins failures in HDFS-6581 branch. (Arpit Agarwal)

[kihwal] HDFS-6754. TestNamenodeCapacityReport.testXceiverCount may sometimes fail due to
lack of retry. Contributed by Mit Desai.

[arp] HDFS-6581. Update CHANGES.txt in preparation for trunk merge

[vinodkv] YARN-1063. Augmented Hadoop common winutils to have the ability to create containers
as domain users. Contributed by Remus Rusanu.

[vinodkv] YARN-1972. Added a secure container-executor for Windows. Contributed by Remus Rusanu.

[wheat9] HDFS-7172. Test data files may be checked out of git with incorrect line endings,
causing test failures in TestHDFSCLI. Contributed by Chris Nauroth.

[wheat9] HDFS-7158. Reduce the memory usage of WebImageViewer. Contributed by Haohui Mai.

[wheat9] HDFS-6894. Add XDR parser method for each NFS response. Contributed by Brandon Li.

[cmccabe] HDFS-7176. The namenode usage message doesn't include "-rollingupgrade started"
(cmccabe)

[zjshen] YARN-2630. Prevented previous AM container status from being acquired by the current
restarted AM. Contributed by Jian He.

[wheat9] Addendum patch for HDFS-7172. Contributed by Chris Nauroth.

[junping_du] YARN-2613. Support retry in NMClient for rolling-upgrades. (Contributed by Jian
He)

[vinodkv] YARN-2446. Augmented Timeline service APIs to start taking in domains as a parameter
while posting entities and events. Contributed by Zhijie Shen.

------------------------------------------
[...truncated 6293 lines...]
     [exec] make[2]: Entering directory `<https://builds.apache.org/job/Hadoop-Yarn-trunk/ws/hadoop-yarn-project/hadoop-yarn/hadoop-yarn-server/hadoop-yarn-server-nodemanager/target/native'>
     [exec] cd <https://builds.apache.org/job/Hadoop-Yarn-trunk/ws/hadoop-yarn-project/hadoop-yarn/hadoop-yarn-server/hadoop-yarn-server-nodemanager/target/native>
&& /usr/bin/cmake -E cmake_depends "Unix Makefiles" <https://builds.apache.org/job/Hadoop-Yarn-trunk/ws/hadoop-yarn-project/hadoop-yarn/hadoop-yarn-server/hadoop-yarn-server-nodemanager/src>
<https://builds.apache.org/job/Hadoop-Yarn-trunk/ws/hadoop-yarn-project/hadoop-yarn/hadoop-yarn-server/hadoop-yarn-server-nodemanager/src>
<https://builds.apache.org/job/Hadoop-Yarn-trunk/ws/hadoop-yarn-project/hadoop-yarn/hadoop-yarn-server/hadoop-yarn-server-nodemanager/target/native>
<https://builds.apache.org/job/Hadoop-Yarn-trunk/ws/hadoop-yarn-project/hadoop-yarn/hadoop-yarn-server/hadoop-yarn-server-nodemanager/target/native>
<https://builds.apache.org/job/Hadoop-Yarn-trunk/ws/hadoop-yarn-project/hadoop-yarn/hadoop-yarn-server/hadoop-yarn-server-nodemanager/target/native/CMakeFiles/test-container-executor.dir/DependInfo.cmake>
--color=
     [exec] <https://builds.apache.org/job/Hadoop-Yarn-trunk/ws/hadoop-yarn-project/hadoop-yarn/hadoop-yarn-server/hadoop-yarn-server-nodemanager/src/main/native/container-executor/test/test-container-executor.c>:
In function 'main':
     [exec] <https://builds.apache.org/job/Hadoop-Yarn-trunk/ws/hadoop-yarn-project/hadoop-yarn/hadoop-yarn-server/hadoop-yarn-server-nodemanager/src/main/native/container-executor/test/test-container-executor.c>:796:10:
warning: ignoring return value of 'seteuid', declared with attribute warn_unused_result [-Wunused-result]
     [exec]    seteuid(0);
     [exec]           ^
     [exec] Dependee "<https://builds.apache.org/job/Hadoop-Yarn-trunk/ws/hadoop-yarn-project/hadoop-yarn/hadoop-yarn-server/hadoop-yarn-server-nodemanager/target/native/CMakeFiles/test-container-executor.dir/DependInfo.cmake">
is newer than depender "<https://builds.apache.org/job/Hadoop-Yarn-trunk/ws/hadoop-yarn-project/hadoop-yarn/hadoop-yarn-server/hadoop-yarn-server-nodemanager/target/native/CMakeFiles/test-container-executor.dir/depend.internal".>
     [exec] Dependee "<https://builds.apache.org/job/Hadoop-Yarn-trunk/ws/hadoop-yarn-project/hadoop-yarn/hadoop-yarn-server/hadoop-yarn-server-nodemanager/target/native/CMakeFiles/CMakeDirectoryInformation.cmake">
is newer than depender "<https://builds.apache.org/job/Hadoop-Yarn-trunk/ws/hadoop-yarn-project/hadoop-yarn/hadoop-yarn-server/hadoop-yarn-server-nodemanager/target/native/CMakeFiles/test-container-executor.dir/depend.internal".>
     [exec] Scanning dependencies of target test-container-executor
     [exec] make[2]: Leaving directory `<https://builds.apache.org/job/Hadoop-Yarn-trunk/ws/hadoop-yarn-project/hadoop-yarn/hadoop-yarn-server/hadoop-yarn-server-nodemanager/target/native'>
     [exec] make -f CMakeFiles/test-container-executor.dir/build.make CMakeFiles/test-container-executor.dir/build
     [exec] make[2]: Entering directory `<https://builds.apache.org/job/Hadoop-Yarn-trunk/ws/hadoop-yarn-project/hadoop-yarn/hadoop-yarn-server/hadoop-yarn-server-nodemanager/target/native'>
     [exec] /usr/bin/cmake -E cmake_progress_report <https://builds.apache.org/job/Hadoop-Yarn-trunk/ws/hadoop-yarn-project/hadoop-yarn/hadoop-yarn-server/hadoop-yarn-server-nodemanager/target/native/CMakeFiles>
4
     [exec] [100%] Building C object CMakeFiles/test-container-executor.dir/main/native/container-executor/test/test-container-executor.c.o
     [exec] /usr/bin/cc   -m32 -g -Wall -O2 -D_GNU_SOURCE -D_REENTRANT -I<https://builds.apache.org/job/Hadoop-Yarn-trunk/ws/hadoop-yarn-project/hadoop-yarn/hadoop-yarn-server/hadoop-yarn-server-nodemanager/src>
-I<https://builds.apache.org/job/Hadoop-Yarn-trunk/ws/hadoop-yarn-project/hadoop-yarn/hadoop-yarn-server/hadoop-yarn-server-nodemanager/target/native>
-I<https://builds.apache.org/job/Hadoop-Yarn-trunk/ws/hadoop-yarn-project/hadoop-yarn/hadoop-yarn-server/hadoop-yarn-server-nodemanager/src/main/native/container-executor>
-I<https://builds.apache.org/job/Hadoop-Yarn-trunk/ws/hadoop-yarn-project/hadoop-yarn/hadoop-yarn-server/hadoop-yarn-server-nodemanager/src/main/native/container-executor/impl>
   -o CMakeFiles/test-container-executor.dir/main/native/container-executor/test/test-container-executor.c.o
  -c <https://builds.apache.org/job/Hadoop-Yarn-trunk/ws/hadoop-yarn-project/hadoop-yarn/hadoop-yarn-server/hadoop-yarn-server-nodemanager/src/main/native/container-executor/test/test-container-executor.c>
     [exec] Linking C executable target/usr/local/bin/test-container-executor
     [exec] /usr/bin/cmake -E cmake_link_script CMakeFiles/test-container-executor.dir/link.txt
--verbose=1
     [exec] /usr/bin/cc   -m32 -g -Wall -O2 -D_GNU_SOURCE -D_REENTRANT    CMakeFiles/test-container-executor.dir/main/native/container-executor/test/test-container-executor.c.o
 -o target/usr/local/bin/test-container-executor -rdynamic libcontainer.a 
     [exec] make[2]: Leaving directory `<https://builds.apache.org/job/Hadoop-Yarn-trunk/ws/hadoop-yarn-project/hadoop-yarn/hadoop-yarn-server/hadoop-yarn-server-nodemanager/target/native'>
     [exec] /usr/bin/cmake -E cmake_progress_report <https://builds.apache.org/job/Hadoop-Yarn-trunk/ws/hadoop-yarn-project/hadoop-yarn/hadoop-yarn-server/hadoop-yarn-server-nodemanager/target/native/CMakeFiles>
 4
     [exec] [100%] Built target test-container-executor
     [exec] make[1]: Leaving directory `<https://builds.apache.org/job/Hadoop-Yarn-trunk/ws/hadoop-yarn-project/hadoop-yarn/hadoop-yarn-server/hadoop-yarn-server-nodemanager/target/native'>
     [exec] /usr/bin/cmake -E cmake_progress_start <https://builds.apache.org/job/Hadoop-Yarn-trunk/ws/hadoop-yarn-project/hadoop-yarn/hadoop-yarn-server/hadoop-yarn-server-nodemanager/target/native/CMakeFiles>
0
     [exec] [ 50%] Built target container
     [exec] [ 75%] Built target container-executor
     [exec] [100%] Built target test-container-executor
[INFO] Executed tasks
[INFO] 
[INFO] --- maven-resources-plugin:2.2:testResources (default-testResources) @ hadoop-yarn-server-nodemanager
---
[INFO] Using default encoding to copy filtered resources.
[INFO] 
[INFO] --- maven-compiler-plugin:2.5.1:testCompile (default-testCompile) @ hadoop-yarn-server-nodemanager
---
[INFO] Compiling 60 source files to <https://builds.apache.org/job/Hadoop-Yarn-trunk/ws/hadoop-yarn-project/hadoop-yarn/hadoop-yarn-server/hadoop-yarn-server-nodemanager/target/test-classes>
[INFO] 
[INFO] --- maven-surefire-plugin:2.16:test (default-test) @ hadoop-yarn-server-nodemanager
---
[INFO] Surefire report directory: <https://builds.apache.org/job/Hadoop-Yarn-trunk/ws/hadoop-yarn-project/hadoop-yarn/hadoop-yarn-server/hadoop-yarn-server-nodemanager/target/surefire-reports>

-------------------------------------------------------
 T E S T S
-------------------------------------------------------

-------------------------------------------------------
 T E S T S
-------------------------------------------------------
Running org.apache.hadoop.yarn.server.nodemanager.TestNodeManagerResync
Tests run: 5, Failures: 0, Errors: 0, Skipped: 0, Time elapsed: 20.878 sec - in org.apache.hadoop.yarn.server.nodemanager.TestNodeManagerResync
Running org.apache.hadoop.yarn.server.nodemanager.util.TestProcessIdFileReader
Tests run: 3, Failures: 0, Errors: 0, Skipped: 0, Time elapsed: 0.17 sec - in org.apache.hadoop.yarn.server.nodemanager.util.TestProcessIdFileReader
Running org.apache.hadoop.yarn.server.nodemanager.util.TestCgroupsLCEResourcesHandler
Tests run: 4, Failures: 0, Errors: 0, Skipped: 0, Time elapsed: 0.99 sec - in org.apache.hadoop.yarn.server.nodemanager.util.TestCgroupsLCEResourcesHandler
Running org.apache.hadoop.yarn.server.nodemanager.util.TestNodeManagerHardwareUtils
Tests run: 1, Failures: 0, Errors: 0, Skipped: 0, Time elapsed: 0.481 sec - in org.apache.hadoop.yarn.server.nodemanager.util.TestNodeManagerHardwareUtils
Running org.apache.hadoop.yarn.server.nodemanager.TestNodeStatusUpdater
Tests run: 13, Failures: 0, Errors: 0, Skipped: 0, Time elapsed: 65.511 sec - in org.apache.hadoop.yarn.server.nodemanager.TestNodeStatusUpdater
Running org.apache.hadoop.yarn.server.nodemanager.TestLinuxContainerExecutor
Tests run: 5, Failures: 0, Errors: 0, Skipped: 0, Time elapsed: 1.172 sec - in org.apache.hadoop.yarn.server.nodemanager.TestLinuxContainerExecutor
Running org.apache.hadoop.yarn.server.nodemanager.TestLinuxContainerExecutorWithMocks
Tests run: 8, Failures: 0, Errors: 0, Skipped: 0, Time elapsed: 1.046 sec - in org.apache.hadoop.yarn.server.nodemanager.TestLinuxContainerExecutorWithMocks
Running org.apache.hadoop.yarn.server.nodemanager.security.TestNMTokenSecretManagerInNM
Tests run: 1, Failures: 0, Errors: 0, Skipped: 0, Time elapsed: 1.447 sec - in org.apache.hadoop.yarn.server.nodemanager.security.TestNMTokenSecretManagerInNM
Running org.apache.hadoop.yarn.server.nodemanager.security.TestNMContainerTokenSecretManager
Tests run: 1, Failures: 0, Errors: 0, Skipped: 0, Time elapsed: 1.235 sec - in org.apache.hadoop.yarn.server.nodemanager.security.TestNMContainerTokenSecretManager
Running org.apache.hadoop.yarn.server.nodemanager.TestRecordFactory
Tests run: 1, Failures: 0, Errors: 0, Skipped: 0, Time elapsed: 0.181 sec - in org.apache.hadoop.yarn.server.nodemanager.TestRecordFactory
Running org.apache.hadoop.yarn.server.nodemanager.recovery.TestNMLeveldbStateStoreService
Tests run: 10, Failures: 0, Errors: 0, Skipped: 0, Time elapsed: 2.152 sec - in org.apache.hadoop.yarn.server.nodemanager.recovery.TestNMLeveldbStateStoreService
Running org.apache.hadoop.yarn.server.nodemanager.TestContainerManagerWithLCE
Tests run: 10, Failures: 0, Errors: 0, Skipped: 0, Time elapsed: 1.444 sec - in org.apache.hadoop.yarn.server.nodemanager.TestContainerManagerWithLCE
Running org.apache.hadoop.yarn.server.nodemanager.TestRPCFactories
Tests run: 1, Failures: 0, Errors: 0, Skipped: 0, Time elapsed: 0.694 sec - in org.apache.hadoop.yarn.server.nodemanager.TestRPCFactories
Running org.apache.hadoop.yarn.server.nodemanager.TestContainerExecutor
Tests run: 2, Failures: 0, Errors: 0, Skipped: 0, Time elapsed: 0.649 sec - in org.apache.hadoop.yarn.server.nodemanager.TestContainerExecutor
Running org.apache.hadoop.yarn.server.nodemanager.TestNodeManagerShutdown
Tests run: 2, Failures: 0, Errors: 0, Skipped: 0, Time elapsed: 5.945 sec - in org.apache.hadoop.yarn.server.nodemanager.TestNodeManagerShutdown
Running org.apache.hadoop.yarn.server.nodemanager.metrics.TestNodeManagerMetrics
Tests run: 1, Failures: 0, Errors: 0, Skipped: 0, Time elapsed: 0.566 sec - in org.apache.hadoop.yarn.server.nodemanager.metrics.TestNodeManagerMetrics
Running org.apache.hadoop.yarn.server.nodemanager.TestNodeManager
Tests run: 1, Failures: 0, Errors: 0, Skipped: 0, Time elapsed: 1.082 sec - in org.apache.hadoop.yarn.server.nodemanager.TestNodeManager
Running org.apache.hadoop.yarn.server.nodemanager.TestNodeManagerReboot
Tests run: 1, Failures: 0, Errors: 0, Skipped: 0, Time elapsed: 6.171 sec - in org.apache.hadoop.yarn.server.nodemanager.TestNodeManagerReboot
Running org.apache.hadoop.yarn.server.nodemanager.TestDefaultContainerExecutor
Tests run: 2, Failures: 0, Errors: 0, Skipped: 0, Time elapsed: 1.3 sec - in org.apache.hadoop.yarn.server.nodemanager.TestDefaultContainerExecutor
Running org.apache.hadoop.yarn.server.nodemanager.api.protocolrecords.impl.pb.TestPBLocalizerRPC
Tests run: 1, Failures: 0, Errors: 0, Skipped: 0, Time elapsed: 0.914 sec - in org.apache.hadoop.yarn.server.nodemanager.api.protocolrecords.impl.pb.TestPBLocalizerRPC
Running org.apache.hadoop.yarn.server.nodemanager.api.protocolrecords.impl.pb.TestPBRecordImpl
Tests run: 4, Failures: 0, Errors: 0, Skipped: 0, Time elapsed: 0.503 sec - in org.apache.hadoop.yarn.server.nodemanager.api.protocolrecords.impl.pb.TestPBRecordImpl
Running org.apache.hadoop.yarn.server.nodemanager.TestLocalDirsHandlerService
Tests run: 2, Failures: 0, Errors: 0, Skipped: 0, Time elapsed: 0.676 sec - in org.apache.hadoop.yarn.server.nodemanager.TestLocalDirsHandlerService
Running org.apache.hadoop.yarn.server.nodemanager.TestNodeHealthService
Tests run: 2, Failures: 0, Errors: 0, Skipped: 0, Time elapsed: 4.816 sec - in org.apache.hadoop.yarn.server.nodemanager.TestNodeHealthService
Running org.apache.hadoop.yarn.server.nodemanager.containermanager.container.TestContainer
Tests run: 18, Failures: 0, Errors: 0, Skipped: 0, Time elapsed: 1.87 sec - in org.apache.hadoop.yarn.server.nodemanager.containermanager.container.TestContainer
Running org.apache.hadoop.yarn.server.nodemanager.containermanager.TestNMProxy
Tests run: 1, Failures: 0, Errors: 0, Skipped: 0, Time elapsed: 3.445 sec - in org.apache.hadoop.yarn.server.nodemanager.containermanager.TestNMProxy
Running org.apache.hadoop.yarn.server.nodemanager.containermanager.logaggregation.TestLogAggregationService
Tests run: 11, Failures: 0, Errors: 0, Skipped: 0, Time elapsed: 7.149 sec - in org.apache.hadoop.yarn.server.nodemanager.containermanager.logaggregation.TestLogAggregationService
Running org.apache.hadoop.yarn.server.nodemanager.containermanager.TestContainerManager
Tests run: 10, Failures: 0, Errors: 0, Skipped: 0, Time elapsed: 23.184 sec - in org.apache.hadoop.yarn.server.nodemanager.containermanager.TestContainerManager
Running org.apache.hadoop.yarn.server.nodemanager.containermanager.monitor.TestContainersMonitor
Tests run: 3, Failures: 0, Errors: 0, Skipped: 0, Time elapsed: 7.154 sec - in org.apache.hadoop.yarn.server.nodemanager.containermanager.monitor.TestContainersMonitor
Running org.apache.hadoop.yarn.server.nodemanager.containermanager.loghandler.TestNonAggregatingLogHandler
Tests run: 4, Failures: 0, Errors: 0, Skipped: 0, Time elapsed: 11.083 sec - in org.apache.hadoop.yarn.server.nodemanager.containermanager.loghandler.TestNonAggregatingLogHandler
Running org.apache.hadoop.yarn.server.nodemanager.containermanager.TestAuxServices
Tests run: 6, Failures: 0, Errors: 0, Skipped: 0, Time elapsed: 0.841 sec - in org.apache.hadoop.yarn.server.nodemanager.containermanager.TestAuxServices
Running org.apache.hadoop.yarn.server.nodemanager.containermanager.TestContainerManagerRecovery
Tests run: 1, Failures: 0, Errors: 0, Skipped: 0, Time elapsed: 1.848 sec - in org.apache.hadoop.yarn.server.nodemanager.containermanager.TestContainerManagerRecovery
Running org.apache.hadoop.yarn.server.nodemanager.containermanager.launcher.TestContainerLaunch
Tests run: 15, Failures: 0, Errors: 0, Skipped: 4, Time elapsed: 16.36 sec - in org.apache.hadoop.yarn.server.nodemanager.containermanager.launcher.TestContainerLaunch
Running org.apache.hadoop.yarn.server.nodemanager.containermanager.localizer.TestLocalCacheDirectoryManager
Tests run: 5, Failures: 0, Errors: 0, Skipped: 0, Time elapsed: 0.795 sec - in org.apache.hadoop.yarn.server.nodemanager.containermanager.localizer.TestLocalCacheDirectoryManager
Running org.apache.hadoop.yarn.server.nodemanager.containermanager.localizer.TestContainerLocalizer
Tests run: 3, Failures: 0, Errors: 0, Skipped: 0, Time elapsed: 1.325 sec - in org.apache.hadoop.yarn.server.nodemanager.containermanager.localizer.TestContainerLocalizer
Running org.apache.hadoop.yarn.server.nodemanager.containermanager.localizer.TestLocalResourcesTrackerImpl
Tests run: 8, Failures: 0, Errors: 0, Skipped: 0, Time elapsed: 1.181 sec - in org.apache.hadoop.yarn.server.nodemanager.containermanager.localizer.TestLocalResourcesTrackerImpl
Running org.apache.hadoop.yarn.server.nodemanager.containermanager.localizer.TestLocalResource
Tests run: 2, Failures: 0, Errors: 0, Skipped: 0, Time elapsed: 0.323 sec - in org.apache.hadoop.yarn.server.nodemanager.containermanager.localizer.TestLocalResource
Running org.apache.hadoop.yarn.server.nodemanager.containermanager.localizer.TestResourceRetention
Tests run: 1, Failures: 0, Errors: 0, Skipped: 0, Time elapsed: 0.753 sec - in org.apache.hadoop.yarn.server.nodemanager.containermanager.localizer.TestResourceRetention
Running org.apache.hadoop.yarn.server.nodemanager.containermanager.localizer.TestLocalizedResource
Tests run: 1, Failures: 0, Errors: 0, Skipped: 0, Time elapsed: 0.554 sec - in org.apache.hadoop.yarn.server.nodemanager.containermanager.localizer.TestLocalizedResource
Running org.apache.hadoop.yarn.server.nodemanager.containermanager.localizer.TestResourceLocalizationService
Tests run: 9, Failures: 0, Errors: 0, Skipped: 0, Time elapsed: 3.799 sec - in org.apache.hadoop.yarn.server.nodemanager.containermanager.localizer.TestResourceLocalizationService
Running org.apache.hadoop.yarn.server.nodemanager.containermanager.application.TestApplication
Tests run: 8, Failures: 0, Errors: 0, Skipped: 0, Time elapsed: 5.471 sec - in org.apache.hadoop.yarn.server.nodemanager.containermanager.application.TestApplication
Running org.apache.hadoop.yarn.server.nodemanager.TestDirectoryCollection
Tests run: 5, Failures: 1, Errors: 0, Skipped: 0, Time elapsed: 0.607 sec <<< FAILURE!
- in org.apache.hadoop.yarn.server.nodemanager.TestDirectoryCollection
testCreateDirectories(org.apache.hadoop.yarn.server.nodemanager.TestDirectoryCollection) 
Time elapsed: 0.402 sec  <<< FAILURE!
java.lang.AssertionError: local dir parent not created with proper permissions expected:<rwxr-xr-x>
but was:<rwxrwxr-x>
	at org.junit.Assert.fail(Assert.java:88)
	at org.junit.Assert.failNotEquals(Assert.java:743)
	at org.junit.Assert.assertEquals(Assert.java:118)
	at org.apache.hadoop.yarn.server.nodemanager.TestDirectoryCollection.testCreateDirectories(TestDirectoryCollection.java:104)

Running org.apache.hadoop.yarn.server.nodemanager.TestNMAuditLogger
Tests run: 3, Failures: 0, Errors: 0, Skipped: 0, Time elapsed: 0.919 sec - in org.apache.hadoop.yarn.server.nodemanager.TestNMAuditLogger
Running org.apache.hadoop.yarn.server.nodemanager.TestDeletionService
Tests run: 6, Failures: 0, Errors: 0, Skipped: 0, Time elapsed: 23.132 sec - in org.apache.hadoop.yarn.server.nodemanager.TestDeletionService
Running org.apache.hadoop.yarn.server.nodemanager.TestEventFlow
Tests run: 1, Failures: 0, Errors: 0, Skipped: 0, Time elapsed: 5.685 sec - in org.apache.hadoop.yarn.server.nodemanager.TestEventFlow
Running org.apache.hadoop.yarn.server.nodemanager.webapp.TestNMWebServices
Tests run: 11, Failures: 0, Errors: 0, Skipped: 0, Time elapsed: 5.772 sec - in org.apache.hadoop.yarn.server.nodemanager.webapp.TestNMWebServices
Running org.apache.hadoop.yarn.server.nodemanager.webapp.TestNMWebServicesContainers
Tests run: 12, Failures: 0, Errors: 0, Skipped: 0, Time elapsed: 5.567 sec - in org.apache.hadoop.yarn.server.nodemanager.webapp.TestNMWebServicesContainers
Running org.apache.hadoop.yarn.server.nodemanager.webapp.TestContainerLogsPage
Tests run: 2, Failures: 0, Errors: 0, Skipped: 1, Time elapsed: 0.971 sec - in org.apache.hadoop.yarn.server.nodemanager.webapp.TestContainerLogsPage
Running org.apache.hadoop.yarn.server.nodemanager.webapp.TestNMWebServicesApps
Tests run: 19, Failures: 0, Errors: 0, Skipped: 0, Time elapsed: 7.15 sec - in org.apache.hadoop.yarn.server.nodemanager.webapp.TestNMWebServicesApps
Running org.apache.hadoop.yarn.server.nodemanager.webapp.TestNMWebServer
Tests run: 3, Failures: 0, Errors: 0, Skipped: 0, Time elapsed: 2.233 sec - in org.apache.hadoop.yarn.server.nodemanager.webapp.TestNMWebServer

Results :

Failed tests: 
  TestDirectoryCollection.testCreateDirectories:104 local dir parent not created with proper
permissions expected:<rwxr-xr-x> but was:<rwxrwxr-x>

Tests run: 249, Failures: 1, Errors: 0, Skipped: 5

[INFO] ------------------------------------------------------------------------
[INFO] Reactor Summary:
[INFO] 
[INFO] hadoop-yarn ....................................... SUCCESS [  2.802 s]
[INFO] hadoop-yarn-api ................................... SUCCESS [02:53 min]
[INFO] hadoop-yarn-common ................................ SUCCESS [02:12 min]
[INFO] hadoop-yarn-server ................................ SUCCESS [  0.077 s]
[INFO] hadoop-yarn-server-common ......................... SUCCESS [ 30.370 s]
[INFO] hadoop-yarn-server-nodemanager .................... FAILURE [04:37 min]
[INFO] hadoop-yarn-server-web-proxy ...................... SKIPPED
[INFO] hadoop-yarn-server-applicationhistoryservice ...... SKIPPED
[INFO] hadoop-yarn-server-resourcemanager ................ SKIPPED
[INFO] hadoop-yarn-server-tests .......................... SKIPPED
[INFO] hadoop-yarn-client ................................ SKIPPED
[INFO] hadoop-yarn-server-sharedcachemanager ............. SKIPPED
[INFO] hadoop-yarn-applications .......................... SKIPPED
[INFO] hadoop-yarn-applications-distributedshell ......... SKIPPED
[INFO] hadoop-yarn-applications-unmanaged-am-launcher .... SKIPPED
[INFO] hadoop-yarn-site .................................. SKIPPED
[INFO] hadoop-yarn-project ............................... SKIPPED
[INFO] ------------------------------------------------------------------------
[INFO] BUILD FAILURE
[INFO] ------------------------------------------------------------------------
[INFO] Total time: 10:17 min
[INFO] Finished at: 2014-10-02T10:43:21+00:00
[INFO] Final Memory: 49M/805M
[INFO] ------------------------------------------------------------------------
[ERROR] Failed to execute goal org.apache.maven.plugins:maven-surefire-plugin:2.16:test (default-test)
on project hadoop-yarn-server-nodemanager: There are test failures.
[ERROR] 
[ERROR] Please refer to <https://builds.apache.org/job/Hadoop-Yarn-trunk/ws/hadoop-yarn-project/hadoop-yarn/hadoop-yarn-server/hadoop-yarn-server-nodemanager/target/surefire-reports>
for the individual test results.
[ERROR] -> [Help 1]
[ERROR] 
[ERROR] To see the full stack trace of the errors, re-run Maven with the -e switch.
[ERROR] Re-run Maven using the -X switch to enable full debug logging.
[ERROR] 
[ERROR] For more information about the errors and possible solutions, please read the following
articles:
[ERROR] [Help 1] http://cwiki.apache.org/confluence/display/MAVEN/MojoFailureException
[ERROR] 
[ERROR] After correcting the problems, you can resume the build with the command
[ERROR]   mvn <goals> -rf :hadoop-yarn-server-nodemanager
Build step 'Execute shell' marked build as failure
Archiving artifacts
Updating HDFS-7100
Updating HDFS-6932
Updating HDFS-6931
Updating HDFS-6930
Updating HADOOP-10880
Updating HDFS-6978
Updating HADOOP-8815
Updating HDFS-6581
Updating HDFS-6482
Updating HDFS-7143
Updating HDFS-6977
Updating HDFS-7144
Updating HDFS-6922
Updating HADOOP-10150
Updating HDFS-6921
Updating HDFS-6924
Updating HDFS-6923
Updating HDFS-6926
Updating YARN-2613
Updating HDFS-6925
Updating HDFS-6928
Updating HDFS-6927
Updating YARN-2446
Updating HDFS-6929
Updating HDFS-6960
Updating HDFS-7155
Updating HDFS-7108
Updating HDFS-7153
Updating HDFS-6754
Updating HDFS-7091
Updating HDFS-7071
Updating YARN-1972
Updating HDFS-7079
Updating HDFS-7158
Updating HDFS-7159
Updating HDFS-6894
Updating HDFS-6950
Updating YARN-2630
Updating HDFS-7129
Updating HDFS-7080
Updating HDFS-6990
Updating HDFS-6991
Updating HDFS-7064
Updating HDFS-7084
Updating HDFS-7066
Updating YARN-1063
Updating HDFS-7176
Updating HDFS-7171
Updating HDFS-7172
Updating HDFS-6134

Mime
View raw message