hadoop-yarn-dev mailing list archives

Site index · List index
Message view « Date » · « Thread »
Top « Date » · « Thread »
From Apache Jenkins Server <jenk...@builds.apache.org>
Subject Hadoop-Yarn-trunk - Build # 696 - Still Failing
Date Tue, 30 Sep 2014 11:37:52 GMT
See https://builds.apache.org/job/Hadoop-Yarn-trunk/696/

###################################################################################
########################## LAST 60 LINES OF THE CONSOLE ###########################
[...truncated 8865 lines...]
[INFO] 
[INFO] hadoop-yarn ....................................... SUCCESS [  3.861 s]
[INFO] hadoop-yarn-api ................................... SUCCESS [02:20 min]
[INFO] hadoop-yarn-common ................................ SUCCESS [02:15 min]
[INFO] hadoop-yarn-server ................................ SUCCESS [  0.089 s]
[INFO] hadoop-yarn-server-common ......................... SUCCESS [ 39.774 s]
[INFO] hadoop-yarn-server-nodemanager .................... SUCCESS [05:13 min]
[INFO] hadoop-yarn-server-web-proxy ...................... SUCCESS [ 18.660 s]
[INFO] hadoop-yarn-server-applicationhistoryservice ...... SUCCESS [02:23 min]
[INFO] hadoop-yarn-server-resourcemanager ................ SUCCESS [36:04 min]
[INFO] hadoop-yarn-server-tests .......................... SUCCESS [02:12 min]
[INFO] hadoop-yarn-client ................................ SUCCESS [06:41 min]
[INFO] hadoop-yarn-applications .......................... SUCCESS [  0.052 s]
[INFO] hadoop-yarn-applications-distributedshell ......... FAILURE [05:14 min]
[INFO] hadoop-yarn-applications-unmanaged-am-launcher .... SKIPPED
[INFO] hadoop-yarn-site .................................. SKIPPED
[INFO] hadoop-yarn-project ............................... SKIPPED
[INFO] ------------------------------------------------------------------------
[INFO] BUILD FAILURE
[INFO] ------------------------------------------------------------------------
[INFO] Total time: 01:03 h
[INFO] Finished at: 2014-09-30T11:36:53+00:00
[INFO] Final Memory: 88M/888M
[INFO] ------------------------------------------------------------------------
[ERROR] Failed to execute goal org.apache.maven.plugins:maven-surefire-plugin:2.16:test (default-test)
on project hadoop-yarn-applications-distributedshell: There are test failures.
[ERROR] 
[ERROR] Please refer to /home/jenkins/jenkins-slave/workspace/Hadoop-Yarn-trunk/hadoop-yarn-project/hadoop-yarn/hadoop-yarn-applications/hadoop-yarn-applications-distributedshell/target/surefire-reports
for the individual test results.
[ERROR] -> [Help 1]
[ERROR] 
[ERROR] To see the full stack trace of the errors, re-run Maven with the -e switch.
[ERROR] Re-run Maven using the -X switch to enable full debug logging.
[ERROR] 
[ERROR] For more information about the errors and possible solutions, please read the following
articles:
[ERROR] [Help 1] http://cwiki.apache.org/confluence/display/MAVEN/MojoFailureException
[ERROR] 
[ERROR] After correcting the problems, you can resume the build with the command
[ERROR]   mvn <goals> -rf :hadoop-yarn-applications-distributedshell
Build step 'Execute shell' marked build as failure
Archiving artifacts
Updating HDFS-4165
Updating HDFS-6779
Updating HDFS-7124
Updating HADOOP-11110
Updating HADOOP-11130
Updating HADOOP-11084
Updating HDFS-4227
Updating HDFS-7157
Updating HADOOP-11153
Updating YARN-2606
Updating MAPREDUCE-6094
Updating MAPREDUCE-6072
Updating HDFS-7122
Updating HDFS-7104
Updating YARN-1769
Updating HADOOP-11049
Updating HDFS-6519
Sending e-mails to: yarn-dev@hadoop.apache.org
Email was triggered for: Failure
Sending email for trigger: Failure



###################################################################################
############################## FAILED TESTS (if any) ##############################
No tests ran.
Mime
  • Unnamed multipart/mixed (inline, None, 0 bytes)
View raw message